Hospital Service Area,Hospital County,Operating Certificate Number,Permanent Facility Id,Facility Name,Age Group,Zip Code - 3 digits,Gender,Race,Ethnicity,Length of Stay,Type of Admission,Patient Disposition,Discharge Year,CCS Diagnosis Code,CCS Diagnosis Description,CCS Procedure Code,CCS Procedure Description,APR DRG Code,APR DRG Description,APR MDC Code,APR MDC Description,APR Severity of Illness Code,APR Severity of Illness Description,APR Risk of Mortality,APR Medical Surgical Description,Payment Typology 1,Payment Typology 2,Payment Typology 3,Birth Weight,Abortion Edit Indicator,Emergency Department Indicator,Total Charges,Total Costs
New York City,Manhattan,7002024,001456,Mount Sinai Hospital,50 to 69,103,M,White,Not Span/Hispanic,4,Emergency,Home w/ Home Health Services,2017,235,Open wounds of head; neck; and trunk,020,OT INTRAOCULAR THER PRC,073,Eye procedures except orbit,02,Diseases and Disorders of the Eye,3,Major,Minor,Surgical,Medicare,Medicare,Self-Pay,,N,Y,46194.70,17491.27
New York City,Manhattan,7002024,001456,Mount Sinai Hospital,70 or Older,104,F,White,Not Span/Hispanic,15,Emergency,Hospice - Home,2017,088,Glaucoma,014,GLAUCOMA PROCEDURES,073,Eye procedures except orbit,02,Diseases and Disorders of the Eye,3,Major,Major,Surgical,Medicare,Blue Cross/Blue Shield,Self-Pay,,N,Y,116002.66,40619.56
New York City,Manhattan,7002001,001438,Bellevue Hospital Center,50 to 69,100,M,Other Race,Not Span/Hispanic,90,Emergency,Skilled Nursing Home,2017,091,Other eye disorders,019,OT THER PRCS EYELIDS,073,Eye procedures except orbit,02,Diseases and Disorders of the Eye,3,Major,Minor,Surgical,Medicaid,Medicaid,,,N,Y,434674.39,280255.44
New York City,Bronx,7000006,001169,Montefiore Medical Center - Henry & Lucy Moses Div,50 to 69,107,M,Black/African American,Not Span/Hispanic,5,Emergency,Home or Self Care,2017,090,Inflammation; infection of eye (except that caused by tuberculosis or sexually transmitteddisease),019,OT THER PRCS EYELIDS,073,Eye procedures except orbit,02,Diseases and Disorders of the Eye,2,Moderate,Moderate,Surgical,Medicare,Medicaid,,,N,Y,67810.35,13200.73
New York City,Manhattan,7002024,001456,Mount Sinai Hospital,70 or Older,100,M,Other Race,Not Span/Hispanic,2,Emergency,Home w/ Home Health Services,2017,087,Retinal detachments; defects; vascular occlusion; and retinopathy,014,GLAUCOMA PROCEDURES,073,Eye procedures except orbit,02,Diseases and Disorders of the Eye,2,Moderate,Minor,Surgical,Medicare,Medicare,Self-Pay,,N,Y,76389.21,32408.34
New York City,Manhattan,7002054,001464,New York Presbyterian Hospital - Columbia Presbyterian Center,18 to 29,114,F,Black/African American,Not Span/Hispanic,3,Emergency,Home or Self Care,2017,088,Glaucoma,014,GLAUCOMA PROCEDURES,073,Eye procedures except orbit,02,Diseases and Disorders of the Eye,3,Major,Moderate,Surgical,Medicare,Medicaid,Self-Pay,,N,Y,47329.70,14651.37
New York City,Manhattan,7002054,001464,New York Presbyterian Hospital - Columbia Presbyterian Center,30 to 49,112,F,Other Race,Not Span/Hispanic,3,Emergency,Home or Self Care,2017,090,Inflammation; infection of eye (except that caused by tuberculosis or sexually transmitteddisease),019,OT THER PRCS EYELIDS,073,Eye procedures except orbit,02,Diseases and Disorders of the Eye,2,Moderate,Minor,Surgical,Medicaid,Medicaid,Self-Pay,,N,Y,30246.08,7675.75
New York City,Bronx,7000002,001165,Jacobi Medical Center,0 to 17,104,F,White,Unknown,1,Emergency,Home or Self Care,2017,235,Open wounds of head; neck; and trunk,019,OT THER PRCS EYELIDS,073,Eye procedures except orbit,02,Diseases and Disorders of the Eye,1,Minor,Minor,Surgical,Medicaid,Medicaid,,,N,Y,14154.70,8358.05
New York City,Bronx,7000006,001169,Montefiore Medical Center - Henry & Lucy Moses Div,0 to 17,104,M,Other Race,Not Span/Hispanic,10,Emergency,Home or Self Care,2017,235,Open wounds of head; neck; and trunk,020,OT INTRAOCULAR THER PRC,073,Eye procedures except orbit,02,Diseases and Disorders of the Eye,1,Minor,Minor,Surgical,Medicaid,,,,N,Y,115719.35,30652.15
New York City,Bronx,7000008,001172,Lincoln Medical & Mental Health Center,30 to 49,104,F,Other Race,Spanish/Hispanic,3,Emergency,Home or Self Care,2017,235,Open wounds of head; neck; and trunk,019,OT THER PRCS EYELIDS,073,Eye procedures except orbit,02,Diseases and Disorders of the Eye,1,Minor,Minor,Surgical,Medicaid,,,,N,Y,24933.60,12956.30
New York City,Kings,7001016,001301,Kings County Hospital Center,30 to 49,112,F,Other Race,Spanish/Hispanic,23,Emergency,Home or Self Care,2017,088,Glaucoma,014,GLAUCOMA PROCEDURES,073,Eye procedures except orbit,02,Diseases and Disorders of the Eye,2,Moderate,Minor,Surgical,Medicaid,,,,N,Y,119826.50,72024.95
New York City,Kings,7001016,001301,Kings County Hospital Center,18 to 29,112,M,White,Not Span/Hispanic,2,Emergency,Home or Self Care,2017,087,Retinal detachments; defects; vascular occlusion; and retinopathy,019,OT THER PRCS EYELIDS,073,Eye procedures except orbit,02,Diseases and Disorders of the Eye,1,Minor,Minor,Surgical,Self-Pay,,,,N,Y,29677.59,17838.52
New York City,Kings,7001016,001301,Kings County Hospital Center,0 to 17,,F,Other Race,Not Span/Hispanic,1,Emergency,Home or Self Care,2017,087,Retinal detachments; defects; vascular occlusion; and retinopathy,019,OT THER PRCS EYELIDS,073,Eye procedures except orbit,02,Diseases and Disorders of the Eye,1,Minor,Minor,Surgical,Medicaid,Medicaid,,,N,Y,19207.50,11545.19
New York City,Kings,7001016,001301,Kings County Hospital Center,30 to 49,112,M,Black/African American,Not Span/Hispanic,1,Emergency,Home or Self Care,2017,091,Other eye disorders,013,CORNEAL TRANSPLANT,073,Eye procedures except orbit,02,Diseases and Disorders of the Eye,1,Minor,Minor,Surgical,Medicaid,Medicaid,,,N,N,17402.54,10460.27
New York City,Kings,7001016,001301,Kings County Hospital Center,50 to 69,,M,White,Spanish/Hispanic,1,Emergency,Home or Self Care,2017,087,Retinal detachments; defects; vascular occlusion; and retinopathy,015,LENS & CATARACT PRCS,073,Eye procedures except orbit,02,Diseases and Disorders of the Eye,1,Minor,Minor,Surgical,Medicaid,,,,N,Y,17573.87,10563.25
New York City,Kings,7001016,001301,Kings County Hospital Center,50 to 69,113,M,Other Race,Not Span/Hispanic,1,Emergency,Home or Self Care,2017,088,Glaucoma,019,OT THER PRCS EYELIDS,073,Eye procedures except orbit,02,Diseases and Disorders of the Eye,1,Minor,Minor,Surgical,Blue Cross/Blue Shield,,,,N,Y,20506.93,12326.24
New York City,Kings,7001016,001301,Kings County Hospital Center,50 to 69,,F,Other Race,Spanish/Hispanic,1,Emergency,Home or Self Care,2017,087,Retinal detachments; defects; vascular occlusion; and retinopathy,019,OT THER PRCS EYELIDS,073,Eye procedures except orbit,02,Diseases and Disorders of the Eye,1,Minor,Minor,Surgical,Medicaid,,,,N,Y,14685.24,8826.96
New York City,Manhattan,7002001,001438,Bellevue Hospital Center,30 to 49,100,F,Other Race,Spanish/Hispanic,1,Emergency,Home or Self Care,2017,087,Retinal detachments; defects; vascular occlusion; and retinopathy,020,OT INTRAOCULAR THER PRC,073,Eye procedures except orbit,02,Diseases and Disorders of the Eye,1,Minor,Minor,Surgical,Self-Pay,,,,N,Y,3180.28,2050.48
New York City,Manhattan,7002001,001438,Bellevue Hospital Center,0 to 17,104,M,Other Race,Not Span/Hispanic,1,Emergency,Home or Self Care,2017,086,Cataract,015,LENS & CATARACT PRCS,073,Eye procedures except orbit,02,Diseases and Disorders of the Eye,1,Minor,Minor,Surgical,Medicaid,Medicaid,,,N,N,6018.07,3880.14
New York City,Manhattan,7002002,001439,Mount Sinai Beth Israel,50 to 69,112,F,Black/African American,Spanish/Hispanic,4,Emergency,Home or Self Care,2017,091,Other eye disorders,018,DX PRCS ON EYE,073,Eye procedures except orbit,02,Diseases and Disorders of the Eye,3,Major,Minor,Surgical,Medicare,Miscellaneous/Other,Self-Pay,,N,Y,52322.52,11225.21
Long Island,Suffolk,5151001,000245,University Hospital,0 to 17,117,F,White,Not Span/Hispanic,3,Emergency,Home or Self Care,2017,041,Cancer; other and unspecified primary,018,DX PRCS ON EYE,073,Eye procedures except orbit,02,Diseases and Disorders of the Eye,2,Moderate,Minor,Surgical,Private Health Insurance,,,,N,Y,44837.62,14543.61
Long Island,Suffolk,5151001,000245,University Hospital,30 to 49,117,M,White,Not Span/Hispanic,2,Emergency,Home or Self Care,2017,088,Glaucoma,014,GLAUCOMA PROCEDURES,073,Eye procedures except orbit,02,Diseases and Disorders of the Eye,3,Major,Minor,Surgical,Medicare,Medicaid,,,N,Y,40848.22,14673.00
Long Island,Nassau,2951001,000550,Syosset Hospital,50 to 69,115,M,White,Not Span/Hispanic,2,Emergency,Home or Self Care,2017,087,Retinal detachments; defects; vascular occlusion; and retinopathy,020,OT INTRAOCULAR THER PRC,073,Eye procedures except orbit,02,Diseases and Disorders of the Eye,1,Minor,Minor,Surgical,Private Health Insurance,,,,N,Y,20561.00,3847.65
Finger Lakes,Monroe,2701005,000413,Strong Memorial Hospital,70 or Older,148,M,White,Not Span/Hispanic,3,Emergency,Home or Self Care,2017,090,Inflammation; infection of eye (except that caused by tuberculosis or sexually transmitteddisease),019,OT THER PRCS EYELIDS,073,Eye procedures except orbit,02,Diseases and Disorders of the Eye,1,Minor,Minor,Surgical,Federal/State/Local/VA,Medicare,Medicare,,N,Y,18689.74,9401.90
Capital/Adirond,Albany,0101000,000001,Albany Medical Center Hospital,0 to 17,121,F,White,Not Span/Hispanic,3,Urgent,Short-term Hospital,2017,087,Retinal detachments; defects; vascular occlusion; and retinopathy,016,REPAIR RETINAL TEAR,073,Eye procedures except orbit,02,Diseases and Disorders of the Eye,3,Major,Major,Surgical,Medicaid,,,,N,N,36241.03,9684.35
Capital/Adirond,Albany,0101000,000001,Albany Medical Center Hospital,50 to 69,125,M,Black/African American,Not Span/Hispanic,2,Emergency,Court/Law Enforcement,2017,088,Glaucoma,014,GLAUCOMA PROCEDURES,073,Eye procedures except orbit,02,Diseases and Disorders of the Eye,2,Moderate,Minor,Surgical,Department of Corrections,,,,N,Y,24828.59,7621.48
Capital/Adirond,Albany,0101000,000001,Albany Medical Center Hospital,30 to 49,129,M,Other Race,Spanish/Hispanic,1,Emergency,Court/Law Enforcement,2017,235,Open wounds of head; neck; and trunk,020,OT INTRAOCULAR THER PRC,073,Eye procedures except orbit,02,Diseases and Disorders of the Eye,2,Moderate,Minor,Surgical,Medicaid,,,,N,Y,11150.95,3574.35
Capital/Adirond,Albany,0101000,000001,Albany Medical Center Hospital,0 to 17,121,M,White,Not Span/Hispanic,1,Emergency,Home or Self Care,2017,235,Open wounds of head; neck; and trunk,019,OT THER PRCS EYELIDS,073,Eye procedures except orbit,02,Diseases and Disorders of the Eye,3,Major,Minor,Surgical,Medicaid,,,,N,Y,14529.86,5257.76
New York City,Manhattan,7002020,001453,Memorial Sloan Kettering Memorial Hospital,70 or Older,105,M,White,Not Span/Hispanic,4,Elective,Home or Self Care,2017,041,Cancer; other and unspecified primary,017,DES LES RETINA/CHOROID,073,Eye procedures except orbit,02,Diseases and Disorders of the Eye,1,Minor,Minor,Surgical,Medicare,Private Health Insurance,Medicare,,N,N,73810.23,33059.37
New York City,Manhattan,7002020,001453,Memorial Sloan Kettering Memorial Hospital,50 to 69,OOS,M,White,Not Span/Hispanic,3,Elective,Home or Self Care,2017,041,Cancer; other and unspecified primary,017,DES LES RETINA/CHOROID,073,Eye procedures except orbit,02,Diseases and Disorders of the Eye,1,Minor,Minor,Surgical,Blue Cross/Blue Shield,,,,N,N,67668.06,30053.49
New York City,Manhattan,7002020,001453,Memorial Sloan Kettering Memorial Hospital,30 to 49,OOS,M,White,Not Span/Hispanic,3,Elective,Home or Self Care,2017,041,Cancer; other and unspecified primary,021,OT EXTRAOCULAR MUSC/ORB,073,Eye procedures except orbit,02,Diseases and Disorders of the Eye,1,Minor,Minor,Surgical,Private Health Insurance,,,,N,N,64993.89,28645.04
New York City,Manhattan,7002020,001453,Memorial Sloan Kettering Memorial Hospital,50 to 69,105,F,White,Not Span/Hispanic,3,Elective,Home or Self Care,2017,041,Cancer; other and unspecified primary,018,DX PRCS ON EYE,073,Eye procedures except orbit,02,Diseases and Disorders of the Eye,1,Minor,Minor,Surgical,Private Health Insurance,Medicare,,,N,N,72635.57,30597.19
New York City,Manhattan,7002020,001453,Memorial Sloan Kettering Memorial Hospital,70 or Older,OOS,M,White,Not Span/Hispanic,3,Elective,Home or Self Care,2017,041,Cancer; other and unspecified primary,017,DES LES RETINA/CHOROID,073,Eye procedures except orbit,02,Diseases and Disorders of the Eye,2,Moderate,Moderate,Surgical,Medicare,Federal/State/Local/VA,Medicare,,N,N,62936.86,27474.51
New York City,Manhattan,7002020,001453,Memorial Sloan Kettering Memorial Hospital,70 or Older,OOS,F,White,Not Span/Hispanic,4,Elective,Home or Self Care,2017,041,Cancer; other and unspecified primary,017,DES LES RETINA/CHOROID,073,Eye procedures except orbit,02,Diseases and Disorders of the Eye,2,Moderate,Minor,Surgical,Miscellaneous/Other,,,,N,N,76239.56,34248.68
New York City,Manhattan,7002020,001453,Memorial Sloan Kettering Memorial Hospital,0 to 17,,F,White,Not Span/Hispanic,1,Emergency,Home or Self Care,2017,041,Cancer; other and unspecified primary,018,DX PRCS ON EYE,073,Eye procedures except orbit,02,Diseases and Disorders of the Eye,2,Moderate,Minor,Surgical,Medicaid,Medicaid,,,N,N,11328.10,6227.43
New York City,Manhattan,7002020,001453,Memorial Sloan Kettering Memorial Hospital,0 to 17,OOS,M,Other Race,Not Span/Hispanic,2,Elective,Home or Self Care,2017,041,Cancer; other and unspecified primary,211,THERAPEUTIC RADIOLOGY,073,Eye procedures except orbit,02,Diseases and Disorders of the Eye,1,Minor,Minor,Surgical,Miscellaneous/Other,,,,N,N,58348.82,28130.72
New York City,Manhattan,7002020,001453,Memorial Sloan Kettering Memorial Hospital,50 to 69,117,M,White,Not Span/Hispanic,4,Elective,Home or Self Care,2017,041,Cancer; other and unspecified primary,018,DX PRCS ON EYE,073,Eye procedures except orbit,02,Diseases and Disorders of the Eye,1,Minor,Minor,Surgical,Blue Cross/Blue Shield,,,,N,N,71916.40,32170.80
New York City,Manhattan,7002020,001453,Memorial Sloan Kettering Memorial Hospital,30 to 49,OOS,F,White,Not Span/Hispanic,3,Elective,Home or Self Care,2017,041,Cancer; other and unspecified primary,018,DX PRCS ON EYE,073,Eye procedures except orbit,02,Diseases and Disorders of the Eye,1,Minor,Minor,Surgical,Blue Cross/Blue Shield,,,,N,N,68867.92,30301.58
New York City,Manhattan,7002024,001456,Mount Sinai Hospital,70 or Older,117,M,White,Not Span/Hispanic,2,Emergency,Home or Self Care,2017,023,Other non-epithelial cancer of skin,019,OT THER PRCS EYELIDS,073,Eye procedures except orbit,02,Diseases and Disorders of the Eye,1,Minor,Minor,Surgical,Private Health Insurance,Medicare,Self-Pay,,N,Y,44267.29,15682.32
Western NY,Erie,1401005,000210,Erie County Medical Center,30 to 49,140,M,White,Not Span/Hispanic,16,Emergency,Home or Self Care,2017,235,Open wounds of head; neck; and trunk,019,OT THER PRCS EYELIDS,073,Eye procedures except orbit,02,Diseases and Disorders of the Eye,2,Moderate,Minor,Surgical,Medicare,,,,N,Y,60011.30,38133.32
Western NY,Erie,1401005,000210,Erie County Medical Center,70 or Older,140,M,White,Not Span/Hispanic,2,Emergency,Home or Self Care,2017,087,Retinal detachments; defects; vascular occlusion; and retinopathy,014,GLAUCOMA PROCEDURES,073,Eye procedures except orbit,02,Diseases and Disorders of the Eye,2,Moderate,Minor,Surgical,Medicare,Medicare,,,N,Y,15130.88,5937.57
New York City,Bronx,7000002,001165,Jacobi Medical Center,30 to 49,104,M,Other Race,Spanish/Hispanic,7,Emergency,Home or Self Care,2017,235,Open wounds of head; neck; and trunk,019,OT THER PRCS EYELIDS,073,Eye procedures except orbit,02,Diseases and Disorders of the Eye,2,Moderate,Minor,Surgical,Medicaid,,,,N,Y,46001.46,27162.90
New York City,Queens,7003001,001628,Flushing Hospital Medical Center,70 or Older,113,M,White,Not Span/Hispanic,9,Emergency,Skilled Nursing Home,2017,235,Open wounds of head; neck; and trunk,019,OT THER PRCS EYELIDS,073,Eye procedures except orbit,02,Diseases and Disorders of the Eye,2,Moderate,Moderate,Surgical,Medicaid,,,,N,Y,42628.54,21491.11
New York City,Bronx,7000002,001165,Jacobi Medical Center,30 to 49,104,M,Other Race,Spanish/Hispanic,4,Emergency,Left Against Medical Advice,2017,235,Open wounds of head; neck; and trunk,020,OT INTRAOCULAR THER PRC,073,Eye procedures except orbit,02,Diseases and Disorders of the Eye,2,Moderate,Minor,Surgical,Medicaid,Medicaid,,,N,Y,30758.81,18162.43
New York City,Bronx,7000006,001169,Montefiore Medical Center - Henry & Lucy Moses Div,0 to 17,100,M,Black/African American,Not Span/Hispanic,3,Emergency,Home or Self Care,2017,087,Retinal detachments; defects; vascular occlusion; and retinopathy,017,DES LES RETINA/CHOROID,073,Eye procedures except orbit,02,Diseases and Disorders of the Eye,2,Moderate,Minor,Surgical,Medicaid,,,,N,Y,44913.06,11843.27
New York City,Bronx,7000006,003058,Montefiore Med Center - Jack D Weiler Hosp of A Einstein College Div,70 or Older,104,F,White,Not Span/Hispanic,2,Emergency,Home or Self Care,2017,235,Open wounds of head; neck; and trunk,014,GLAUCOMA PROCEDURES,073,Eye procedures except orbit,02,Diseases and Disorders of the Eye,2,Moderate,Moderate,Surgical,Medicare,,,,N,Y,26590.74,4520.82
New York City,Kings,7001037,001320,University Hospital of Brooklyn,70 or Older,112,F,Black/African American,Not Span/Hispanic,2,Emergency,Home or Self Care,2017,088,Glaucoma,014,GLAUCOMA PROCEDURES,073,Eye procedures except orbit,02,Diseases and Disorders of the Eye,2,Moderate,Minor,Surgical,Medicare,Medicare,Self-Pay,,N,Y,23476.00,14557.69
New York City,Kings,7001037,001320,University Hospital of Brooklyn,70 or Older,112,M,Black/African American,Not Span/Hispanic,3,Emergency,Home or Self Care,2017,235,Open wounds of head; neck; and trunk,020,OT INTRAOCULAR THER PRC,073,Eye procedures except orbit,02,Diseases and Disorders of the Eye,2,Moderate,Moderate,Surgical,Medicare,Medicare,Medicaid,,N,Y,28282.00,20034.49
New York City,Manhattan,7002024,001456,Mount Sinai Hospital,70 or Older,100,F,Other Race,Not Span/Hispanic,4,Emergency,Skilled Nursing Home,2017,235,Open wounds of head; neck; and trunk,019,OT THER PRCS EYELIDS,073,Eye procedures except orbit,02,Diseases and Disorders of the Eye,2,Moderate,Major,Surgical,Medicare,Medicare,Medicaid,,N,Y,47677.31,16989.37
New York City,Manhattan,7002054,001458,New York Presbyterian Hospital - New York Weill Cornell Center,0 to 17,112,M,Black/African American,Not Span/Hispanic,1,Emergency,Home or Self Care,2017,087,Retinal detachments; defects; vascular occlusion; and retinopathy,226,OT DX RADIO & RELATED,073,Eye procedures except orbit,02,Diseases and Disorders of the Eye,1,Minor,Minor,Surgical,Medicaid,Medicaid,Self-Pay,,N,N,21131.83,7835.56
Long Island,Nassau,2950002,000528,Nassau University Medical Center,0 to 17,,M,Other Race,Not Span/Hispanic,1,Emergency,Home or Self Care,2017,087,Retinal detachments; defects; vascular occlusion; and retinopathy,020,OT INTRAOCULAR THER PRC,073,Eye procedures except orbit,02,Diseases and Disorders of the Eye,1,Minor,Minor,Surgical,Medicaid,Self-Pay,,,N,N,14743.30,12175.00
Long Island,Nassau,2950002,000528,Nassau University Medical Center,50 to 69,115,M,Black/African American,Not Span/Hispanic,1,Emergency,Home or Self Care,2017,091,Other eye disorders,020,OT INTRAOCULAR THER PRC,073,Eye procedures except orbit,02,Diseases and Disorders of the Eye,1,Minor,Minor,Surgical,Medicare,Medicaid,Self-Pay,,N,Y,14469.06,9570.87
New York City,Bronx,7000008,001172,Lincoln Medical & Mental Health Center,30 to 49,100,M,Black/African American,Not Span/Hispanic,1,Emergency,Home or Self Care,2017,235,Open wounds of head; neck; and trunk,019,OT THER PRCS EYELIDS,073,Eye procedures except orbit,02,Diseases and Disorders of the Eye,1,Minor,Minor,Surgical,Private Health Insurance,,,,N,Y,9398.80,4883.92
New York City,Bronx,7000008,001172,Lincoln Medical & Mental Health Center,30 to 49,104,F,Other Race,Spanish/Hispanic,2,Emergency,Home or Self Care,2017,090,Inflammation; infection of eye (except that caused by tuberculosis or sexually transmitteddisease),019,OT THER PRCS EYELIDS,073,Eye procedures except orbit,02,Diseases and Disorders of the Eye,1,Minor,Minor,Surgical,Medicaid,,,,N,Y,13573.61,7053.28
New York City,Kings,7001016,001301,Kings County Hospital Center,50 to 69,112,M,Other Race,Not Span/Hispanic,2,Emergency,Home or Self Care,2017,087,Retinal detachments; defects; vascular occlusion; and retinopathy,020,OT INTRAOCULAR THER PRC,073,Eye procedures except orbit,02,Diseases and Disorders of the Eye,1,Minor,Minor,Surgical,Self-Pay,,,,N,Y,17913.11,10767.16
New York City,Kings,7001016,001301,Kings County Hospital Center,70 or Older,112,F,Black/African American,Not Span/Hispanic,1,Emergency,Home or Self Care,2017,088,Glaucoma,014,GLAUCOMA PROCEDURES,073,Eye procedures except orbit,02,Diseases and Disorders of the Eye,1,Minor,Minor,Surgical,Medicare,Medicaid,,,N,Y,23614.57,14194.17
New York City,Kings,7001016,001301,Kings County Hospital Center,70 or Older,112,M,Black/African American,Not Span/Hispanic,1,Emergency,Home or Self Care,2017,087,Retinal detachments; defects; vascular occlusion; and retinopathy,019,OT THER PRCS EYELIDS,073,Eye procedures except orbit,02,Diseases and Disorders of the Eye,1,Minor,Minor,Surgical,Medicare,,,,N,Y,7599.12,4567.66
New York City,Kings,7001016,001301,Kings County Hospital Center,18 to 29,112,M,White,Not Span/Hispanic,1,Emergency,Home or Self Care,2017,088,Glaucoma,015,LENS & CATARACT PRCS,073,Eye procedures except orbit,02,Diseases and Disorders of the Eye,1,Minor,Minor,Surgical,Self-Pay,,,,N,Y,16027.10,9633.52
New York City,Kings,7001016,001301,Kings County Hospital Center,0 to 17,112,M,Other Race,Not Span/Hispanic,1,Emergency,Home or Self Care,2017,235,Open wounds of head; neck; and trunk,019,OT THER PRCS EYELIDS,073,Eye procedures except orbit,02,Diseases and Disorders of the Eye,1,Minor,Minor,Surgical,Medicaid,,,,N,Y,14083.81,8465.45
New York City,Manhattan,7002001,001438,Bellevue Hospital Center,30 to 49,113,M,Other Race,Not Span/Hispanic,2,Emergency,Home or Self Care,2017,091,Other eye disorders,019,OT THER PRCS EYELIDS,073,Eye procedures except orbit,02,Diseases and Disorders of the Eye,1,Minor,Minor,Surgical,Department of Corrections,,,,N,N,12534.33,8081.48
New York City,Manhattan,7002001,001438,Bellevue Hospital Center,50 to 69,104,M,Black/African American,Not Span/Hispanic,2,Emergency,Home or Self Care,2017,091,Other eye disorders,013,CORNEAL TRANSPLANT,073,Eye procedures except orbit,02,Diseases and Disorders of the Eye,2,Moderate,Minor,Surgical,Medicaid,Medicaid,,,N,Y,13585.86,8759.46
New York City,Manhattan,7002001,001438,Bellevue Hospital Center,18 to 29,114,F,Other Race,Not Span/Hispanic,1,Emergency,Home or Self Care,2017,217,Other congenital anomalies,019,OT THER PRCS EYELIDS,073,Eye procedures except orbit,02,Diseases and Disorders of the Eye,2,Moderate,Minor,Surgical,Medicaid,Medicaid,,,N,N,5918.69,3816.06
New York City,Manhattan,7002001,001438,Bellevue Hospital Center,70 or Older,100,F,Black/African American,Not Span/Hispanic,2,Emergency,Home or Self Care,2017,086,Cataract,020,OT INTRAOCULAR THER PRC,073,Eye procedures except orbit,02,Diseases and Disorders of the Eye,2,Moderate,Minor,Surgical,Medicare,Medicaid,,,N,Y,16138.02,10404.96
New York City,Manhattan,7002001,001438,Bellevue Hospital Center,50 to 69,103,F,Other Race,Not Span/Hispanic,1,Emergency,Home or Self Care,2017,235,Open wounds of head; neck; and trunk,020,OT INTRAOCULAR THER PRC,073,Eye procedures except orbit,02,Diseases and Disorders of the Eye,2,Moderate,Minor,Surgical,Medicare,Medicare,Medicaid,,N,Y,7224.42,4657.93
New York City,Manhattan,7002032,001469,Mount Sinai St. Luke's,70 or Older,100,M,White,Not Span/Hispanic,2,Emergency,Home or Self Care,2017,239,Superficial injury; contusion,019,OT THER PRCS EYELIDS,073,Eye procedures except orbit,02,Diseases and Disorders of the Eye,2,Moderate,Minor,Surgical,Blue Cross/Blue Shield,Self-Pay,,,N,Y,37770.84,9916.49