Hospital Service Area,Hospital County,Operating Certificate Number,Permanent Facility Id,Facility Name,Age Group,Zip Code - 3 digits,Gender,Race,Ethnicity,Length of Stay,Type of Admission,Patient Disposition,Discharge Year,CCS Diagnosis Code,CCS Diagnosis Description,CCS Procedure Code,CCS Procedure Description,APR DRG Code,APR DRG Description,APR MDC Code,APR MDC Description,APR Severity of Illness Code,APR Severity of Illness Description,APR Risk of Mortality,APR Medical Surgical Description,Payment Typology 1,Payment Typology 2,Payment Typology 3,Birth Weight,Abortion Edit Indicator,Emergency Department Indicator,Total Charges,Total Costs
New York City,Manhattan,7002001,001438,Bellevue Hospital Center,18 to 29,104,M,Other Race,Not Span/Hispanic,5,Emergency,Home or Self Care,2018,INJ001,"FRACTURE OF HEAD AND NECK, INITIAL ENCOUNTER",MST012,BONE FIXATION (EXCLUDING EXTREMITIES),073,ORBIT AND EYE PROCEDURES,02,DISEASES AND DISORDERS OF THE EYE,1,Minor,Minor,Surgical,Medicaid,Medicaid,,,,true,29777.75,19790.29
Long Island,Suffolk,5154001,000925,Good Samaritan Hospital Medical Center,50 to 69,117,M,Black/African American,Not Span/Hispanic,2,Emergency,Home w/ Home Health Services,2018,INJ011,"OPEN WOUNDS OF HEAD AND NECK, INITIAL ENCOUNTER",SKB008,SKIN EXCISION AND DEBRIDEMENT,073,ORBIT AND EYE PROCEDURES,02,DISEASES AND DISORDERS OF THE EYE,1,Minor,Minor,Surgical,Medicare,Medicare,Medicaid,,,true,34229.5,6214.77
Long Island,Nassau,2953000,000563,St. Francis Hospital & Heart Center,30 to 49,113,F,White,Not Span/Hispanic,10,Emergency,Home or Self Care,2018,EYE005,RETINAL AND VITREOUS CONDITIONS,EYP001,EYE PROCEDURES,073,ORBIT AND EYE PROCEDURES,02,DISEASES AND DISORDERS OF THE EYE,4,Extreme,Moderate,Surgical,Blue Cross/Blue Shield,,,,,true,184389,31717.32
New York City,Manhattan,7002009,001445,Harlem Hospital Center,50 to 69,104,M,Black/African American,Not Span/Hispanic,13,Emergency,Home or Self Care,2018,EYE004,UVEITIS AND OCULAR INFLAMMATION,EYP001,EYE PROCEDURES,073,ORBIT AND EYE PROCEDURES,02,DISEASES AND DISORDERS OF THE EYE,2,Moderate,Minor,Surgical,Self-Pay,,,,,true,70770.32,52591.62
Hudson Valley,Westchester,5957001,001139,Westchester Medical Center,70 or Older,108,M,White,Not Span/Hispanic,4,Emergency,Home or Self Care,2018,EYE001,CORNEA AND EXTERNAL DISEASE,EYP001,EYE PROCEDURES,073,ORBIT AND EYE PROCEDURES,02,DISEASES AND DISORDERS OF THE EYE,1,Minor,Minor,Surgical,Private Health Insurance,Medicare,,,,true,89095.11,16541.77
New York City,Richmond,7004003,001737,Staten Island University Hospital Prince's Bay,50 to 69,104,M,Black/African American,Not Span/Hispanic,1,Emergency,Home or Self Care,2018,INJ011,"OPEN WOUNDS OF HEAD AND NECK, INITIAL ENCOUNTER",ENT013,ENT REPAIR,073,ORBIT AND EYE PROCEDURES,02,DISEASES AND DISORDERS OF THE EYE,1,Minor,Minor,Surgical,Miscellaneous/Other,Private Health Insurance,,,,true,17228.5,5017.78
New York City,Kings,7001016,001301,Kings County Hospital Center,50 to 69,112,M,Other Race,Not Span/Hispanic,1,Emergency,Home or Self Care,2018,INJ011,"OPEN WOUNDS OF HEAD AND NECK, INITIAL ENCOUNTER",ADM021,"ADMINISTRATION OF THERAPEUTIC SUBSTANCES, NEC",073,ORBIT AND EYE PROCEDURES,02,DISEASES AND DISORDERS OF THE EYE,2,Moderate,Minor,Surgical,Medicaid,Medicaid,,,,true,17469.22,12409.45
Capital/Adirond,Albany,0101000,000001,Albany Medical Center Hospital,70 or Older,120,M,White,Not Span/Hispanic,7,Trauma,Skilled Nursing Home,2018,INJ011,"OPEN WOUNDS OF HEAD AND NECK, INITIAL ENCOUNTER",EYP001,EYE PROCEDURES,073,ORBIT AND EYE PROCEDURES,02,DISEASES AND DISORDERS OF THE EYE,2,Moderate,Minor,Surgical,Medicare,,,,,true,40830.3,15193.9
Long Island,Suffolk,5154000,000924,South Shore University Hospital,18 to 29,117,M,Other Race,Not Span/Hispanic,3,Emergency,Home or Self Care,2018,INJ001,"FRACTURE OF HEAD AND NECK, INITIAL ENCOUNTER",MST012,BONE FIXATION (EXCLUDING EXTREMITIES),073,ORBIT AND EYE PROCEDURES,02,DISEASES AND DISORDERS OF THE EYE,2,Moderate,Minor,Surgical,Medicaid,Medicaid,,,,true,44169.05,11709.57
New York City,Bronx,7000008,001172,Lincoln Medical & Mental Health Center,50 to 69,100,M,Black/African American,Not Span/Hispanic,5,Emergency,Home or Self Care,2018,INJ001,"FRACTURE OF HEAD AND NECK, INITIAL ENCOUNTER",MST029,"MUSCULOSKELETAL DEVICE PROCEDURES, NEC",073,ORBIT AND EYE PROCEDURES,02,DISEASES AND DISORDERS OF THE EYE,2,Moderate,Minor,Surgical,Medicare,Private Health Insurance,,,,true,35573.45,21008.15
Hudson Valley,Westchester,5957001,001139,Westchester Medical Center,0 to 17,105,M,Other Race,Unknown,1,Emergency,Home or Self Care,2018,INJ001,"FRACTURE OF HEAD AND NECK, INITIAL ENCOUNTER",MST030,"MUSCULOSKELETAL PROCEDURES, NEC",073,ORBIT AND EYE PROCEDURES,02,DISEASES AND DISORDERS OF THE EYE,2,Moderate,Minor,Surgical,Medicaid,Medicaid,,,,true,54700.14,8634.84
New York City,Queens,7003003,001629,Jamaica Hospital Medical Center,30 to 49,114,M,Other Race,Not Span/Hispanic,2,Emergency,Home or Self Care,2018,INJ001,"FRACTURE OF HEAD AND NECK, INITIAL ENCOUNTER",MST012,BONE FIXATION (EXCLUDING EXTREMITIES),073,ORBIT AND EYE PROCEDURES,02,DISEASES AND DISORDERS OF THE EYE,2,Moderate,Minor,Surgical,Miscellaneous/Other,,,,,true,25772.22,12491.31
New York City,Queens,7003000,001626,Elmhurst Hospital Center,50 to 69,113,M,Other Race,Not Span/Hispanic,1,Emergency,Home or Self Care,2018,INJ001,"FRACTURE OF HEAD AND NECK, INITIAL ENCOUNTER",EYP001,EYE PROCEDURES,073,ORBIT AND EYE PROCEDURES,02,DISEASES AND DISORDERS OF THE EYE,2,Moderate,Minor,Surgical,Medicare,Medicare,Medicaid,,,true,11355.45,6756.11
Long Island,Suffolk,5154001,000925,Good Samaritan Hospital Medical Center,50 to 69,117,M,Other Race,Spanish/Hispanic,2,Emergency,Home or Self Care,2018,INJ001,"FRACTURE OF HEAD AND NECK, INITIAL ENCOUNTER",MST012,BONE FIXATION (EXCLUDING EXTREMITIES),073,ORBIT AND EYE PROCEDURES,02,DISEASES AND DISORDERS OF THE EYE,2,Moderate,Minor,Surgical,Medicare,Medicare,Private Health Insurance,,,true,41110.14,7875.13
Capital/Adirond,Albany,0101000,000001,Albany Medical Center Hospital,70 or Older,138,F,White,Not Span/Hispanic,2,Emergency,Skilled Nursing Home,2018,EYE001,CORNEA AND EXTERNAL DISEASE,EYP001,EYE PROCEDURES,073,ORBIT AND EYE PROCEDURES,02,DISEASES AND DISORDERS OF THE EYE,3,Major,Moderate,Surgical,Medicare,,,,,true,38280.18,15411.71
Long Island,Suffolk,5154001,000925,Good Samaritan Hospital Medical Center,50 to 69,117,M,White,Not Span/Hispanic,4,Emergency,Home or Self Care,2018,INJ001,"FRACTURE OF HEAD AND NECK, INITIAL ENCOUNTER",CNS014,"CNS PROCEDURES, NEC",073,ORBIT AND EYE PROCEDURES,02,DISEASES AND DISORDERS OF THE EYE,2,Moderate,Minor,Surgical,Blue Cross/Blue Shield,,,,,true,67304.33,11993.78
New York City,Manhattan,7002054,001464,New York-Presbyterian Hospital - Columbia Presbyterian Center,50 to 69,105,M,White,Not Span/Hispanic,3,Urgent,Home or Self Care,2018,NEO001,HEAD AND NECK CANCERS - EYE,RAD004,"RADIATION THERAPY, NEC",073,ORBIT AND EYE PROCEDURES,02,DISEASES AND DISORDERS OF THE EYE,1,Minor,Minor,Surgical,Private Health Insurance,Self-Pay,,,,false,79728.81,21253.36
New York City,Kings,7001045,001692,Woodhull Medical & Mental Health Center,30 to 49,112,M,Black/African American,Not Span/Hispanic,3,Emergency,Home or Self Care,2018,INJ001,"FRACTURE OF HEAD AND NECK, INITIAL ENCOUNTER",MST012,BONE FIXATION (EXCLUDING EXTREMITIES),073,ORBIT AND EYE PROCEDURES,02,DISEASES AND DISORDERS OF THE EYE,2,Moderate,Minor,Surgical,Medicaid,Medicaid,,,,true,33371.83,26056.16
New York City,Manhattan,7002021,001454,Metropolitan Hospital Center,0 to 17,100,M,Other Race,Not Span/Hispanic,1,Emergency,Home or Self Care,2018,INJ001,"FRACTURE OF HEAD AND NECK, INITIAL ENCOUNTER",MST012,BONE FIXATION (EXCLUDING EXTREMITIES),073,ORBIT AND EYE PROCEDURES,02,DISEASES AND DISORDERS OF THE EYE,1,Minor,Minor,Surgical,Medicaid,Medicaid,,,,true,9708.98,7844.37
New York City,Kings,7001016,001301,Kings County Hospital Center,30 to 49,112,M,White,Not Span/Hispanic,1,Emergency,Home or Self Care,2018,EYE005,RETINAL AND VITREOUS CONDITIONS,EYP001,EYE PROCEDURES,073,ORBIT AND EYE PROCEDURES,02,DISEASES AND DISORDERS OF THE EYE,2,Moderate,Minor,Surgical,Medicaid,Medicaid,,,,true,7121.3,5058.69
New York City,Manhattan,7002001,001438,Bellevue Hospital Center,50 to 69,112,M,White,Not Span/Hispanic,1,Emergency,Home or Self Care,2018,EYE005,RETINAL AND VITREOUS CONDITIONS,EYP001,EYE PROCEDURES,073,ORBIT AND EYE PROCEDURES,02,DISEASES AND DISORDERS OF THE EYE,1,Minor,Minor,Surgical,Self-Pay,,,,,false,2520,1674.79
Finger Lakes,Monroe,2701005,000413,Strong Memorial Hospital,0 to 17,146,M,White,Not Span/Hispanic,1,Emergency,Home or Self Care,2018,INJ011,"OPEN WOUNDS OF HEAD AND NECK, INITIAL ENCOUNTER",EYP002,EYELID PROCEDURES,073,ORBIT AND EYE PROCEDURES,02,DISEASES AND DISORDERS OF THE EYE,1,Minor,Minor,Surgical,Blue Cross/Blue Shield,,,,,true,9924.14,4644.18
Finger Lakes,Monroe,2701005,000413,Strong Memorial Hospital,18 to 29,146,F,Black/African American,Not Span/Hispanic,1,Emergency,Home or Self Care,2018,INJ001,"FRACTURE OF HEAD AND NECK, INITIAL ENCOUNTER",MST012,BONE FIXATION (EXCLUDING EXTREMITIES),073,ORBIT AND EYE PROCEDURES,02,DISEASES AND DISORDERS OF THE EYE,1,Minor,Minor,Surgical,Self-Pay,,,,,true,17246.3,7969.17
Capital/Adirond,Albany,0101000,000001,Albany Medical Center Hospital,0 to 17,121,M,Other Race,Unknown,1,Emergency,Home or Self Care,2018,EYE004,UVEITIS AND OCULAR INFLAMMATION,EYP001,EYE PROCEDURES,073,ORBIT AND EYE PROCEDURES,02,DISEASES AND DISORDERS OF THE EYE,2,Moderate,Minor,Surgical,"Managed Care, Unspecified",,,,,true,22114.87,6494.24
New York City,Manhattan,7002054,001464,New York-Presbyterian Hospital - Columbia Presbyterian Center,30 to 49,OOS,F,White,Not Span/Hispanic,3,Urgent,Home or Self Care,2018,NEO001,HEAD AND NECK CANCERS - EYE,RAD004,"RADIATION THERAPY, NEC",073,ORBIT AND EYE PROCEDURES,02,DISEASES AND DISORDERS OF THE EYE,1,Minor,Minor,Surgical,Private Health Insurance,Self-Pay,,,,false,73371.39,18425.83
New York City,Kings,7001016,001301,Kings County Hospital Center,30 to 49,,M,Other Race,Not Span/Hispanic,1,Emergency,Home or Self Care,2018,EYE003,GLAUCOMA,EYP001,EYE PROCEDURES,073,ORBIT AND EYE PROCEDURES,02,DISEASES AND DISORDERS OF THE EYE,1,Minor,Minor,Surgical,Self-Pay,,,,,true,13848.65,9837.54
New York City,Manhattan,7002020,001453,Memorial Hospital for Cancer and Allied Diseases,70 or Older,112,M,White,Not Span/Hispanic,3,Elective,Home or Self Care,2018,NEO001,HEAD AND NECK CANCERS - EYE,EYP001,EYE PROCEDURES,073,ORBIT AND EYE PROCEDURES,02,DISEASES AND DISORDERS OF THE EYE,1,Minor,Minor,Surgical,Medicare,,,,,false,53222.73,22323.09
Long Island,Nassau,2950002,000528,Nassau University Medical Center,50 to 69,115,F,White,Spanish/Hispanic,1,Emergency,Home or Self Care,2018,EYE005,RETINAL AND VITREOUS CONDITIONS,EYP001,EYE PROCEDURES,073,ORBIT AND EYE PROCEDURES,02,DISEASES AND DISORDERS OF THE EYE,1,Minor,Minor,Surgical,Self-Pay,Self-Pay,,,,false,23387.58,18832.35
Long Island,Nassau,2951001,000541,North Shore University Hospital,50 to 69,113,F,White,Not Span/Hispanic,5,Emergency,Home or Self Care,2018,INJ001,"FRACTURE OF HEAD AND NECK, INITIAL ENCOUNTER",MST029,"MUSCULOSKELETAL DEVICE PROCEDURES, NEC",073,ORBIT AND EYE PROCEDURES,02,DISEASES AND DISORDERS OF THE EYE,2,Moderate,Minor,Surgical,Private Health Insurance,,,,,true,70655.7,14148.59
Long Island,Suffolk,5154001,000925,Good Samaritan Hospital Medical Center,18 to 29,117,M,Black/African American,Not Span/Hispanic,5,Emergency,Home or Self Care,2018,INJ001,"FRACTURE OF HEAD AND NECK, INITIAL ENCOUNTER",MST012,BONE FIXATION (EXCLUDING EXTREMITIES),073,ORBIT AND EYE PROCEDURES,02,DISEASES AND DISORDERS OF THE EYE,2,Moderate,Minor,Surgical,Self-Pay,,,,,true,82268.82,15612.36
New York City,Queens,7003003,001629,Jamaica Hospital Medical Center,18 to 29,114,M,Other Race,Not Span/Hispanic,1,Emergency,Court/Law Enforcement,2018,INJ001,"FRACTURE OF HEAD AND NECK, INITIAL ENCOUNTER",MST012,BONE FIXATION (EXCLUDING EXTREMITIES),073,ORBIT AND EYE PROCEDURES,02,DISEASES AND DISORDERS OF THE EYE,2,Moderate,Minor,Surgical,Medicaid,Medicaid,,,,true,14058.08,7557.64
New York City,Manhattan,7002054,001464,New York-Presbyterian Hospital - Columbia Presbyterian Center,70 or Older,117,F,Other Race,Not Span/Hispanic,3,Urgent,Home or Self Care,2018,NEO001,HEAD AND NECK CANCERS - EYE,RAD002,BRACHYTHERAPY,073,ORBIT AND EYE PROCEDURES,02,DISEASES AND DISORDERS OF THE EYE,1,Minor,Minor,Surgical,Medicare,Medicare,Self-Pay,,,false,75463.1,19402.2
New York City,Queens,7003004,003376,Cohen Children's Medical Center,0 to 17,110,M,Other Race,Not Span/Hispanic,1,Emergency,Home or Self Care,2018,INJ011,"OPEN WOUNDS OF HEAD AND NECK, INITIAL ENCOUNTER",EYP002,EYELID PROCEDURES,073,ORBIT AND EYE PROCEDURES,02,DISEASES AND DISORDERS OF THE EYE,1,Minor,Minor,Surgical,Blue Cross/Blue Shield,Self-Pay,,,,true,23865.35,5907.91
Long Island,Suffolk,5154001,000925,Good Samaritan Hospital Medical Center,50 to 69,117,M,White,Not Span/Hispanic,3,Emergency,Home or Self Care,2018,INJ001,"FRACTURE OF HEAD AND NECK, INITIAL ENCOUNTER",MST012,BONE FIXATION (EXCLUDING EXTREMITIES),073,ORBIT AND EYE PROCEDURES,02,DISEASES AND DISORDERS OF THE EYE,2,Moderate,Minor,Surgical,Private Health Insurance,,,,,true,62683.35,11976.84
New York City,Queens,7003003,001629,Jamaica Hospital Medical Center,50 to 69,113,F,White,Not Span/Hispanic,2,Emergency,Home or Self Care,2018,INJ001,"FRACTURE OF HEAD AND NECK, INITIAL ENCOUNTER",MST029,"MUSCULOSKELETAL DEVICE PROCEDURES, NEC",073,ORBIT AND EYE PROCEDURES,02,DISEASES AND DISORDERS OF THE EYE,2,Moderate,Minor,Surgical,Miscellaneous/Other,,,,,true,26086,11496.52
New York City,Manhattan,7002054,001464,New York-Presbyterian Hospital - Columbia Presbyterian Center,50 to 69,124,F,White,Not Span/Hispanic,3,Urgent,Home or Self Care,2018,NEO001,HEAD AND NECK CANCERS - EYE,EYP001,EYE PROCEDURES,073,ORBIT AND EYE PROCEDURES,02,DISEASES AND DISORDERS OF THE EYE,1,Minor,Minor,Surgical,Blue Cross/Blue Shield,Medicaid,Self-Pay,,,false,86503.01,24696.25
New York City,Kings,7001016,001301,Kings County Hospital Center,70 or Older,112,M,Other Race,Not Span/Hispanic,2,Emergency,Home or Self Care,2018,INJ011,"OPEN WOUNDS OF HEAD AND NECK, INITIAL ENCOUNTER",EYP001,EYE PROCEDURES,073,ORBIT AND EYE PROCEDURES,02,DISEASES AND DISORDERS OF THE EYE,2,Moderate,Minor,Surgical,Medicare,Medicare,Medicaid,,,true,27668.07,19654.32
Long Island,Nassau,2951001,000541,North Shore University Hospital,0 to 17,117,M,Black/African American,Not Span/Hispanic,1,Urgent,Home or Self Care,2018,EYE005,RETINAL AND VITREOUS CONDITIONS,EYP001,EYE PROCEDURES,073,ORBIT AND EYE PROCEDURES,02,DISEASES AND DISORDERS OF THE EYE,1,Minor,Minor,Surgical,Medicaid,Medicaid,,,,false,20098.05,3067.26
Long Island,Suffolk,5154001,000925,Good Samaritan Hospital Medical Center,50 to 69,117,F,White,Not Span/Hispanic,3,Emergency,Home or Self Care,2018,INJ001,"FRACTURE OF HEAD AND NECK, INITIAL ENCOUNTER",MST012,BONE FIXATION (EXCLUDING EXTREMITIES),073,ORBIT AND EYE PROCEDURES,02,DISEASES AND DISORDERS OF THE EYE,2,Moderate,Minor,Surgical,Medicaid,Medicaid,,,,true,110531.86,20405.87
New York City,Bronx,7000002,001165,Jacobi Medical Center,0 to 17,104,M,Other Race,Not Span/Hispanic,2,Urgent,Home or Self Care,2018,INJ001,"FRACTURE OF HEAD AND NECK, INITIAL ENCOUNTER",MST012,BONE FIXATION (EXCLUDING EXTREMITIES),073,ORBIT AND EYE PROCEDURES,02,DISEASES AND DISORDERS OF THE EYE,1,Minor,Minor,Surgical,Medicaid,Medicaid,,,,false,14900.42,8815.83
Long Island,Nassau,2951001,000541,North Shore University Hospital,70 or Older,110,F,White,Not Span/Hispanic,2,Emergency,Home w/ Home Health Services,2018,INJ001,"FRACTURE OF HEAD AND NECK, INITIAL ENCOUNTER",MST012,BONE FIXATION (EXCLUDING EXTREMITIES),073,ORBIT AND EYE PROCEDURES,02,DISEASES AND DISORDERS OF THE EYE,2,Moderate,Minor,Surgical,Medicare,Private Health Insurance,,,,true,60657.79,12857.55
New York City,Kings,7001016,001301,Kings County Hospital Center,70 or Older,112,F,Other Race,Not Span/Hispanic,1,Emergency,Home or Self Care,2018,EYE005,RETINAL AND VITREOUS CONDITIONS,EYP001,EYE PROCEDURES,073,ORBIT AND EYE PROCEDURES,02,DISEASES AND DISORDERS OF THE EYE,1,Minor,Minor,Surgical,Medicare,Medicare,Medicaid,,,true,14744.94,10474.23
New York City,Manhattan,7002001,001438,Bellevue Hospital Center,30 to 49,113,M,Other Race,Spanish/Hispanic,5,Emergency,Home or Self Care,2018,EYE008,OCULOFACIAL PLASTICS AND ORBITAL CONDITIONS,EYP002,EYELID PROCEDURES,073,ORBIT AND EYE PROCEDURES,02,DISEASES AND DISORDERS OF THE EYE,1,Minor,Minor,Surgical,Medicaid,,,,,true,28486.3,18931.99
Hudson Valley,Westchester,5957001,001139,Westchester Medical Center,0 to 17,125,M,Other Race,Unknown,8,Emergency,Home or Self Care,2018,EYE008,OCULOFACIAL PLASTICS AND ORBITAL CONDITIONS,MST018,BONE EXCISION,073,ORBIT AND EYE PROCEDURES,02,DISEASES AND DISORDERS OF THE EYE,1,Minor,Minor,Surgical,Medicaid,,,,,true,126090.86,22799.27
Capital/Adirond,Albany,0101000,000001,Albany Medical Center Hospital,70 or Older,123,F,White,Not Span/Hispanic,1,Emergency,Home or Self Care,2018,INJ011,"OPEN WOUNDS OF HEAD AND NECK, INITIAL ENCOUNTER",EYP001,EYE PROCEDURES,073,ORBIT AND EYE PROCEDURES,02,DISEASES AND DISORDERS OF THE EYE,1,Minor,Minor,Surgical,Medicare,Blue Cross/Blue Shield,,,,true,31337.09,10726.15
New York City,Manhattan,7002054,001464,New York-Presbyterian Hospital - Columbia Presbyterian Center,50 to 69,OOS,F,Other Race,Not Span/Hispanic,3,Urgent,Home or Self Care,2018,NEO001,HEAD AND NECK CANCERS - EYE,RAD002,BRACHYTHERAPY,073,ORBIT AND EYE PROCEDURES,02,DISEASES AND DISORDERS OF THE EYE,1,Minor,Minor,Surgical,Private Health Insurance,Self-Pay,,,,false,82291.3,22950.55
New York City,Manhattan,7002020,001453,Memorial Hospital for Cancer and Allied Diseases,50 to 69,OOS,M,White,Not Span/Hispanic,3,Elective,Home or Self Care,2018,NEO001,HEAD AND NECK CANCERS - EYE,EYP001,EYE PROCEDURES,073,ORBIT AND EYE PROCEDURES,02,DISEASES AND DISORDERS OF THE EYE,1,Minor,Minor,Surgical,Medicare,Blue Cross/Blue Shield,,,,false,52997.33,22303.08
New York City,Manhattan,7002054,001464,New York-Presbyterian Hospital - Columbia Presbyterian Center,50 to 69,109,M,Other Race,Not Span/Hispanic,1,Elective,Home or Self Care,2018,NEO027,SKIN CANCERS - SQUAMOUS CELL CARCINOMA,EYP002,EYELID PROCEDURES,073,ORBIT AND EYE PROCEDURES,02,DISEASES AND DISORDERS OF THE EYE,1,Minor,Minor,Surgical,Medicare,Private Health Insurance,Self-Pay,,,false,33321.23,9226.6
New York City,Bronx,7000008,001172,Lincoln Medical & Mental Health Center,18 to 29,104,M,Black/African American,Not Span/Hispanic,1,Emergency,Home or Self Care,2018,INJ001,"FRACTURE OF HEAD AND NECK, INITIAL ENCOUNTER",MST012,BONE FIXATION (EXCLUDING EXTREMITIES),073,ORBIT AND EYE PROCEDURES,02,DISEASES AND DISORDERS OF THE EYE,2,Moderate,Minor,Surgical,Medicaid,,,,,false,12437.68,7345.16
Central NY,Onondaga,3301008,000636,Crouse Hospital,70 or Older,132,F,White,Not Span/Hispanic,7,Emergency,Skilled Nursing Home,2018,EYE008,OCULOFACIAL PLASTICS AND ORBITAL CONDITIONS,EYP001,EYE PROCEDURES,073,ORBIT AND EYE PROCEDURES,02,DISEASES AND DISORDERS OF THE EYE,1,Minor,Minor,Surgical,Medicare,Medicare,Federal/State/Local/VA,,,true,31755.3,13912.5
New York City,Kings,7001008,001293,"New York Community Hospital of Brooklyn, Inc",50 to 69,112,M,White,Not Span/Hispanic,1,Emergency,Home or Self Care,2018,EYE005,RETINAL AND VITREOUS CONDITIONS,EYP001,EYE PROCEDURES,073,ORBIT AND EYE PROCEDURES,02,DISEASES AND DISORDERS OF THE EYE,1,Minor,Minor,Surgical,Private Health Insurance,Self-Pay,,,,true,4015,2036.75
New York City,Bronx,7000008,001172,Lincoln Medical & Mental Health Center,30 to 49,104,M,Other Race,Spanish/Hispanic,2,Emergency,Home or Self Care,2018,INJ011,"OPEN WOUNDS OF HEAD AND NECK, INITIAL ENCOUNTER",EYP001,EYE PROCEDURES,073,ORBIT AND EYE PROCEDURES,02,DISEASES AND DISORDERS OF THE EYE,1,Minor,Minor,Surgical,Medicaid,Medicaid,,,,true,17021.1,10051.93
New York City,Manhattan,7002054,001437,New York-Presbyterian/Lower Manhattan Hospital,30 to 49,100,M,Other Race,Not Span/Hispanic,3,Emergency,Home or Self Care,2018,INJ001,"FRACTURE OF HEAD AND NECK, INITIAL ENCOUNTER",MST012,BONE FIXATION (EXCLUDING EXTREMITIES),073,ORBIT AND EYE PROCEDURES,02,DISEASES AND DISORDERS OF THE EYE,2,Moderate,Minor,Surgical,Private Health Insurance,Self-Pay,,,,true,61213.09,16883.74
Long Island,Nassau,2950002,000528,Nassau University Medical Center,30 to 49,117,M,White,Spanish/Hispanic,1,Emergency,Home or Self Care,2018,INJ011,"OPEN WOUNDS OF HEAD AND NECK, INITIAL ENCOUNTER",EYP001,EYE PROCEDURES,073,ORBIT AND EYE PROCEDURES,02,DISEASES AND DISORDERS OF THE EYE,1,Minor,Minor,Surgical,Medicaid,Self-Pay,,,,false,15609.66,10245.13
New York City,Manhattan,7002020,001453,Memorial Hospital for Cancer and Allied Diseases,50 to 69,125,F,White,Not Span/Hispanic,3,Elective,Home or Self Care,2018,NEO001,HEAD AND NECK CANCERS - EYE,ADM014,REGIONAL ANESTHESIA,073,ORBIT AND EYE PROCEDURES,02,DISEASES AND DISORDERS OF THE EYE,1,Minor,Minor,Surgical,Blue Cross/Blue Shield,Private Health Insurance,,,,false,58934.13,24883.84
Capital/Adirond,Albany,0101000,000001,Albany Medical Center Hospital,50 to 69,129,M,Black/African American,Not Span/Hispanic,14,Emergency,Court/Law Enforcement,2018,EYE004,UVEITIS AND OCULAR INFLAMMATION,EYP001,EYE PROCEDURES,073,ORBIT AND EYE PROCEDURES,02,DISEASES AND DISORDERS OF THE EYE,3,Major,Minor,Surgical,Department of Corrections,,,,,true,51184.29,20075.79
Hudson Valley,Westchester,5957001,001139,Westchester Medical Center,30 to 49,108,M,Other Race,Unknown,2,Emergency,Home or Self Care,2018,INJ011,"OPEN WOUNDS OF HEAD AND NECK, INITIAL ENCOUNTER",EYP001,EYE PROCEDURES,073,ORBIT AND EYE PROCEDURES,02,DISEASES AND DISORDERS OF THE EYE,1,Minor,Minor,Surgical,Miscellaneous/Other,Blue Cross/Blue Shield,,,,true,58138.36,10805.08
New York City,Kings,7001009,001294,Coney Island Hospital,18 to 29,112,M,Black/African American,Not Span/Hispanic,1,Emergency,Home or Self Care,2018,INJ011,"OPEN WOUNDS OF HEAD AND NECK, INITIAL ENCOUNTER",EYP001,EYE PROCEDURES,073,ORBIT AND EYE PROCEDURES,02,DISEASES AND DISORDERS OF THE EYE,1,Minor,Minor,Surgical,Medicaid,Medicaid,,,,true,15574.31,8717.39
New York City,Manhattan,7002020,001453,Memorial Hospital for Cancer and Allied Diseases,0 to 17,117,M,White,Not Span/Hispanic,3,Elective,Home or Self Care,2018,NEO073,BENIGN NEOPLASMS,MST018,BONE EXCISION,073,ORBIT AND EYE PROCEDURES,02,DISEASES AND DISORDERS OF THE EYE,2,Moderate,Minor,Surgical,Blue Cross/Blue Shield,,,,,false,96828.81,44088.82
New York City,Kings,7001016,001301,Kings County Hospital Center,30 to 49,116,M,Black/African American,Not Span/Hispanic,2,Emergency,Home or Self Care,2018,INJ011,"OPEN WOUNDS OF HEAD AND NECK, INITIAL ENCOUNTER",EYP001,EYE PROCEDURES,073,ORBIT AND EYE PROCEDURES,02,DISEASES AND DISORDERS OF THE EYE,2,Moderate,Minor,Surgical,Blue Cross/Blue Shield,,,,,true,26397.59,18751.82
New York City,Manhattan,7002001,001438,Bellevue Hospital Center,50 to 69,114,M,Black/African American,Not Span/Hispanic,1,Emergency,Home or Self Care,2018,EYE005,RETINAL AND VITREOUS CONDITIONS,EYP001,EYE PROCEDURES,073,ORBIT AND EYE PROCEDURES,02,DISEASES AND DISORDERS OF THE EYE,1,Minor,Minor,Surgical,Medicaid,,,,,true,3673.88,2441.66
Central NY,Onondaga,3301007,000635,University Hospital SUNY Health Science Center,30 to 49,148,M,Black/African American,Not Span/Hispanic,2,Emergency,Home or Self Care,2018,INJ019,"BURN AND CORROSION, INITIAL ENCOUNTER",EYP001,EYE PROCEDURES,073,ORBIT AND EYE PROCEDURES,02,DISEASES AND DISORDERS OF THE EYE,1,Minor,Minor,Surgical,Medicaid,,,,,true,15573.4,6038.75