Hospital Service Area,Hospital County,Operating Certificate Number,Permanent Facility Id,Facility Name,Age Group,Zip Code - 3 digits,Gender,Race,Ethnicity,Length of Stay,Type of Admission,Patient Disposition,Discharge Year,CCS Diagnosis Code,CCS Diagnosis Description,CCS Procedure Code,CCS Procedure Description,APR DRG Code,APR DRG Description,APR MDC Code,APR MDC Description,APR Severity of Illness Code,APR Severity of Illness Description,APR Risk of Mortality,APR Medical Surgical Description,Payment Typology 1,Payment Typology 2,Payment Typology 3,Birth Weight,Abortion Edit Indicator,Emergency Department Indicator,Total Charges,Total Costs
New York City,Manhattan,7002001,001438,Bellevue Hospital Center,70 or Older,112,M,White,Not Span/Hispanic,1,Elective,Home or Self Care,2020,EYE003,GLAUCOMA,EYP001,EYE PROCEDURES,073,ORBIT & EYE PROCEDURES,02,DISEASES AND DISORDERS OF THE EYE,1,Minor,Minor,Surgical,Medicaid,,,,,N,23762.51,13665.44
New York City,Manhattan,7002001,001438,Bellevue Hospital Center,50 to 69,100,M,Black/African American,Not Span/Hispanic,1,Elective,Home or Self Care,2020,EYE003,GLAUCOMA,EYP001,EYE PROCEDURES,073,ORBIT & EYE PROCEDURES,02,DISEASES AND DISORDERS OF THE EYE,1,Minor,Minor,Surgical,Medicaid,,,,,N,19323.04,11112.37
New York City,Manhattan,7002001,001438,Bellevue Hospital Center,50 to 69,104,M,Black/African American,Not Span/Hispanic,9,Elective,Home w/ Home Health Services,2020,EYE003,GLAUCOMA,EYP001,EYE PROCEDURES,073,ORBIT & EYE PROCEDURES,02,DISEASES AND DISORDERS OF THE EYE,1,Minor,Minor,Surgical,Medicaid,,,,,N,90027.3,51773.26
New York City,Manhattan,7002001,001438,Bellevue Hospital Center,70 or Older,104,F,Other Race,Spanish/Hispanic,1,Elective,Home or Self Care,2020,EYE001,CORNEA AND EXTERNAL DISEASE,EYP001,EYE PROCEDURES,073,ORBIT & EYE PROCEDURES,02,DISEASES AND DISORDERS OF THE EYE,2,Moderate,Minor,Surgical,Medicare,Medicaid,,,,N,33609.3,19328.17
New York City,Manhattan,7002001,001438,Bellevue Hospital Center,70 or Older,112,M,White,Not Span/Hispanic,1,Elective,Home or Self Care,2020,EYE001,CORNEA AND EXTERNAL DISEASE,EYP001,EYE PROCEDURES,073,ORBIT & EYE PROCEDURES,02,DISEASES AND DISORDERS OF THE EYE,1,Minor,Minor,Surgical,Medicare,,,,,N,28548.64,16417.87
New York City,Manhattan,7002001,001438,Bellevue Hospital Center,30 to 49,100,M,Black/African American,Not Span/Hispanic,5,Urgent,Home or Self Care,2020,INJ011,"OPEN WOUNDS OF HEAD AND NECK, INITIAL ENCOUNTER",EYP001,EYE PROCEDURES,073,ORBIT & EYE PROCEDURES,02,DISEASES AND DISORDERS OF THE EYE,2,Moderate,Minor,Surgical,Medicaid,,,,,N,53758.58,30915.7
New York City,Manhattan,7002001,001438,Bellevue Hospital Center,50 to 69,104,M,Other Race,Spanish/Hispanic,1,Emergency,Home or Self Care,2020,INJ011,"OPEN WOUNDS OF HEAD AND NECK, INITIAL ENCOUNTER",EYP001,EYE PROCEDURES,073,ORBIT & EYE PROCEDURES,02,DISEASES AND DISORDERS OF THE EYE,1,Minor,Minor,Surgical,Medicaid,,,,,Y,18807.58,10815.94
New York City,Manhattan,7002001,001438,Bellevue Hospital Center,50 to 69,100,M,Other Race,Not Span/Hispanic,1,Emergency,Home or Self Care,2020,EYE005,RETINAL AND VITREOUS CONDITIONS,EYP001,EYE PROCEDURES,073,ORBIT & EYE PROCEDURES,02,DISEASES AND DISORDERS OF THE EYE,1,Minor,Minor,Surgical,Self-Pay,,,,,Y,39905.25,22948.87
New York City,Manhattan,7002001,001438,Bellevue Hospital Center,50 to 69,114,F,Other Race,Spanish/Hispanic,1,Emergency,Home or Self Care,2020,END003,DIABETES MELLITUS WITH COMPLICATION,EYP001,EYE PROCEDURES,073,ORBIT & EYE PROCEDURES,02,DISEASES AND DISORDERS OF THE EYE,2,Moderate,Minor,Surgical,Private Health Insurance,,,,,Y,28432.93,16351.32
New York City,Manhattan,7002001,001438,Bellevue Hospital Center,30 to 49,112,M,Other Race,Spanish/Hispanic,1,Emergency,Home or Self Care,2020,EYE005,RETINAL AND VITREOUS CONDITIONS,EYP001,EYE PROCEDURES,073,ORBIT & EYE PROCEDURES,02,DISEASES AND DISORDERS OF THE EYE,1,Minor,Minor,Surgical,Medicaid,,,,,Y,20447.82,11759.21
New York City,Manhattan,7002001,001438,Bellevue Hospital Center,30 to 49,112,M,Other Race,Spanish/Hispanic,1,Elective,Home or Self Care,2020,EYE002,CATARACT AND OTHER LENS DISORDERS,EYP001,EYE PROCEDURES,073,ORBIT & EYE PROCEDURES,02,DISEASES AND DISORDERS OF THE EYE,1,Minor,Minor,Surgical,Medicaid,,,,,N,14546.88,8365.68
New York City,Manhattan,7002001,001438,Bellevue Hospital Center,30 to 49,112,M,Black/African American,Spanish/Hispanic,6,Emergency,Psychiatric Hospital or Unit of Hosp,2020,INJ011,"OPEN WOUNDS OF HEAD AND NECK, INITIAL ENCOUNTER",EYP001,EYE PROCEDURES,073,ORBIT & EYE PROCEDURES,02,DISEASES AND DISORDERS OF THE EYE,2,Moderate,Minor,Surgical,Medicaid,,,,,Y,59207.71,34049.41
New York City,Manhattan,7002001,001438,Bellevue Hospital Center,70 or Older,112,M,Other Race,Spanish/Hispanic,5,Emergency,Psychiatric Hospital or Unit of Hosp,2020,EYE002,CATARACT AND OTHER LENS DISORDERS,EYP001,EYE PROCEDURES,073,ORBIT & EYE PROCEDURES,02,DISEASES AND DISORDERS OF THE EYE,2,Moderate,Minor,Surgical,Medicare,Medicaid,,,,Y,57094.87,32834.35
New York City,Manhattan,7002001,001438,Bellevue Hospital Center,30 to 49,112,M,Other Race,Spanish/Hispanic,1,Elective,Home or Self Care,2020,EYE002,CATARACT AND OTHER LENS DISORDERS,EYP001,EYE PROCEDURES,073,ORBIT & EYE PROCEDURES,02,DISEASES AND DISORDERS OF THE EYE,1,Minor,Minor,Surgical,Medicaid,,,,,N,13314.66,7657.05
New York City,Manhattan,7002001,001438,Bellevue Hospital Center,50 to 69,112,M,Other Race,Spanish/Hispanic,1,Emergency,Home or Self Care,2020,EYE005,RETINAL AND VITREOUS CONDITIONS,EYP001,EYE PROCEDURES,073,ORBIT & EYE PROCEDURES,02,DISEASES AND DISORDERS OF THE EYE,1,Minor,Minor,Surgical,Medicaid,,,,,Y,38587.55,22191.08
New York City,Manhattan,7002001,001438,Bellevue Hospital Center,18 to 29,100,M,Black/African American,Unknown,2,Elective,Home or Self Care,2020,INJ001,"FRACTURE OF HEAD AND NECK, INITIAL ENCOUNTER",MST012,BONE FIXATION (EXCLUDING EXTREMITIES),073,ORBIT & EYE PROCEDURES,02,DISEASES AND DISORDERS OF THE EYE,2,Moderate,Minor,Surgical,Medicare,Medicaid,,,,N,30431.42,17500.62
New York City,Manhattan,7002001,001438,Bellevue Hospital Center,50 to 69,100,F,Other Race,Not Span/Hispanic,1,Elective,Home or Self Care,2020,EYE003,GLAUCOMA,EYP001,EYE PROCEDURES,073,ORBIT & EYE PROCEDURES,02,DISEASES AND DISORDERS OF THE EYE,1,Minor,Minor,Surgical,Private Health Insurance,,,,,N,26828.08,15428.4
New York City,Manhattan,7002001,001438,Bellevue Hospital Center,50 to 69,,M,Multi-racial,Spanish/Hispanic,3,Urgent,Court/Law Enforcement,2020,EYE002,CATARACT AND OTHER LENS DISORDERS,EYP001,EYE PROCEDURES,073,ORBIT & EYE PROCEDURES,02,DISEASES AND DISORDERS OF THE EYE,2,Moderate,Minor,Surgical,Medicare,Medicaid,,,,N,32416.32,18642.11
New York City,Manhattan,7002001,001438,Bellevue Hospital Center,50 to 69,100,M,Other Race,Spanish/Hispanic,1,Elective,Home or Self Care,2020,END003,DIABETES MELLITUS WITH COMPLICATION,EYP001,EYE PROCEDURES,073,ORBIT & EYE PROCEDURES,02,DISEASES AND DISORDERS OF THE EYE,1,Minor,Minor,Surgical,Medicaid,,,,,N,28594.94,16444.49
New York City,Manhattan,7002001,001438,Bellevue Hospital Center,50 to 69,101,M,Other Race,Spanish/Hispanic,1,Emergency,Home or Self Care,2020,EYE003,GLAUCOMA,EYP001,EYE PROCEDURES,073,ORBIT & EYE PROCEDURES,02,DISEASES AND DISORDERS OF THE EYE,1,Minor,Minor,Surgical,Medicaid,,,,,Y,21085.44,12125.9
New York City,Manhattan,7002001,001438,Bellevue Hospital Center,50 to 69,104,M,Other Race,Not Span/Hispanic,2,Elective,Home or Self Care,2020,END003,DIABETES MELLITUS WITH COMPLICATION,EYP001,EYE PROCEDURES,073,ORBIT & EYE PROCEDURES,02,DISEASES AND DISORDERS OF THE EYE,2,Moderate,Minor,Surgical,Private Health Insurance,,,,,N,30570.81,17580.78
New York City,Manhattan,7002001,001438,Bellevue Hospital Center,30 to 49,112,M,Black/African American,Not Span/Hispanic,14,Urgent,Home or Self Care,2020,EYE005,RETINAL AND VITREOUS CONDITIONS,EYP001,EYE PROCEDURES,073,ORBIT & EYE PROCEDURES,02,DISEASES AND DISORDERS OF THE EYE,2,Moderate,Minor,Surgical,Medicaid,,,,,N,104424.04,60052.59
New York City,Manhattan,7002001,001438,Bellevue Hospital Center,50 to 69,100,M,Other Race,Spanish/Hispanic,2,Elective,Home or Self Care,2020,INJ001,"FRACTURE OF HEAD AND NECK, INITIAL ENCOUNTER",MST012,BONE FIXATION (EXCLUDING EXTREMITIES),073,ORBIT & EYE PROCEDURES,02,DISEASES AND DISORDERS OF THE EYE,1,Minor,Minor,Surgical,Medicare,,,,,N,37803.56,21740.22
New York City,Manhattan,7002001,001438,Bellevue Hospital Center,18 to 29,112,M,Multi-racial,Not Span/Hispanic,1,Emergency,Home or Self Care,2020,INJ001,"FRACTURE OF HEAD AND NECK, INITIAL ENCOUNTER",MST012,BONE FIXATION (EXCLUDING EXTREMITIES),073,ORBIT & EYE PROCEDURES,02,DISEASES AND DISORDERS OF THE EYE,2,Moderate,Minor,Surgical,Medicaid,,,,,Y,41487.37,23858.72
New York City,Manhattan,7002001,001438,Bellevue Hospital Center,70 or Older,100,M,Black/African American,Not Span/Hispanic,4,Emergency,Home or Self Care,2020,INJ011,"OPEN WOUNDS OF HEAD AND NECK, INITIAL ENCOUNTER",EYP001,EYE PROCEDURES,073,ORBIT & EYE PROCEDURES,02,DISEASES AND DISORDERS OF THE EYE,3,Major,Moderate,Surgical,Medicare,Medicaid,,,,Y,44020.53,25315.5
New York City,Manhattan,7002001,001438,Bellevue Hospital Center,70 or Older,115,F,Other Race,Unknown,3,Emergency,Home or Self Care,2020,INJ011,"OPEN WOUNDS OF HEAD AND NECK, INITIAL ENCOUNTER",EYP001,EYE PROCEDURES,073,ORBIT & EYE PROCEDURES,02,DISEASES AND DISORDERS OF THE EYE,2,Moderate,Minor,Surgical,Medicare,Medicare,,,,Y,42574.09,24483.68
New York City,Manhattan,7002001,001438,Bellevue Hospital Center,0 to 17,112,M,Other Race,Spanish/Hispanic,2,Elective,Home or Self Care,2020,EYE005,RETINAL AND VITREOUS CONDITIONS,EYP001,EYE PROCEDURES,073,ORBIT & EYE PROCEDURES,02,DISEASES AND DISORDERS OF THE EYE,3,Major,Minor,Surgical,Medicaid,,,,,N,30006.63,17256.33
New York City,Manhattan,7002001,001438,Bellevue Hospital Center,18 to 29,100,M,Other Race,Spanish/Hispanic,5,Emergency,Home or Self Care,2020,INJ001,"FRACTURE OF HEAD AND NECK, INITIAL ENCOUNTER",MST012,BONE FIXATION (EXCLUDING EXTREMITIES),073,ORBIT & EYE PROCEDURES,02,DISEASES AND DISORDERS OF THE EYE,2,Moderate,Minor,Surgical,Medicaid,,,,,Y,53070.5,30520
New York City,Manhattan,7002001,001438,Bellevue Hospital Center,18 to 29,104,M,Black/African American,Not Span/Hispanic,6,Emergency,Home or Self Care,2020,INJ011,"OPEN WOUNDS OF HEAD AND NECK, INITIAL ENCOUNTER",EYP001,EYE PROCEDURES,073,ORBIT & EYE PROCEDURES,02,DISEASES AND DISORDERS OF THE EYE,2,Moderate,Minor,Surgical,Medicaid,,,,,Y,83875.28,48235.33
New York City,Manhattan,7002001,001438,Bellevue Hospital Center,70 or Older,112,M,Black/African American,Not Span/Hispanic,1,Elective,Home or Self Care,2020,EYE002,CATARACT AND OTHER LENS DISORDERS,EYP001,EYE PROCEDURES,073,ORBIT & EYE PROCEDURES,02,DISEASES AND DISORDERS OF THE EYE,2,Moderate,Moderate,Surgical,Self-Pay,,,,,Y,27407.5,15761.61
New York City,Manhattan,7002001,001438,Bellevue Hospital Center,0 to 17,104,M,Black/African American,Not Span/Hispanic,2,Elective,Home or Self Care,2020,EYE008,OCULOFACIAL PLASTICS AND ORBITAL CONDITIONS,MST002,BONE AND JOINT BIOPSY,073,ORBIT & EYE PROCEDURES,02,DISEASES AND DISORDERS OF THE EYE,1,Minor,Minor,Surgical,Medicaid,,,,,N,21795.53,12534.26
New York City,Manhattan,7002001,001438,Bellevue Hospital Center,18 to 29,100,M,Other Race,Spanish/Hispanic,2,Emergency,Home or Self Care,2020,INJ001,"FRACTURE OF HEAD AND NECK, INITIAL ENCOUNTER",ADM021,"ADMINISTRATION OF THERAPEUTIC SUBSTANCES, NEC",073,ORBIT & EYE PROCEDURES,02,DISEASES AND DISORDERS OF THE EYE,2,Moderate,Moderate,Surgical,Medicaid,,,,,Y,38396.91,22081.45
New York City,Manhattan,7002001,001438,Bellevue Hospital Center,50 to 69,104,M,Other Race,Unknown,1,Emergency,Home or Self Care,2020,EYE002,CATARACT AND OTHER LENS DISORDERS,EYP001,EYE PROCEDURES,073,ORBIT & EYE PROCEDURES,02,DISEASES AND DISORDERS OF THE EYE,2,Moderate,Moderate,Surgical,Medicaid,,,,,Y,33551.49,19294.93
New York City,Manhattan,7002001,001438,Bellevue Hospital Center,50 to 69,112,F,Other Race,Spanish/Hispanic,3,Emergency,Home or Self Care,2020,INJ011,"OPEN WOUNDS OF HEAD AND NECK, INITIAL ENCOUNTER",EYP001,EYE PROCEDURES,073,ORBIT & EYE PROCEDURES,02,DISEASES AND DISORDERS OF THE EYE,1,Minor,Minor,Surgical,Medicaid,,,,,Y,40208.03,23122.99
New York City,Manhattan,7002001,001438,Bellevue Hospital Center,30 to 49,112,M,Other Race,Spanish/Hispanic,1,Emergency,Home or Self Care,2020,EYE005,RETINAL AND VITREOUS CONDITIONS,EYP001,EYE PROCEDURES,073,ORBIT & EYE PROCEDURES,02,DISEASES AND DISORDERS OF THE EYE,1,Minor,Minor,Surgical,Medicaid,,,,,Y,23109,13289.62
New York City,Manhattan,7002001,001438,Bellevue Hospital Center,70 or Older,112,F,Other Race,Spanish/Hispanic,1,Emergency,Home or Self Care,2020,INJ011,"OPEN WOUNDS OF HEAD AND NECK, INITIAL ENCOUNTER",EYP001,EYE PROCEDURES,073,ORBIT & EYE PROCEDURES,02,DISEASES AND DISORDERS OF THE EYE,2,Moderate,Minor,Surgical,Medicare,Medicaid,,,,Y,35694.8,20527.51
New York City,Manhattan,7002001,001438,Bellevue Hospital Center,70 or Older,112,M,White,Not Span/Hispanic,1,Elective,Home or Self Care,2020,EYE012,OTHER SPECIFIED EYE DISORDERS,EYP001,EYE PROCEDURES,073,ORBIT & EYE PROCEDURES,02,DISEASES AND DISORDERS OF THE EYE,1,Minor,Minor,Surgical,Medicaid,,,,,N,23618.21,13582.45
New York City,Manhattan,7002001,001438,Bellevue Hospital Center,50 to 69,112,M,Black/African American,Not Span/Hispanic,1,Emergency,Home or Self Care,2020,EYE011,POSTPROCEDURAL OR POSTOPERATIVE EYE COMPLICATION,EYP001,EYE PROCEDURES,073,ORBIT & EYE PROCEDURES,02,DISEASES AND DISORDERS OF THE EYE,1,Minor,Minor,Surgical,Medicare,,,,,Y,41446.83,23835.41
New York City,Manhattan,7002001,001438,Bellevue Hospital Center,30 to 49,100,M,Other Race,Unknown,10,Emergency,Home or Self Care,2020,INJ011,"OPEN WOUNDS OF HEAD AND NECK, INITIAL ENCOUNTER",EYP001,EYE PROCEDURES,073,ORBIT & EYE PROCEDURES,02,DISEASES AND DISORDERS OF THE EYE,4,Extreme,Extreme,Surgical,Medicaid,,,,,Y,106140.69,61039.81
New York City,Manhattan,7002001,001438,Bellevue Hospital Center,70 or Older,112,M,Other Race,Unknown,1,Elective,Home or Self Care,2020,EYE002,CATARACT AND OTHER LENS DISORDERS,EYP001,EYE PROCEDURES,073,ORBIT & EYE PROCEDURES,02,DISEASES AND DISORDERS OF THE EYE,2,Moderate,Minor,Surgical,Medicaid,,,,,N,24478.18,14077.01
New York City,Manhattan,7002001,001438,Bellevue Hospital Center,50 to 69,112,M,Other Race,Spanish/Hispanic,1,Elective,Home or Self Care,2020,EYE005,RETINAL AND VITREOUS CONDITIONS,EYP001,EYE PROCEDURES,073,ORBIT & EYE PROCEDURES,02,DISEASES AND DISORDERS OF THE EYE,1,Minor,Minor,Surgical,Medicaid,,,,,N,24613.95,14155.09
New York City,Manhattan,7002001,001438,Bellevue Hospital Center,50 to 69,104,F,Other Race,Spanish/Hispanic,1,Elective,Home or Self Care,2020,EYE005,RETINAL AND VITREOUS CONDITIONS,EYP001,EYE PROCEDURES,073,ORBIT & EYE PROCEDURES,02,DISEASES AND DISORDERS OF THE EYE,1,Minor,Minor,Surgical,Medicaid,,,,,N,34172.87,19652.27
New York City,Manhattan,7002001,001438,Bellevue Hospital Center,50 to 69,100,F,Other Race,Spanish/Hispanic,3,Emergency,Home or Self Care,2020,INJ011,"OPEN WOUNDS OF HEAD AND NECK, INITIAL ENCOUNTER",EYP002,EYELID PROCEDURES,073,ORBIT & EYE PROCEDURES,02,DISEASES AND DISORDERS OF THE EYE,1,Minor,Minor,Surgical,Medicare,Medicaid,,,,Y,49723.22,28595.03
New York City,Manhattan,7002001,001438,Bellevue Hospital Center,70 or Older,100,F,Other Race,Spanish/Hispanic,3,Emergency,Home or Self Care,2020,EYE002,CATARACT AND OTHER LENS DISORDERS,EYP001,EYE PROCEDURES,073,ORBIT & EYE PROCEDURES,02,DISEASES AND DISORDERS OF THE EYE,2,Moderate,Moderate,Surgical,Medicare,,,,,Y,39333.1,22619.84
New York City,Manhattan,7002001,001438,Bellevue Hospital Center,50 to 69,100,M,Black/African American,Not Span/Hispanic,1,Elective,Home or Self Care,2020,END003,DIABETES MELLITUS WITH COMPLICATION,EYP001,EYE PROCEDURES,073,ORBIT & EYE PROCEDURES,02,DISEASES AND DISORDERS OF THE EYE,2,Moderate,Minor,Surgical,Medicaid,,,,,N,18841.33,10835.35
New York City,Manhattan,7002001,001438,Bellevue Hospital Center,70 or Older,112,F,Black/African American,Not Span/Hispanic,1,Urgent,Home or Self Care,2020,EYE003,GLAUCOMA,EYP001,EYE PROCEDURES,073,ORBIT & EYE PROCEDURES,02,DISEASES AND DISORDERS OF THE EYE,1,Minor,Minor,Surgical,Medicare,Medicaid,,,,N,17705.33,10182.05
New York City,Manhattan,7002001,001438,Bellevue Hospital Center,70 or Older,,F,Other Race,Unknown,3,Urgent,Home or Self Care,2020,INJ001,"FRACTURE OF HEAD AND NECK, INITIAL ENCOUNTER",EYP001,EYE PROCEDURES,073,ORBIT & EYE PROCEDURES,02,DISEASES AND DISORDERS OF THE EYE,2,Moderate,Minor,Surgical,Medicaid,,,,,N,40981,23567.52
New York City,Manhattan,7002001,001438,Bellevue Hospital Center,30 to 49,100,M,Multi-racial,Spanish/Hispanic,1,Elective,Home or Self Care,2020,EYE010,BLINDNESS AND VISION DEFECTS,EYP001,EYE PROCEDURES,073,ORBIT & EYE PROCEDURES,02,DISEASES AND DISORDERS OF THE EYE,1,Minor,Minor,Surgical,Medicaid,,,,,N,24962.82,14355.72
New York City,Manhattan,7002001,001438,Bellevue Hospital Center,70 or Older,114,F,Black/African American,Unknown,2,Elective,Home or Self Care,2020,EYE008,OCULOFACIAL PLASTICS AND ORBITAL CONDITIONS,MST018,BONE EXCISION,073,ORBIT & EYE PROCEDURES,02,DISEASES AND DISORDERS OF THE EYE,1,Minor,Minor,Surgical,Medicaid,,,,,N,32903.25,18922.13
New York City,Manhattan,7002001,001438,Bellevue Hospital Center,30 to 49,111,M,Other Race,Spanish/Hispanic,1,Elective,Home or Self Care,2020,END003,DIABETES MELLITUS WITH COMPLICATION,EYP001,EYE PROCEDURES,073,ORBIT & EYE PROCEDURES,02,DISEASES AND DISORDERS OF THE EYE,2,Moderate,Minor,Surgical,Self-Pay,,,,,N,24885.34,14311.16
New York City,Manhattan,7002001,001438,Bellevue Hospital Center,30 to 49,100,M,White,Not Span/Hispanic,1,Elective,Home or Self Care,2020,INJ001,"FRACTURE OF HEAD AND NECK, INITIAL ENCOUNTER",MST012,BONE FIXATION (EXCLUDING EXTREMITIES),073,ORBIT & EYE PROCEDURES,02,DISEASES AND DISORDERS OF THE EYE,1,Minor,Minor,Surgical,Medicaid,,,,,N,36144.34,20786.03
New York City,Manhattan,7002001,001438,Bellevue Hospital Center,50 to 69,100,M,Black/African American,Not Span/Hispanic,6,Urgent,Skilled Nursing Home,2020,EYE001,CORNEA AND EXTERNAL DISEASE,EYP001,EYE PROCEDURES,073,ORBIT & EYE PROCEDURES,02,DISEASES AND DISORDERS OF THE EYE,4,Extreme,Major,Surgical,Medicaid,,,,,N,67788.5,38984.08
New York City,Manhattan,7002001,001438,Bellevue Hospital Center,30 to 49,112,M,Black/African American,Not Span/Hispanic,2,Emergency,Home or Self Care,2020,INJ011,"OPEN WOUNDS OF HEAD AND NECK, INITIAL ENCOUNTER",EYP001,EYE PROCEDURES,073,ORBIT & EYE PROCEDURES,02,DISEASES AND DISORDERS OF THE EYE,2,Moderate,Minor,Surgical,Federal/State/Local/VA,,,,,Y,37344.3,21476.11
New York City,Manhattan,7002001,001438,Bellevue Hospital Center,30 to 49,112,M,Other Race,Not Span/Hispanic,7,Emergency,Home or Self Care,2020,INJ001,"FRACTURE OF HEAD AND NECK, INITIAL ENCOUNTER",MST012,BONE FIXATION (EXCLUDING EXTREMITIES),073,ORBIT & EYE PROCEDURES,02,DISEASES AND DISORDERS OF THE EYE,3,Major,Moderate,Surgical,Self-Pay,,,,,Y,112287.84,64574.94
New York City,Manhattan,7002001,001438,Bellevue Hospital Center,30 to 49,100,M,Black/African American,Not Span/Hispanic,5,Urgent,Home or Self Care,2020,INJ011,"OPEN WOUNDS OF HEAD AND NECK, INITIAL ENCOUNTER",EYP001,EYE PROCEDURES,073,ORBIT & EYE PROCEDURES,02,DISEASES AND DISORDERS OF THE EYE,2,Moderate,Minor,Surgical,Medicaid,,,,,N,54458.71,31318.33
New York City,Manhattan,7002001,001438,Bellevue Hospital Center,0 to 17,113,M,Other Race,Not Span/Hispanic,26,Elective,Medicare Cert Long Term Care Hospital,2020,EYE005,RETINAL AND VITREOUS CONDITIONS,EYP001,EYE PROCEDURES,073,ORBIT & EYE PROCEDURES,02,DISEASES AND DISORDERS OF THE EYE,4,Extreme,Major,Surgical,Medicaid,,,,,N,241019.45,138606.43
New York City,Manhattan,7002001,001438,Bellevue Hospital Center,70 or Older,100,F,Other Race,Spanish/Hispanic,9,Emergency,Skilled Nursing Home,2020,INJ011,"OPEN WOUNDS OF HEAD AND NECK, INITIAL ENCOUNTER",EYP001,EYE PROCEDURES,073,ORBIT & EYE PROCEDURES,02,DISEASES AND DISORDERS OF THE EYE,3,Major,Moderate,Surgical,Medicare,Medicaid,,,,Y,105889.05,60895.1
New York City,Manhattan,7002001,001438,Bellevue Hospital Center,30 to 49,112,M,Other Race,Spanish/Hispanic,1,Emergency,Home or Self Care,2020,INJ001,"FRACTURE OF HEAD AND NECK, INITIAL ENCOUNTER",EYP001,EYE PROCEDURES,073,ORBIT & EYE PROCEDURES,02,DISEASES AND DISORDERS OF THE EYE,4,Extreme,Extreme,Surgical,Medicaid,,,,,Y,29326.14,16864.99
New York City,Manhattan,7002001,001438,Bellevue Hospital Center,30 to 49,113,F,Other Race,Spanish/Hispanic,6,Emergency,Home or Self Care,2020,EYE008,OCULOFACIAL PLASTICS AND ORBITAL CONDITIONS,EYP002,EYELID PROCEDURES,073,ORBIT & EYE PROCEDURES,02,DISEASES AND DISORDERS OF THE EYE,1,Minor,Minor,Surgical,Medicaid,,,,,Y,46391.01,26678.73
New York City,Manhattan,7002001,001438,Bellevue Hospital Center,50 to 69,100,M,Other Race,Not Span/Hispanic,11,Emergency,Court/Law Enforcement,2020,EYE001,CORNEA AND EXTERNAL DISEASE,ADM015,ADMINISTRATION OF ANTIBIOTICS,073,ORBIT & EYE PROCEDURES,02,DISEASES AND DISORDERS OF THE EYE,1,Minor,Minor,Surgical,Medicaid,,,,,Y,71108.88,40893.58
New York City,Manhattan,7002001,001438,Bellevue Hospital Center,30 to 49,112,M,Other Race,Spanish/Hispanic,1,Emergency,Home or Self Care,2020,INJ011,"OPEN WOUNDS OF HEAD AND NECK, INITIAL ENCOUNTER",EYP001,EYE PROCEDURES,073,ORBIT & EYE PROCEDURES,02,DISEASES AND DISORDERS OF THE EYE,1,Minor,Minor,Surgical,Miscellaneous/Other,,,,,Y,22387.85,12874.89
New York City,Manhattan,7002001,001438,Bellevue Hospital Center,70 or Older,112,M,Black/African American,Not Span/Hispanic,2,Emergency,Home or Self Care,2020,INJ001,"FRACTURE OF HEAD AND NECK, INITIAL ENCOUNTER",MST012,BONE FIXATION (EXCLUDING EXTREMITIES),073,ORBIT & EYE PROCEDURES,02,DISEASES AND DISORDERS OF THE EYE,2,Moderate,Moderate,Surgical,Medicare,,,,,Y,34062.37,19588.72
