Hospital Service Area,Hospital County,Operating Certificate Number,Permanent Facility Id,Facility Name,Age Group,Zip Code - 3 digits,Gender,Race,Ethnicity,Length of Stay,Type of Admission,Patient Disposition,Discharge Year,CCS Diagnosis Code,CCS Diagnosis Description,CCS Procedure Code,CCS Procedure Description,APR DRG Code,APR DRG Description,APR MDC Code,APR MDC Description,APR Severity of Illness Code,APR Severity of Illness Description,APR Risk of Mortality,APR Medical Surgical Description,Payment Typology 1,Payment Typology 2,Payment Typology 3,Birth Weight,Abortion Edit Indicator,Emergency Department Indicator,Total Charges,Total Costs
New York City,Manhattan,7002053,001463,NYU Langone Hospitals,30 to 49,112,M,Black/African American,Not Span/Hispanic,1,Emergency,Psychiatric Hospital or Unit of Hosp,2020,EYE005,RETINAL AND VITREOUS CONDITIONS,EYP001,EYE PROCEDURES,073,ORBIT & EYE PROCEDURES,02,DISEASES AND DISORDERS OF THE EYE,2,Moderate,Minor,Surgical,Medicaid,,,,,Y,130825.63,24944.98
New York City,Manhattan,7002053,001463,NYU Langone Hospitals,18 to 29,OOS,F,Other Race,Not Span/Hispanic,2,Emergency,Home or Self Care,2020,INJ001,"FRACTURE OF HEAD AND NECK, INITIAL ENCOUNTER",MST012,BONE FIXATION (EXCLUDING EXTREMITIES),073,ORBIT & EYE PROCEDURES,02,DISEASES AND DISORDERS OF THE EYE,2,Moderate,Minor,Surgical,Private Health Insurance,,,,,Y,72342.37,14142.05
New York City,Manhattan,7002053,001463,NYU Langone Hospitals,0 to 17,112,M,White,Not Span/Hispanic,2,Emergency,Home or Self Care,2020,PNL009,PERINATAL INFECTIONS,ENT002,ENT DIAGNOSTIC ENDOSCOPY (EXCLUDING LARYNGOSCOPY),073,ORBIT & EYE PROCEDURES,02,DISEASES AND DISORDERS OF THE EYE,1,Minor,Minor,Surgical,Medicaid,,,02500,,Y,56855.13,9855.02
New York City,Manhattan,7002053,001463,NYU Langone Hospitals,0 to 17,104,F,White,Not Span/Hispanic,6,Urgent,Cancer Center or Children's Hospital,2020,EYE005,RETINAL AND VITREOUS CONDITIONS,RES001,BRONCHOSCOPY (DIAGNOSTIC),073,ORBIT & EYE PROCEDURES,02,DISEASES AND DISORDERS OF THE EYE,3,Major,Minor,Surgical,Medicaid,,,,,N,192670.74,42459.98
New York City,Manhattan,7002053,001463,NYU Langone Hospitals,0 to 17,104,F,Other Race,Spanish/Hispanic,50,Elective,Home or Self Care,2020,EYE005,RETINAL AND VITREOUS CONDITIONS,EYP001,EYE PROCEDURES,073,ORBIT & EYE PROCEDURES,02,DISEASES AND DISORDERS OF THE EYE,3,Major,Minor,Surgical,Medicaid,,,,,N,744102.83,234254.2
New York City,Manhattan,7002053,001463,NYU Langone Hospitals,70 or Older,OOS,F,White,Not Span/Hispanic,3,Emergency,Home w/ Home Health Services,2020,EYE004,UVEITIS AND OCULAR INFLAMMATION,EYP001,EYE PROCEDURES,073,ORBIT & EYE PROCEDURES,02,DISEASES AND DISORDERS OF THE EYE,2,Moderate,Minor,Surgical,Medicare,,,,,Y,97644.9,21814.58
New York City,Manhattan,7002053,001463,NYU Langone Hospitals,0 to 17,112,M,Other Race,Spanish/Hispanic,3,Emergency,Home or Self Care,2020,EYE008,OCULOFACIAL PLASTICS AND ORBITAL CONDITIONS,EYP002,EYELID PROCEDURES,073,ORBIT & EYE PROCEDURES,02,DISEASES AND DISORDERS OF THE EYE,1,Minor,Minor,Surgical,Medicaid,,,,,Y,67426.54,14475.74
New York City,Manhattan,7002053,001463,NYU Langone Hospitals,70 or Older,OOS,F,White,Not Span/Hispanic,4,Elective,Home or Self Care,2020,NEO026,SKIN CANCERS - BASAL CELL CARCINOMA,MST028,"SUBCUTANEOUS TISSUE AND FASCIA PROCEDURES, NEC",073,ORBIT & EYE PROCEDURES,02,DISEASES AND DISORDERS OF THE EYE,1,Minor,Minor,Surgical,Medicare,,,,,N,157443.77,33646.52
New York City,Manhattan,7002053,001463,NYU Langone Hospitals,70 or Older,115,M,White,Not Span/Hispanic,7,Emergency,Home w/ Home Health Services,2020,INJ011,"OPEN WOUNDS OF HEAD AND NECK, INITIAL ENCOUNTER",EYP001,EYE PROCEDURES,073,ORBIT & EYE PROCEDURES,02,DISEASES AND DISORDERS OF THE EYE,4,Extreme,Extreme,Surgical,Medicare,,,,,Y,207085.63,62244.69
New York City,Manhattan,7002053,001463,NYU Langone Hospitals,70 or Older,112,F,White,Not Span/Hispanic,6,Emergency,Inpatient Rehabilitation Facility,2020,INJ001,"FRACTURE OF HEAD AND NECK, INITIAL ENCOUNTER",MST029,"MUSCULOSKELETAL DEVICE PROCEDURES, NEC",073,ORBIT & EYE PROCEDURES,02,DISEASES AND DISORDERS OF THE EYE,3,Major,Minor,Surgical,Medicare,Blue Cross/Blue Shield,,,,Y,171855.63,44578.26
New York City,Manhattan,7002053,001463,NYU Langone Hospitals,0 to 17,112,M,White,Not Span/Hispanic,2,Elective,Home or Self Care,2020,EYE008,OCULOFACIAL PLASTICS AND ORBITAL CONDITIONS,EYP002,EYELID PROCEDURES,073,ORBIT & EYE PROCEDURES,02,DISEASES AND DISORDERS OF THE EYE,2,Moderate,Minor,Surgical,Medicaid,,,,,N,68981.19,14554.68
New York City,Manhattan,7002053,001463,NYU Langone Hospitals,0 to 17,112,F,Multi-racial,Not Span/Hispanic,2,Emergency,Home or Self Care,2020,EYE008,OCULOFACIAL PLASTICS AND ORBITAL CONDITIONS,EYP002,EYELID PROCEDURES,073,ORBIT & EYE PROCEDURES,02,DISEASES AND DISORDERS OF THE EYE,1,Minor,Minor,Surgical,Private Health Insurance,Medicaid,,03100,,Y,59535.11,11654.23
New York City,Manhattan,7002053,001463,NYU Langone Hospitals,70 or Older,100,M,Other Race,Spanish/Hispanic,9,Emergency,Home w/ Home Health Services,2020,EYE011,POSTPROCEDURAL OR POSTOPERATIVE EYE COMPLICATION,EYP001,EYE PROCEDURES,073,ORBIT & EYE PROCEDURES,02,DISEASES AND DISORDERS OF THE EYE,3,Major,Moderate,Surgical,Medicare,Medicaid,,,,Y,189362.27,50517.18
