Hospital Service Area,Hospital County,Operating Certificate Number,Permanent Facility Id,Facility Name,Age Group,Zip Code - 3 digits,Gender,Race,Ethnicity,Length of Stay,Type of Admission,Patient Disposition,Discharge Year,CCS Diagnosis Code,CCS Diagnosis Description,CCS Procedure Code,CCS Procedure Description,APR DRG Code,APR DRG Description,APR MDC Code,APR MDC Description,APR Severity of Illness Code,APR Severity of Illness Description,APR Risk of Mortality,APR Medical Surgical Description,Payment Typology 1,Payment Typology 2,Payment Typology 3,Birth Weight,Abortion Edit Indicator,Emergency Department Indicator,Total Charges,Total Costs
New York City,Manhattan,7002001,001438,Bellevue Hospital Center,50 to 69,100,F,Other Race,Unknown,120 +,Emergency,Psychiatric Hospital or Unit of Hosp,2020,MBD001,SCHIZOPHRENIA SPECTRUM AND OTHER PSYCHOTIC DISORDERS,MHT001,PHARMACOTHERAPY FOR MENTAL HEALTH (EXCLUDING SUBSTANCE USE),740,MENTAL ILLNESS DIAGNOSIS W O.R. PROCEDURE,19,MENTAL DISEASES AND DISORDERS,3,Major,Major,Surgical,Medicaid,,,,,Y,232262.26,133570.31
New York City,Manhattan,7002001,001438,Bellevue Hospital Center,30 to 49,113,M,Multi-racial,Not Span/Hispanic,68,Emergency,Court/Law Enforcement,2020,MBD001,SCHIZOPHRENIA SPECTRUM AND OTHER PSYCHOTIC DISORDERS,MST012,BONE FIXATION (EXCLUDING EXTREMITIES),740,MENTAL ILLNESS DIAGNOSIS W O.R. PROCEDURE,19,MENTAL DISEASES AND DISORDERS,2,Moderate,Minor,Surgical,Medicaid,,,,,Y,143208.18,82356.73
New York City,Manhattan,7002001,001438,Bellevue Hospital Center,50 to 69,104,F,Other Race,Spanish/Hispanic,26,Emergency,Home or Self Care,2020,MBD002,DEPRESSIVE DISORDERS,MHT001,PHARMACOTHERAPY FOR MENTAL HEALTH (EXCLUDING SUBSTANCE USE),740,MENTAL ILLNESS DIAGNOSIS W O.R. PROCEDURE,19,MENTAL DISEASES AND DISORDERS,2,Moderate,Moderate,Surgical,Medicaid,,,,,Y,131283.03,75498.77
New York City,Manhattan,7002001,001438,Bellevue Hospital Center,30 to 49,113,M,Black/African American,Spanish/Hispanic,64,Emergency,Court/Law Enforcement,2020,MBD001,SCHIZOPHRENIA SPECTRUM AND OTHER PSYCHOTIC DISORDERS,MST028,"SUBCUTANEOUS TISSUE AND FASCIA PROCEDURES, NEC",740,MENTAL ILLNESS DIAGNOSIS W O.R. PROCEDURE,19,MENTAL DISEASES AND DISORDERS,3,Major,Minor,Surgical,Medicaid,,,,,Y,255180.05,146749.96
New York City,Manhattan,7002001,001438,Bellevue Hospital Center,18 to 29,104,M,Multi-racial,Not Span/Hispanic,19,Emergency,Home or Self Care,2020,MBD001,SCHIZOPHRENIA SPECTRUM AND OTHER PSYCHOTIC DISORDERS,MHT002,PSYCHOTHERAPY FOR MENTAL HEALTH (EXCLUDING SUBSTANCE USE),740,MENTAL ILLNESS DIAGNOSIS W O.R. PROCEDURE,19,MENTAL DISEASES AND DISORDERS,2,Moderate,Minor,Surgical,Medicare,,,,,Y,94412.95,54295.38
New York City,Manhattan,7002001,001438,Bellevue Hospital Center,50 to 69,100,F,Other Race,Unknown,100,Elective,Home or Self Care,2020,MBD001,SCHIZOPHRENIA SPECTRUM AND OTHER PSYCHOTIC DISORDERS,MHT001,PHARMACOTHERAPY FOR MENTAL HEALTH (EXCLUDING SUBSTANCE USE),740,MENTAL ILLNESS DIAGNOSIS W O.R. PROCEDURE,19,MENTAL DISEASES AND DISORDERS,3,Major,Major,Surgical,Medicaid,,,,,N,222444.43,127924.23
New York City,Manhattan,7002001,001438,Bellevue Hospital Center,18 to 29,100,F,Multi-racial,Not Span/Hispanic,2,Emergency,Home or Self Care,2020,MBD009,PERSONALITY DISORDERS,MHT001,PHARMACOTHERAPY FOR MENTAL HEALTH (EXCLUDING SUBSTANCE USE),740,MENTAL ILLNESS DIAGNOSIS W O.R. PROCEDURE,19,MENTAL DISEASES AND DISORDERS,1,Minor,Minor,Surgical,Private Health Insurance,,,,,Y,9634.36,5540.57
New York City,Manhattan,7002001,001438,Bellevue Hospital Center,30 to 49,114,M,Other Race,Spanish/Hispanic,20,Urgent,Home or Self Care,2020,MBD003,BIPOLAR AND RELATED DISORDERS,MST009,FIXATION OF UPPER EXTREMITY BONES,740,MENTAL ILLNESS DIAGNOSIS W O.R. PROCEDURE,19,MENTAL DISEASES AND DISORDERS,2,Moderate,Moderate,Surgical,Medicaid,,,,,N,82663.54,47538.48
New York City,Manhattan,7002001,001438,Bellevue Hospital Center,18 to 29,,F,Other Race,Not Span/Hispanic,13,Urgent,Home or Self Care,2020,MBD007,TRAUMA- AND STRESSOR-RELATED DISORDERS,MHT002,PSYCHOTHERAPY FOR MENTAL HEALTH (EXCLUDING SUBSTANCE USE),740,MENTAL ILLNESS DIAGNOSIS W O.R. PROCEDURE,19,MENTAL DISEASES AND DISORDERS,1,Minor,Minor,Surgical,Self-Pay,,,,,N,70058.77,40289.68
New York City,Manhattan,7002001,001438,Bellevue Hospital Center,18 to 29,112,F,Black/African American,Not Span/Hispanic,35,Emergency,Home or Self Care,2020,MBD003,BIPOLAR AND RELATED DISORDERS,MST022,"TENDON, MUSCLE, BURSA, AND LIGAMENT REPAIR (EXCLUDING PERINEAL)",740,MENTAL ILLNESS DIAGNOSIS W O.R. PROCEDURE,19,MENTAL DISEASES AND DISORDERS,2,Moderate,Minor,Surgical,Private Health Insurance,,,,,Y,174515.32,100360.97
New York City,Manhattan,7002001,001438,Bellevue Hospital Center,50 to 69,113,M,Black/African American,Not Span/Hispanic,120 +,Urgent,Another Type Not Listed,2020,MBD001,SCHIZOPHRENIA SPECTRUM AND OTHER PSYCHOTIC DISORDERS,MHT001,PHARMACOTHERAPY FOR MENTAL HEALTH (EXCLUDING SUBSTANCE USE),740,MENTAL ILLNESS DIAGNOSIS W O.R. PROCEDURE,19,MENTAL DISEASES AND DISORDERS,3,Major,Major,Surgical,Medicaid,,,,,N,865847.39,497934.98
