Hospital Service Area,Hospital County,Operating Certificate Number,Permanent Facility Id,Facility Name,Age Group,Zip Code - 3 digits,Gender,Race,Ethnicity,Length of Stay,Type of Admission,Patient Disposition,Discharge Year,CCS Diagnosis Code,CCS Diagnosis Description,CCS Procedure Code,CCS Procedure Description,APR DRG Code,APR DRG Description,APR MDC Code,APR MDC Description,APR Severity of Illness Code,APR Severity of Illness Description,APR Risk of Mortality,APR Medical Surgical Description,Payment Typology 1,Payment Typology 2,Payment Typology 3,Birth Weight,Abortion Edit Indicator,Emergency Department Indicator,Total Charges,Total Costs
Long Island,Suffolk,5123000,000885,Long Island Community Hospital,50 to 69,117,F,White,Not Span/Hispanic,19,Emergency,Home or Self Care,2019,MBD001,SCHIZOPHRENIA SPECTRUM AND OTHER PSYCHOTIC DISORDERS,,,750,SCHIZOPHRENIA,19,MENTAL DISEASES AND DISORDERS,2,Moderate,Minor,Medical,Private Health Insurance,,,,,true,73223.08,17294.65
Long Island,Suffolk,5123000,000885,Long Island Community Hospital,50 to 69,119,M,White,Not Span/Hispanic,14,Emergency,Home or Self Care,2019,MBD001,SCHIZOPHRENIA SPECTRUM AND OTHER PSYCHOTIC DISORDERS,,,750,SCHIZOPHRENIA,19,MENTAL DISEASES AND DISORDERS,2,Moderate,Minor,Medical,Medicare,Medicaid,,,,true,58164.79,13360.19
Long Island,Suffolk,5123000,000885,Long Island Community Hospital,50 to 69,117,M,White,Not Span/Hispanic,1,Emergency,Short-term Hospital,2019,MBD001,SCHIZOPHRENIA SPECTRUM AND OTHER PSYCHOTIC DISORDERS,,,750,SCHIZOPHRENIA,19,MENTAL DISEASES AND DISORDERS,1,Minor,Minor,Medical,Medicare,Medicare,Medicaid,,,true,12034.09,1743.74
Long Island,Suffolk,5123000,000885,Long Island Community Hospital,18 to 29,OOS,M,Black/African American,Not Span/Hispanic,11,Emergency,Home or Self Care,2019,MBD001,SCHIZOPHRENIA SPECTRUM AND OTHER PSYCHOTIC DISORDERS,MHT001,PHARMACOTHERAPY FOR MENTAL HEALTH (EXCLUDING SUBSTANCE USE),750,SCHIZOPHRENIA,19,MENTAL DISEASES AND DISORDERS,1,Minor,Minor,Medical,Private Health Insurance,,,,,true,42974.82,10082.41
Long Island,Suffolk,5123000,000885,Long Island Community Hospital,50 to 69,119,M,White,Not Span/Hispanic,35,Emergency,Home or Self Care,2019,MBD001,SCHIZOPHRENIA SPECTRUM AND OTHER PSYCHOTIC DISORDERS,,,750,SCHIZOPHRENIA,19,MENTAL DISEASES AND DISORDERS,2,Moderate,Moderate,Medical,Medicare,Medicare,,,,true,123536.84,29964.53
Long Island,Suffolk,5123000,000885,Long Island Community Hospital,30 to 49,104,F,Other Race,Not Span/Hispanic,8,Emergency,Home or Self Care,2019,MBD001,SCHIZOPHRENIA SPECTRUM AND OTHER PSYCHOTIC DISORDERS,,,750,SCHIZOPHRENIA,19,MENTAL DISEASES AND DISORDERS,2,Moderate,Minor,Medical,Medicaid,,,,,true,30231.82,7127.05
Long Island,Suffolk,5123000,000885,Long Island Community Hospital,50 to 69,119,M,White,Not Span/Hispanic,11,Emergency,Home or Self Care,2019,MBD001,SCHIZOPHRENIA SPECTRUM AND OTHER PSYCHOTIC DISORDERS,SUD002,PHARMACOTHERAPY FOR SUBSTANCE USE,750,SCHIZOPHRENIA,19,MENTAL DISEASES AND DISORDERS,2,Moderate,Minor,Medical,Medicare,Medicaid,,,,true,48879.9,10902.35
Long Island,Suffolk,5123000,000885,Long Island Community Hospital,18 to 29,119,M,Other Race,Not Span/Hispanic,9,Emergency,Home or Self Care,2019,MBD001,SCHIZOPHRENIA SPECTRUM AND OTHER PSYCHOTIC DISORDERS,SUD002,PHARMACOTHERAPY FOR SUBSTANCE USE,750,SCHIZOPHRENIA,19,MENTAL DISEASES AND DISORDERS,2,Moderate,Minor,Medical,Private Health Insurance,,,,,true,36439,8300.02
Long Island,Suffolk,5123000,000885,Long Island Community Hospital,30 to 49,,M,White,Not Span/Hispanic,120 +,Emergency,Home or Self Care,2019,MBD001,SCHIZOPHRENIA SPECTRUM AND OTHER PSYCHOTIC DISORDERS,SUD002,PHARMACOTHERAPY FOR SUBSTANCE USE,750,SCHIZOPHRENIA,19,MENTAL DISEASES AND DISORDERS,2,Moderate,Minor,Medical,Private Health Insurance,,,,,false,499487.89,119955.5
Long Island,Suffolk,5123000,000885,Long Island Community Hospital,18 to 29,117,M,White,Not Span/Hispanic,1,Emergency,Home or Self Care,2019,MBD001,SCHIZOPHRENIA SPECTRUM AND OTHER PSYCHOTIC DISORDERS,,,750,SCHIZOPHRENIA,19,MENTAL DISEASES AND DISORDERS,1,Minor,Minor,Medical,Private Health Insurance,,,,,true,9006.03,1492.68
Long Island,Suffolk,5123000,000885,Long Island Community Hospital,50 to 69,117,F,White,Not Span/Hispanic,23,Emergency,Home or Self Care,2019,MBD001,SCHIZOPHRENIA SPECTRUM AND OTHER PSYCHOTIC DISORDERS,SUD002,PHARMACOTHERAPY FOR SUBSTANCE USE,750,SCHIZOPHRENIA,19,MENTAL DISEASES AND DISORDERS,2,Moderate,Minor,Medical,Medicare,Medicare,Medicaid,,,true,90275.74,20061.27
Long Island,Suffolk,5123000,000885,Long Island Community Hospital,30 to 49,117,F,White,Not Span/Hispanic,29,Emergency,Home or Self Care,2019,MBD001,SCHIZOPHRENIA SPECTRUM AND OTHER PSYCHOTIC DISORDERS,,,750,SCHIZOPHRENIA,19,MENTAL DISEASES AND DISORDERS,2,Moderate,Minor,Medical,Private Health Insurance,,,,,true,111016.59,25441.78
Long Island,Suffolk,5123000,000885,Long Island Community Hospital,50 to 69,117,M,White,Not Span/Hispanic,20,Emergency,Home or Self Care,2019,MBD001,SCHIZOPHRENIA SPECTRUM AND OTHER PSYCHOTIC DISORDERS,,,750,SCHIZOPHRENIA,19,MENTAL DISEASES AND DISORDERS,2,Moderate,Minor,Medical,Private Health Insurance,,,,,true,72756.66,17469.07
Long Island,Suffolk,5123000,000885,Long Island Community Hospital,30 to 49,117,M,Black/African American,Not Span/Hispanic,4,Emergency,Home or Self Care,2019,MBD001,SCHIZOPHRENIA SPECTRUM AND OTHER PSYCHOTIC DISORDERS,,,750,SCHIZOPHRENIA,19,MENTAL DISEASES AND DISORDERS,2,Moderate,Minor,Medical,Self-Pay,,,,,true,17435.42,3875.77
Long Island,Suffolk,5123000,000885,Long Island Community Hospital,18 to 29,117,F,White,Not Span/Hispanic,13,Emergency,Home or Self Care,2019,MBD001,SCHIZOPHRENIA SPECTRUM AND OTHER PSYCHOTIC DISORDERS,SUD002,PHARMACOTHERAPY FOR SUBSTANCE USE,750,SCHIZOPHRENIA,19,MENTAL DISEASES AND DISORDERS,2,Moderate,Minor,Medical,Blue Cross/Blue Shield,Medicaid,,,,true,49161.32,11457.24
Long Island,Suffolk,5123000,000885,Long Island Community Hospital,30 to 49,117,M,White,Not Span/Hispanic,25,Emergency,Home or Self Care,2019,MBD001,SCHIZOPHRENIA SPECTRUM AND OTHER PSYCHOTIC DISORDERS,,,750,SCHIZOPHRENIA,19,MENTAL DISEASES AND DISORDERS,2,Moderate,Minor,Medical,Medicare,Medicare,Medicaid,,,true,91112.92,21947.08
Long Island,Suffolk,5123000,000885,Long Island Community Hospital,30 to 49,119,M,White,Not Span/Hispanic,18,Emergency,Home or Self Care,2019,MBD001,SCHIZOPHRENIA SPECTRUM AND OTHER PSYCHOTIC DISORDERS,,,750,SCHIZOPHRENIA,19,MENTAL DISEASES AND DISORDERS,2,Moderate,Minor,Medical,Medicare,Medicare,Medicaid,,,true,65647.11,15803.74
Long Island,Suffolk,5123000,000885,Long Island Community Hospital,50 to 69,119,F,White,Not Span/Hispanic,20,Emergency,Home or Self Care,2019,MBD001,SCHIZOPHRENIA SPECTRUM AND OTHER PSYCHOTIC DISORDERS,SUD002,PHARMACOTHERAPY FOR SUBSTANCE USE,750,SCHIZOPHRENIA,19,MENTAL DISEASES AND DISORDERS,2,Moderate,Minor,Medical,Medicare,Medicare,,,,true,79202.21,18641.74
Long Island,Suffolk,5123000,000885,Long Island Community Hospital,50 to 69,117,F,White,Not Span/Hispanic,60,Emergency,Home or Self Care,2019,MBD001,SCHIZOPHRENIA SPECTRUM AND OTHER PSYCHOTIC DISORDERS,MHT001,PHARMACOTHERAPY FOR MENTAL HEALTH (EXCLUDING SUBSTANCE USE),750,SCHIZOPHRENIA,19,MENTAL DISEASES AND DISORDERS,2,Moderate,Minor,Medical,Medicare,Medicare,Medicaid,,,true,249683.03,55582.16
Long Island,Suffolk,5123000,000885,Long Island Community Hospital,50 to 69,117,M,White,Not Span/Hispanic,23,Emergency,Home or Self Care,2019,MBD001,SCHIZOPHRENIA SPECTRUM AND OTHER PSYCHOTIC DISORDERS,,,750,SCHIZOPHRENIA,19,MENTAL DISEASES AND DISORDERS,1,Minor,Minor,Medical,Medicare,Medicare,Medicaid,,,true,96479.28,22882.96
Long Island,Suffolk,5123000,000885,Long Island Community Hospital,30 to 49,117,F,White,Not Span/Hispanic,12,Emergency,Home or Self Care,2019,MBD001,SCHIZOPHRENIA SPECTRUM AND OTHER PSYCHOTIC DISORDERS,MHT001,PHARMACOTHERAPY FOR MENTAL HEALTH (EXCLUDING SUBSTANCE USE),750,SCHIZOPHRENIA,19,MENTAL DISEASES AND DISORDERS,2,Moderate,Minor,Medical,Medicare,Medicaid,,,,true,46699.14,10721
Long Island,Suffolk,5123000,000885,Long Island Community Hospital,50 to 69,119,F,White,Not Span/Hispanic,9,Emergency,Home or Self Care,2019,MBD001,SCHIZOPHRENIA SPECTRUM AND OTHER PSYCHOTIC DISORDERS,,,750,SCHIZOPHRENIA,19,MENTAL DISEASES AND DISORDERS,2,Moderate,Minor,Medical,Medicare,Medicare,Medicaid,,,true,46819.74,8612.62
Long Island,Suffolk,5123000,000885,Long Island Community Hospital,30 to 49,117,M,White,Not Span/Hispanic,8,Emergency,Home or Self Care,2019,MBD001,SCHIZOPHRENIA SPECTRUM AND OTHER PSYCHOTIC DISORDERS,,,750,SCHIZOPHRENIA,19,MENTAL DISEASES AND DISORDERS,2,Moderate,Minor,Medical,Medicare,Medicare,Medicaid,,,true,32547.15,7322.26
Long Island,Suffolk,5123000,000885,Long Island Community Hospital,30 to 49,117,M,White,Not Span/Hispanic,2,Emergency,Short-term Hospital,2019,MBD001,SCHIZOPHRENIA SPECTRUM AND OTHER PSYCHOTIC DISORDERS,SUD002,PHARMACOTHERAPY FOR SUBSTANCE USE,750,SCHIZOPHRENIA,19,MENTAL DISEASES AND DISORDERS,2,Moderate,Minor,Medical,Private Health Insurance,,,,,true,14054.19,2390.2
Long Island,Suffolk,5123000,000885,Long Island Community Hospital,50 to 69,117,F,White,Not Span/Hispanic,11,Emergency,Home or Self Care,2019,MBD001,SCHIZOPHRENIA SPECTRUM AND OTHER PSYCHOTIC DISORDERS,SUD002,PHARMACOTHERAPY FOR SUBSTANCE USE,750,SCHIZOPHRENIA,19,MENTAL DISEASES AND DISORDERS,2,Moderate,Minor,Medical,Medicare,Medicare,Medicaid,,,true,44588.89,9973.78
Long Island,Suffolk,5123000,000885,Long Island Community Hospital,30 to 49,117,M,Black/African American,Not Span/Hispanic,24,Emergency,Home or Self Care,2019,MBD001,SCHIZOPHRENIA SPECTRUM AND OTHER PSYCHOTIC DISORDERS,,,750,SCHIZOPHRENIA,19,MENTAL DISEASES AND DISORDERS,2,Moderate,Minor,Medical,Medicaid,,,,,true,87369.37,20812.71
Long Island,Suffolk,5123000,000885,Long Island Community Hospital,18 to 29,117,M,Other Race,Not Span/Hispanic,11,Emergency,Home or Self Care,2019,MBD001,SCHIZOPHRENIA SPECTRUM AND OTHER PSYCHOTIC DISORDERS,,,750,SCHIZOPHRENIA,19,MENTAL DISEASES AND DISORDERS,2,Moderate,Minor,Medical,Medicaid,,,,,true,43720.14,9876.09
Long Island,Suffolk,5123000,000885,Long Island Community Hospital,30 to 49,119,F,Black/African American,Not Span/Hispanic,16,Emergency,Home or Self Care,2019,MBD001,SCHIZOPHRENIA SPECTRUM AND OTHER PSYCHOTIC DISORDERS,,,750,SCHIZOPHRENIA,19,MENTAL DISEASES AND DISORDERS,2,Moderate,Minor,Medical,Medicaid,,,,,true,62953.57,14920.28
Long Island,Suffolk,5123000,000885,Long Island Community Hospital,18 to 29,117,M,Other Race,Not Span/Hispanic,63,Emergency,Home or Self Care,2019,MBD001,SCHIZOPHRENIA SPECTRUM AND OTHER PSYCHOTIC DISORDERS,MHT001,PHARMACOTHERAPY FOR MENTAL HEALTH (EXCLUDING SUBSTANCE USE),750,SCHIZOPHRENIA,19,MENTAL DISEASES AND DISORDERS,2,Moderate,Minor,Medical,Private Health Insurance,,,,,false,219398.91,53630.29
Long Island,Suffolk,5123000,000885,Long Island Community Hospital,50 to 69,117,F,White,Not Span/Hispanic,1,Emergency,Short-term Hospital,2019,MBD001,SCHIZOPHRENIA SPECTRUM AND OTHER PSYCHOTIC DISORDERS,SUD002,PHARMACOTHERAPY FOR SUBSTANCE USE,750,SCHIZOPHRENIA,19,MENTAL DISEASES AND DISORDERS,2,Moderate,Minor,Medical,Medicare,Medicare,Medicaid,,,true,11481.23,1709.42
Long Island,Suffolk,5123000,000885,Long Island Community Hospital,50 to 69,117,F,White,Not Span/Hispanic,13,Emergency,Home or Self Care,2019,MBD001,SCHIZOPHRENIA SPECTRUM AND OTHER PSYCHOTIC DISORDERS,,,750,SCHIZOPHRENIA,19,MENTAL DISEASES AND DISORDERS,2,Moderate,Minor,Medical,Medicare,Medicare,Medicaid,,,true,49652.67,11596.43
Long Island,Suffolk,5123000,000885,Long Island Community Hospital,50 to 69,117,M,White,Not Span/Hispanic,16,Urgent,Home or Self Care,2019,MBD001,SCHIZOPHRENIA SPECTRUM AND OTHER PSYCHOTIC DISORDERS,,,750,SCHIZOPHRENIA,19,MENTAL DISEASES AND DISORDERS,1,Minor,Minor,Medical,Medicare,Medicare,Medicaid,,,false,57994.82,13820.94
Long Island,Suffolk,5123000,000885,Long Island Community Hospital,18 to 29,119,M,Other Race,Not Span/Hispanic,101,Emergency,Psychiatric Hospital or Unit of Hosp,2019,MBD001,SCHIZOPHRENIA SPECTRUM AND OTHER PSYCHOTIC DISORDERS,SUD002,PHARMACOTHERAPY FOR SUBSTANCE USE,750,SCHIZOPHRENIA,19,MENTAL DISEASES AND DISORDERS,2,Moderate,Minor,Medical,Medicare,Medicare,Medicaid,,,true,360610.69,86930.85
Long Island,Suffolk,5123000,000885,Long Island Community Hospital,50 to 69,119,M,White,Not Span/Hispanic,13,Emergency,Home or Self Care,2019,MBD001,SCHIZOPHRENIA SPECTRUM AND OTHER PSYCHOTIC DISORDERS,SUD002,PHARMACOTHERAPY FOR SUBSTANCE USE,750,SCHIZOPHRENIA,19,MENTAL DISEASES AND DISORDERS,1,Minor,Moderate,Medical,Medicare,Medicare,Medicaid,,,true,57525.48,12218.06
Long Island,Suffolk,5123000,000885,Long Island Community Hospital,30 to 49,119,F,Black/African American,Not Span/Hispanic,7,Emergency,Home or Self Care,2019,MBD001,SCHIZOPHRENIA SPECTRUM AND OTHER PSYCHOTIC DISORDERS,,,750,SCHIZOPHRENIA,19,MENTAL DISEASES AND DISORDERS,2,Moderate,Minor,Medical,Medicare,Medicare,Medicaid,,,true,29407.41,6452.97
Long Island,Suffolk,5123000,000885,Long Island Community Hospital,18 to 29,117,M,White,Not Span/Hispanic,14,Emergency,Home or Self Care,2019,MBD001,SCHIZOPHRENIA SPECTRUM AND OTHER PSYCHOTIC DISORDERS,,,750,SCHIZOPHRENIA,19,MENTAL DISEASES AND DISORDERS,2,Moderate,Minor,Medical,Medicare,Medicare,Medicaid,,,true,51405.24,12287.38
Long Island,Suffolk,5123000,000885,Long Island Community Hospital,50 to 69,117,M,Other Race,Not Span/Hispanic,8,Emergency,Home or Self Care,2019,MBD001,SCHIZOPHRENIA SPECTRUM AND OTHER PSYCHOTIC DISORDERS,,,750,SCHIZOPHRENIA,19,MENTAL DISEASES AND DISORDERS,1,Minor,Minor,Medical,Private Health Insurance,,,,,true,33426.28,7521.49
Long Island,Suffolk,5123000,000885,Long Island Community Hospital,50 to 69,119,M,Black/African American,Not Span/Hispanic,7,Emergency,Home or Self Care,2019,MBD001,SCHIZOPHRENIA SPECTRUM AND OTHER PSYCHOTIC DISORDERS,SUD002,PHARMACOTHERAPY FOR SUBSTANCE USE,750,SCHIZOPHRENIA,19,MENTAL DISEASES AND DISORDERS,1,Minor,Minor,Medical,Medicare,Medicare,,,,true,28790.67,6580.35
Long Island,Suffolk,5123000,000885,Long Island Community Hospital,50 to 69,117,F,White,Not Span/Hispanic,4,Emergency,Skilled Nursing Home,2019,MBD001,SCHIZOPHRENIA SPECTRUM AND OTHER PSYCHOTIC DISORDERS,,,750,SCHIZOPHRENIA,19,MENTAL DISEASES AND DISORDERS,2,Moderate,Moderate,Medical,Medicare,Medicare,Medicaid,,,true,21909.29,5164.63
Long Island,Suffolk,5123000,000885,Long Island Community Hospital,18 to 29,117,M,Other Race,Not Span/Hispanic,7,Emergency,Short-term Hospital,2019,MBD001,SCHIZOPHRENIA SPECTRUM AND OTHER PSYCHOTIC DISORDERS,,,750,SCHIZOPHRENIA,19,MENTAL DISEASES AND DISORDERS,1,Minor,Minor,Medical,Private Health Insurance,,,,,true,32610.89,6673.79
Long Island,Suffolk,5123000,000885,Long Island Community Hospital,18 to 29,119,M,White,Not Span/Hispanic,60,Urgent,Psychiatric Hospital or Unit of Hosp,2019,MBD001,SCHIZOPHRENIA SPECTRUM AND OTHER PSYCHOTIC DISORDERS,SUD002,PHARMACOTHERAPY FOR SUBSTANCE USE,750,SCHIZOPHRENIA,19,MENTAL DISEASES AND DISORDERS,2,Moderate,Minor,Medical,Private Health Insurance,,,,,false,227845.62,53773.62
Long Island,Suffolk,5123000,000885,Long Island Community Hospital,30 to 49,112,M,Black/African American,Not Span/Hispanic,54,Emergency,Home or Self Care,2019,MBD001,SCHIZOPHRENIA SPECTRUM AND OTHER PSYCHOTIC DISORDERS,,,750,SCHIZOPHRENIA,19,MENTAL DISEASES AND DISORDERS,2,Moderate,Minor,Medical,Private Health Insurance,,,,,true,184677.4,45531.64
Long Island,Suffolk,5123000,000885,Long Island Community Hospital,50 to 69,,M,Black/African American,Not Span/Hispanic,15,Emergency,Home or Self Care,2019,MBD001,SCHIZOPHRENIA SPECTRUM AND OTHER PSYCHOTIC DISORDERS,SUD002,PHARMACOTHERAPY FOR SUBSTANCE USE,750,SCHIZOPHRENIA,19,MENTAL DISEASES AND DISORDERS,2,Moderate,Minor,Medical,Medicare,Medicare,Medicaid,,,true,54142.87,13049.26
Long Island,Suffolk,5123000,000885,Long Island Community Hospital,50 to 69,117,M,Black/African American,Not Span/Hispanic,20,Emergency,Home or Self Care,2019,MBD001,SCHIZOPHRENIA SPECTRUM AND OTHER PSYCHOTIC DISORDERS,,,750,SCHIZOPHRENIA,19,MENTAL DISEASES AND DISORDERS,2,Moderate,Minor,Medical,Medicare,Medicare,Medicaid,,,true,72496.46,17250.76
Long Island,Suffolk,5123000,000885,Long Island Community Hospital,30 to 49,117,M,White,Not Span/Hispanic,13,Emergency,Home or Self Care,2019,MBD001,SCHIZOPHRENIA SPECTRUM AND OTHER PSYCHOTIC DISORDERS,SUD002,PHARMACOTHERAPY FOR SUBSTANCE USE,750,SCHIZOPHRENIA,19,MENTAL DISEASES AND DISORDERS,2,Moderate,Minor,Medical,Medicare,Medicare,Medicaid,,,true,55484.47,12921.98
Long Island,Suffolk,5123000,000885,Long Island Community Hospital,30 to 49,117,M,White,Not Span/Hispanic,13,Emergency,Home or Self Care,2019,MBD001,SCHIZOPHRENIA SPECTRUM AND OTHER PSYCHOTIC DISORDERS,,,750,SCHIZOPHRENIA,19,MENTAL DISEASES AND DISORDERS,2,Moderate,Minor,Medical,Medicare,Medicare,Medicaid,,,true,50928.45,11969.67
Long Island,Suffolk,5123000,000885,Long Island Community Hospital,50 to 69,117,M,Black/African American,Not Span/Hispanic,20,Emergency,Home or Self Care,2019,MBD001,SCHIZOPHRENIA SPECTRUM AND OTHER PSYCHOTIC DISORDERS,SUD002,PHARMACOTHERAPY FOR SUBSTANCE USE,750,SCHIZOPHRENIA,19,MENTAL DISEASES AND DISORDERS,2,Moderate,Minor,Medical,Medicare,Medicaid,,,,true,74712.49,17578.12
Long Island,Suffolk,5123000,000885,Long Island Community Hospital,30 to 49,117,M,White,Not Span/Hispanic,18,Emergency,Home or Self Care,2019,MBD001,SCHIZOPHRENIA SPECTRUM AND OTHER PSYCHOTIC DISORDERS,SUD002,PHARMACOTHERAPY FOR SUBSTANCE USE,750,SCHIZOPHRENIA,19,MENTAL DISEASES AND DISORDERS,1,Minor,Minor,Medical,Medicare,Medicare,Medicaid,,,true,68644.83,16296.13
Long Island,Suffolk,5123000,000885,Long Island Community Hospital,30 to 49,117,M,White,Not Span/Hispanic,14,Emergency,Home or Self Care,2019,MBD001,SCHIZOPHRENIA SPECTRUM AND OTHER PSYCHOTIC DISORDERS,SUD002,PHARMACOTHERAPY FOR SUBSTANCE USE,750,SCHIZOPHRENIA,19,MENTAL DISEASES AND DISORDERS,2,Moderate,Minor,Medical,Medicare,Medicare,Medicaid,,,true,63445.84,14151.35
Long Island,Suffolk,5123000,000885,Long Island Community Hospital,30 to 49,117,M,White,Not Span/Hispanic,19,Emergency,Home or Self Care,2019,MBD001,SCHIZOPHRENIA SPECTRUM AND OTHER PSYCHOTIC DISORDERS,SUD002,PHARMACOTHERAPY FOR SUBSTANCE USE,750,SCHIZOPHRENIA,19,MENTAL DISEASES AND DISORDERS,2,Moderate,Minor,Medical,Medicare,Medicare,Medicaid,,,true,71176.77,16836.32
Long Island,Suffolk,5123000,000885,Long Island Community Hospital,30 to 49,117,M,White,Not Span/Hispanic,19,Urgent,Home or Self Care,2019,MBD001,SCHIZOPHRENIA SPECTRUM AND OTHER PSYCHOTIC DISORDERS,,,750,SCHIZOPHRENIA,19,MENTAL DISEASES AND DISORDERS,2,Moderate,Minor,Medical,Private Health Insurance,,,,,false,65389.76,16051.11
Long Island,Suffolk,5123000,000885,Long Island Community Hospital,18 to 29,117,M,Black/African American,Not Span/Hispanic,15,Emergency,Home or Self Care,2019,MBD001,SCHIZOPHRENIA SPECTRUM AND OTHER PSYCHOTIC DISORDERS,,,750,SCHIZOPHRENIA,19,MENTAL DISEASES AND DISORDERS,1,Minor,Minor,Medical,Medicaid,,,,,true,55466.91,13216.25
Long Island,Suffolk,5123000,000885,Long Island Community Hospital,30 to 49,117,F,White,Not Span/Hispanic,2,Emergency,Home or Self Care,2019,MBD001,SCHIZOPHRENIA SPECTRUM AND OTHER PSYCHOTIC DISORDERS,,,750,SCHIZOPHRENIA,19,MENTAL DISEASES AND DISORDERS,2,Moderate,Minor,Medical,Medicare,Medicare,Medicaid,,,true,11522.06,2202.72
Long Island,Suffolk,5123000,000885,Long Island Community Hospital,30 to 49,119,M,Black/African American,Not Span/Hispanic,2,Emergency,Home or Self Care,2019,MBD001,SCHIZOPHRENIA SPECTRUM AND OTHER PSYCHOTIC DISORDERS,SUD002,PHARMACOTHERAPY FOR SUBSTANCE USE,750,SCHIZOPHRENIA,19,MENTAL DISEASES AND DISORDERS,2,Moderate,Minor,Medical,Private Health Insurance,,,,,true,11388.45,2195.07
Long Island,Suffolk,5123000,000885,Long Island Community Hospital,30 to 49,112,M,Black/African American,Not Span/Hispanic,12,Emergency,Home or Self Care,2019,MBD001,SCHIZOPHRENIA SPECTRUM AND OTHER PSYCHOTIC DISORDERS,,,750,SCHIZOPHRENIA,19,MENTAL DISEASES AND DISORDERS,2,Moderate,Minor,Medical,Private Health Insurance,,,,,true,44996.33,10650.95
Long Island,Suffolk,5123000,000885,Long Island Community Hospital,18 to 29,117,M,White,Not Span/Hispanic,16,Emergency,Home or Self Care,2019,MBD001,SCHIZOPHRENIA SPECTRUM AND OTHER PSYCHOTIC DISORDERS,SUD002,PHARMACOTHERAPY FOR SUBSTANCE USE,750,SCHIZOPHRENIA,19,MENTAL DISEASES AND DISORDERS,2,Moderate,Minor,Medical,Private Health Insurance,,,,,true,73112.35,14690.27
Long Island,Suffolk,5123000,000885,Long Island Community Hospital,50 to 69,117,F,White,Not Span/Hispanic,21,Emergency,Home or Self Care,2019,MBD001,SCHIZOPHRENIA SPECTRUM AND OTHER PSYCHOTIC DISORDERS,,,750,SCHIZOPHRENIA,19,MENTAL DISEASES AND DISORDERS,2,Moderate,Moderate,Medical,Medicaid,,,,,true,97794.02,19592.65
Long Island,Suffolk,5123000,000885,Long Island Community Hospital,18 to 29,119,M,Other Race,Not Span/Hispanic,33,Emergency,Home or Self Care,2019,MBD001,SCHIZOPHRENIA SPECTRUM AND OTHER PSYCHOTIC DISORDERS,SUD002,PHARMACOTHERAPY FOR SUBSTANCE USE,750,SCHIZOPHRENIA,19,MENTAL DISEASES AND DISORDERS,2,Moderate,Minor,Medical,Private Health Insurance,,,,,true,147337.78,31733.41
Long Island,Suffolk,5123000,000885,Long Island Community Hospital,18 to 29,117,M,White,Not Span/Hispanic,9,Urgent,Home or Self Care,2019,MBD001,SCHIZOPHRENIA SPECTRUM AND OTHER PSYCHOTIC DISORDERS,,,750,SCHIZOPHRENIA,19,MENTAL DISEASES AND DISORDERS,1,Minor,Minor,Medical,Blue Cross/Blue Shield,,,,,false,31399.16,7610.44
Long Island,Suffolk,5123000,000885,Long Island Community Hospital,18 to 29,117,F,White,Not Span/Hispanic,24,Emergency,Home or Self Care,2019,MBD001,SCHIZOPHRENIA SPECTRUM AND OTHER PSYCHOTIC DISORDERS,,,750,SCHIZOPHRENIA,19,MENTAL DISEASES AND DISORDERS,2,Moderate,Minor,Medical,Private Health Insurance,,,,,true,107064.91,24223.97
Long Island,Suffolk,5123000,000885,Long Island Community Hospital,18 to 29,117,F,White,Not Span/Hispanic,14,Emergency,Home or Self Care,2019,MBD001,SCHIZOPHRENIA SPECTRUM AND OTHER PSYCHOTIC DISORDERS,,,750,SCHIZOPHRENIA,19,MENTAL DISEASES AND DISORDERS,2,Moderate,Minor,Medical,Private Health Insurance,,,,,true,51934.57,12291.3
Long Island,Suffolk,5123000,000885,Long Island Community Hospital,50 to 69,119,M,Other Race,Not Span/Hispanic,16,Emergency,Home or Self Care,2019,MBD001,SCHIZOPHRENIA SPECTRUM AND OTHER PSYCHOTIC DISORDERS,,,750,SCHIZOPHRENIA,19,MENTAL DISEASES AND DISORDERS,2,Moderate,Moderate,Medical,Blue Cross/Blue Shield,,,,,false,54202.85,13463.72
Long Island,Suffolk,5123000,000885,Long Island Community Hospital,50 to 69,117,F,White,Not Span/Hispanic,4,Urgent,Short-term Hospital,2019,MBD001,SCHIZOPHRENIA SPECTRUM AND OTHER PSYCHOTIC DISORDERS,ESA004,NON-INVASIVE VENTILATION,750,SCHIZOPHRENIA,19,MENTAL DISEASES AND DISORDERS,3,Major,Major,Medical,Private Health Insurance,,,,,false,18066.96,3719.36
Long Island,Suffolk,5123000,000885,Long Island Community Hospital,30 to 49,117,F,White,Not Span/Hispanic,20,Emergency,Home or Self Care,2019,MBD001,SCHIZOPHRENIA SPECTRUM AND OTHER PSYCHOTIC DISORDERS,,,750,SCHIZOPHRENIA,19,MENTAL DISEASES AND DISORDERS,1,Minor,Minor,Medical,Medicare,Medicare,Medicaid,,,true,77486.14,18060.69
Long Island,Suffolk,5123000,000885,Long Island Community Hospital,30 to 49,119,F,Black/African American,Not Span/Hispanic,15,Emergency,Home or Self Care,2019,MBD001,SCHIZOPHRENIA SPECTRUM AND OTHER PSYCHOTIC DISORDERS,,,750,SCHIZOPHRENIA,19,MENTAL DISEASES AND DISORDERS,2,Moderate,Minor,Medical,Private Health Insurance,,,,,true,68400.27,15560.52
Long Island,Suffolk,5123000,000885,Long Island Community Hospital,30 to 49,117,M,Black/African American,Not Span/Hispanic,5,Emergency,Home or Self Care,2019,MBD001,SCHIZOPHRENIA SPECTRUM AND OTHER PSYCHOTIC DISORDERS,SUD002,PHARMACOTHERAPY FOR SUBSTANCE USE,750,SCHIZOPHRENIA,19,MENTAL DISEASES AND DISORDERS,2,Moderate,Minor,Medical,Medicaid,,,,,true,23648.13,4993.97