Hospital Service Area,Hospital County,Operating Certificate Number,Permanent Facility Id,Facility Name,Age Group,Zip Code - 3 digits,Gender,Race,Ethnicity,Length of Stay,Type of Admission,Patient Disposition,Discharge Year,CCS Diagnosis Code,CCS Diagnosis Description,CCS Procedure Code,CCS Procedure Description,APR DRG Code,APR DRG Description,APR MDC Code,APR MDC Description,APR Severity of Illness Code,APR Severity of Illness Description,APR Risk of Mortality,APR Medical Surgical Description,Payment Typology 1,Payment Typology 2,Payment Typology 3,Birth Weight,Abortion Edit Indicator,Emergency Department Indicator,Total Charges,Total Costs
New York City,Manhattan,7002053,001463,NYU Langone Hospitals,18 to 29,OOS,M,White,Unknown,8,Emergency,Home or Self Care,2020,MBD001,SCHIZOPHRENIA SPECTRUM AND OTHER PSYCHOTIC DISORDERS,,,750,SCHIZOPHRENIA,19,MENTAL DISEASES AND DISORDERS,2,Moderate,Minor,Medical,Medicaid,,,,,Y,51198.71,21441.49
New York City,Manhattan,7002053,001463,NYU Langone Hospitals,18 to 29,100,F,Black/African American,Unknown,10,Elective,Home or Self Care,2020,MBD001,SCHIZOPHRENIA SPECTRUM AND OTHER PSYCHOTIC DISORDERS,MHT001,PHARMACOTHERAPY FOR MENTAL HEALTH (EXCLUDING SUBSTANCE USE),750,SCHIZOPHRENIA,19,MENTAL DISEASES AND DISORDERS,2,Moderate,Minor,Medical,Medicaid,,,,,N,55733.38,25986.1
New York City,Manhattan,7002053,001463,NYU Langone Hospitals,18 to 29,100,M,Black/African American,Not Span/Hispanic,17,Emergency,Home or Self Care,2020,MBD001,SCHIZOPHRENIA SPECTRUM AND OTHER PSYCHOTIC DISORDERS,,,750,SCHIZOPHRENIA,19,MENTAL DISEASES AND DISORDERS,1,Minor,Minor,Medical,Self-Pay,,,,,Y,101737.58,42833.68
New York City,Manhattan,7002053,001463,NYU Langone Hospitals,30 to 49,104,M,Other Race,Unknown,5,Elective,Home or Self Care,2020,MBD001,SCHIZOPHRENIA SPECTRUM AND OTHER PSYCHOTIC DISORDERS,MHT002,PSYCHOTHERAPY FOR MENTAL HEALTH (EXCLUDING SUBSTANCE USE),750,SCHIZOPHRENIA,19,MENTAL DISEASES AND DISORDERS,2,Moderate,Moderate,Medical,Medicaid,,,,,N,39468.96,13790.54
New York City,Manhattan,7002053,001463,NYU Langone Hospitals,18 to 29,103,M,Black/African American,Not Span/Hispanic,4,Emergency,Short-term Hospital,2020,MBD001,SCHIZOPHRENIA SPECTRUM AND OTHER PSYCHOTIC DISORDERS,OTR004,ISOLATION PROCEDURES,750,SCHIZOPHRENIA,19,MENTAL DISEASES AND DISORDERS,2,Moderate,Minor,Medical,Medicaid,,,,,Y,33067.44,11800.86
New York City,Manhattan,7002053,001463,NYU Langone Hospitals,50 to 69,100,M,Black/African American,Not Span/Hispanic,9,Emergency,Home or Self Care,2020,MBD001,SCHIZOPHRENIA SPECTRUM AND OTHER PSYCHOTIC DISORDERS,,,750,SCHIZOPHRENIA,19,MENTAL DISEASES AND DISORDERS,2,Moderate,Minor,Medical,Self-Pay,,,,,Y,59857.69,22145.65
New York City,Manhattan,7002053,001463,NYU Langone Hospitals,18 to 29,,M,White,Not Span/Hispanic,19,Emergency,Home or Self Care,2020,MBD001,SCHIZOPHRENIA SPECTRUM AND OTHER PSYCHOTIC DISORDERS,,,750,SCHIZOPHRENIA,19,MENTAL DISEASES AND DISORDERS,2,Moderate,Minor,Medical,Private Health Insurance,,,,,Y,115115.42,49663.53
New York City,Manhattan,7002053,001463,NYU Langone Hospitals,30 to 49,100,F,White,Not Span/Hispanic,4,Emergency,Home or Self Care,2020,MBD001,SCHIZOPHRENIA SPECTRUM AND OTHER PSYCHOTIC DISORDERS,MHT002,PSYCHOTHERAPY FOR MENTAL HEALTH (EXCLUDING SUBSTANCE USE),750,SCHIZOPHRENIA,19,MENTAL DISEASES AND DISORDERS,2,Moderate,Moderate,Medical,Medicare,Private Health Insurance,,,,Y,30186.23,11382.33
New York City,Manhattan,7002053,001463,NYU Langone Hospitals,50 to 69,100,M,Black/African American,Not Span/Hispanic,23,Emergency,Home or Self Care,2020,MBD001,SCHIZOPHRENIA SPECTRUM AND OTHER PSYCHOTIC DISORDERS,,,750,SCHIZOPHRENIA,19,MENTAL DISEASES AND DISORDERS,2,Moderate,Minor,Medical,Medicare,,,,,Y,142892.17,60594.47
New York City,Manhattan,7002053,001463,NYU Langone Hospitals,18 to 29,103,M,Black/African American,Not Span/Hispanic,14,Elective,Home or Self Care,2020,MBD001,SCHIZOPHRENIA SPECTRUM AND OTHER PSYCHOTIC DISORDERS,MHT001,PHARMACOTHERAPY FOR MENTAL HEALTH (EXCLUDING SUBSTANCE USE),750,SCHIZOPHRENIA,19,MENTAL DISEASES AND DISORDERS,3,Major,Moderate,Medical,Medicaid,,,,,N,87427.37,36357.24
New York City,Manhattan,7002053,001463,NYU Langone Hospitals,50 to 69,OOS,F,Other Race,Not Span/Hispanic,8,Emergency,Home or Self Care,2020,MBD001,SCHIZOPHRENIA SPECTRUM AND OTHER PSYCHOTIC DISORDERS,,,750,SCHIZOPHRENIA,19,MENTAL DISEASES AND DISORDERS,2,Moderate,Minor,Medical,Medicare,Medicaid,,,,Y,57093.75,21759.78
New York City,Manhattan,7002053,001463,NYU Langone Hospitals,50 to 69,112,M,Black/African American,Unknown,3,Emergency,Home or Self Care,2020,MBD001,SCHIZOPHRENIA SPECTRUM AND OTHER PSYCHOTIC DISORDERS,,,750,SCHIZOPHRENIA,19,MENTAL DISEASES AND DISORDERS,2,Moderate,Minor,Medical,Medicaid,,,,,Y,27320.19,9590.15
New York City,Manhattan,7002053,001463,NYU Langone Hospitals,50 to 69,108,M,Black/African American,Not Span/Hispanic,4,Emergency,Home or Self Care,2020,MBD001,SCHIZOPHRENIA SPECTRUM AND OTHER PSYCHOTIC DISORDERS,,,750,SCHIZOPHRENIA,19,MENTAL DISEASES AND DISORDERS,2,Moderate,Minor,Medical,Medicaid,,,,,Y,31029.67,11372.24
New York City,Manhattan,7002053,001463,NYU Langone Hospitals,30 to 49,100,M,Other Race,Not Span/Hispanic,15,Emergency,Left Against Medical Advice,2020,MBD001,SCHIZOPHRENIA SPECTRUM AND OTHER PSYCHOTIC DISORDERS,MHT002,PSYCHOTHERAPY FOR MENTAL HEALTH (EXCLUDING SUBSTANCE USE),750,SCHIZOPHRENIA,19,MENTAL DISEASES AND DISORDERS,2,Moderate,Minor,Medical,Medicaid,,,,,Y,88326.34,39857.67
New York City,Manhattan,7002053,001463,NYU Langone Hospitals,50 to 69,OOS,M,White,Not Span/Hispanic,7,Emergency,Home or Self Care,2020,MBD001,SCHIZOPHRENIA SPECTRUM AND OTHER PSYCHOTIC DISORDERS,MHT001,PHARMACOTHERAPY FOR MENTAL HEALTH (EXCLUDING SUBSTANCE USE),750,SCHIZOPHRENIA,19,MENTAL DISEASES AND DISORDERS,2,Moderate,Minor,Medical,Medicare,,,,,Y,52790.2,19252.36
New York City,Manhattan,7002053,001463,NYU Langone Hospitals,18 to 29,100,M,Black/African American,Not Span/Hispanic,2,Emergency,Left Against Medical Advice,2020,MBD001,SCHIZOPHRENIA SPECTRUM AND OTHER PSYCHOTIC DISORDERS,,,750,SCHIZOPHRENIA,19,MENTAL DISEASES AND DISORDERS,2,Moderate,Minor,Medical,Self-Pay,,,,,Y,18929.01,6356.6
New York City,Manhattan,7002053,001463,NYU Langone Hospitals,50 to 69,100,F,Black/African American,Not Span/Hispanic,4,Emergency,Left Against Medical Advice,2020,MBD001,SCHIZOPHRENIA SPECTRUM AND OTHER PSYCHOTIC DISORDERS,,,750,SCHIZOPHRENIA,19,MENTAL DISEASES AND DISORDERS,1,Minor,Minor,Medical,Medicare,,,,,Y,30051.03,11475.54
New York City,Manhattan,7002053,001463,NYU Langone Hospitals,30 to 49,112,F,Other Race,Not Span/Hispanic,41,Emergency,Home or Self Care,2020,MBD001,SCHIZOPHRENIA SPECTRUM AND OTHER PSYCHOTIC DISORDERS,MHT002,PSYCHOTHERAPY FOR MENTAL HEALTH (EXCLUDING SUBSTANCE USE),750,SCHIZOPHRENIA,19,MENTAL DISEASES AND DISORDERS,2,Moderate,Minor,Medical,Medicaid,,,,,Y,226727,105360.28
New York City,Manhattan,7002053,001463,NYU Langone Hospitals,18 to 29,112,M,Other Race,Spanish/Hispanic,5,Emergency,Home or Self Care,2020,MBD001,SCHIZOPHRENIA SPECTRUM AND OTHER PSYCHOTIC DISORDERS,MHT001,PHARMACOTHERAPY FOR MENTAL HEALTH (EXCLUDING SUBSTANCE USE),750,SCHIZOPHRENIA,19,MENTAL DISEASES AND DISORDERS,2,Moderate,Minor,Medical,Medicare,,,,,Y,37419.86,15052.69
New York City,Manhattan,7002053,001463,NYU Langone Hospitals,0 to 17,113,M,White,Not Span/Hispanic,6,Emergency,Psychiatric Hospital or Unit of Hosp,2020,MBD001,SCHIZOPHRENIA SPECTRUM AND OTHER PSYCHOTIC DISORDERS,MAM011,ELECTROENCEPHALOGRAM (EEG),750,SCHIZOPHRENIA,19,MENTAL DISEASES AND DISORDERS,3,Major,Moderate,Medical,Private Health Insurance,,,,,Y,155157.01,31761.22
New York City,Manhattan,7002053,001463,NYU Langone Hospitals,18 to 29,100,M,Other Race,Spanish/Hispanic,11,Emergency,Home or Self Care,2020,MBD001,SCHIZOPHRENIA SPECTRUM AND OTHER PSYCHOTIC DISORDERS,,,750,SCHIZOPHRENIA,19,MENTAL DISEASES AND DISORDERS,1,Minor,Minor,Medical,Medicaid,,,,,Y,93114.01,42113.89
New York City,Manhattan,7002053,001463,NYU Langone Hospitals,30 to 49,112,F,White,Not Span/Hispanic,36,Emergency,Short-term Hospital,2020,MBD001,SCHIZOPHRENIA SPECTRUM AND OTHER PSYCHOTIC DISORDERS,MHT002,PSYCHOTHERAPY FOR MENTAL HEALTH (EXCLUDING SUBSTANCE USE),750,SCHIZOPHRENIA,19,MENTAL DISEASES AND DISORDERS,4,Extreme,Moderate,Medical,Medicaid,,,,,Y,287415.08,122495.69
New York City,Manhattan,7002053,001463,NYU Langone Hospitals,30 to 49,100,M,White,Not Span/Hispanic,14,Emergency,Left Against Medical Advice,2020,MBD001,SCHIZOPHRENIA SPECTRUM AND OTHER PSYCHOTIC DISORDERS,MHT002,PSYCHOTHERAPY FOR MENTAL HEALTH (EXCLUDING SUBSTANCE USE),750,SCHIZOPHRENIA,19,MENTAL DISEASES AND DISORDERS,1,Minor,Minor,Medical,Private Health Insurance,,,,,Y,117873.79,53420.74
New York City,Manhattan,7002053,001463,NYU Langone Hospitals,30 to 49,112,M,White,Not Span/Hispanic,13,Emergency,Home or Self Care,2020,MBD001,SCHIZOPHRENIA SPECTRUM AND OTHER PSYCHOTIC DISORDERS,MHT002,PSYCHOTHERAPY FOR MENTAL HEALTH (EXCLUDING SUBSTANCE USE),750,SCHIZOPHRENIA,19,MENTAL DISEASES AND DISORDERS,1,Minor,Minor,Medical,Medicare,,,,,Y,128184.27,50490.86
New York City,Manhattan,7002053,001463,NYU Langone Hospitals,18 to 29,104,M,Black/African American,Not Span/Hispanic,12,Emergency,Home or Self Care,2020,MBD001,SCHIZOPHRENIA SPECTRUM AND OTHER PSYCHOTIC DISORDERS,,,750,SCHIZOPHRENIA,19,MENTAL DISEASES AND DISORDERS,2,Moderate,Minor,Medical,Medicaid,Medicaid,,,,Y,101320.95,45877.46
New York City,Manhattan,7002053,001463,NYU Langone Hospitals,30 to 49,100,M,Other Race,Not Span/Hispanic,10,Emergency,Home or Self Care,2020,MBD001,SCHIZOPHRENIA SPECTRUM AND OTHER PSYCHOTIC DISORDERS,,,750,SCHIZOPHRENIA,19,MENTAL DISEASES AND DISORDERS,2,Moderate,Minor,Medical,Self-Pay,,,,,Y,63602.12,27285.64
New York City,Manhattan,7002053,001463,NYU Langone Hospitals,30 to 49,112,F,White,Not Span/Hispanic,6,Elective,Home or Self Care,2020,MBD001,SCHIZOPHRENIA SPECTRUM AND OTHER PSYCHOTIC DISORDERS,MAM011,ELECTROENCEPHALOGRAM (EEG),750,SCHIZOPHRENIA,19,MENTAL DISEASES AND DISORDERS,3,Major,Moderate,Medical,Medicaid,,,,,N,45750,22219.71
New York City,Manhattan,7002053,001463,NYU Langone Hospitals,30 to 49,112,M,White,Not Span/Hispanic,6,Emergency,Home or Self Care,2020,MBD001,SCHIZOPHRENIA SPECTRUM AND OTHER PSYCHOTIC DISORDERS,,,750,SCHIZOPHRENIA,19,MENTAL DISEASES AND DISORDERS,2,Moderate,Minor,Medical,Medicaid,,,,,Y,54495.3,23545.81
New York City,Manhattan,7002053,001463,NYU Langone Hospitals,30 to 49,109,M,White,Not Span/Hispanic,15,Emergency,Home or Self Care,2020,MBD001,SCHIZOPHRENIA SPECTRUM AND OTHER PSYCHOTIC DISORDERS,,,750,SCHIZOPHRENIA,19,MENTAL DISEASES AND DISORDERS,2,Moderate,Minor,Medical,Medicaid,,,,,Y,124102.66,56859.07
New York City,Manhattan,7002053,001463,NYU Langone Hospitals,30 to 49,100,F,Black/African American,Not Span/Hispanic,1,Emergency,Left Against Medical Advice,2020,MBD001,SCHIZOPHRENIA SPECTRUM AND OTHER PSYCHOTIC DISORDERS,,,750,SCHIZOPHRENIA,19,MENTAL DISEASES AND DISORDERS,2,Moderate,Minor,Medical,Medicare,Medicaid,,,,Y,16617.52,5055.05
New York City,Manhattan,7002053,001463,NYU Langone Hospitals,18 to 29,114,M,Other Race,Spanish/Hispanic,6,Emergency,Home or Self Care,2020,MBD001,SCHIZOPHRENIA SPECTRUM AND OTHER PSYCHOTIC DISORDERS,,,750,SCHIZOPHRENIA,19,MENTAL DISEASES AND DISORDERS,2,Moderate,Minor,Medical,Medicaid,,,,,Y,62009.49,23776.11
New York City,Manhattan,7002053,001463,NYU Langone Hospitals,30 to 49,115,M,White,Not Span/Hispanic,33,Emergency,Home or Self Care,2020,MBD001,SCHIZOPHRENIA SPECTRUM AND OTHER PSYCHOTIC DISORDERS,MHT002,PSYCHOTHERAPY FOR MENTAL HEALTH (EXCLUDING SUBSTANCE USE),750,SCHIZOPHRENIA,19,MENTAL DISEASES AND DISORDERS,2,Moderate,Minor,Medical,Medicare,Medicaid,,,,Y,277530.91,124582.6
New York City,Manhattan,7002053,001463,NYU Langone Hospitals,30 to 49,112,M,White,Not Span/Hispanic,7,Emergency,Home or Self Care,2020,MBD001,SCHIZOPHRENIA SPECTRUM AND OTHER PSYCHOTIC DISORDERS,,,750,SCHIZOPHRENIA,19,MENTAL DISEASES AND DISORDERS,2,Moderate,Minor,Medical,Medicaid,,,,,Y,64601.96,27516.75
New York City,Manhattan,7002053,001463,NYU Langone Hospitals,18 to 29,100,M,White,Not Span/Hispanic,9,Emergency,Home or Self Care,2020,MBD001,SCHIZOPHRENIA SPECTRUM AND OTHER PSYCHOTIC DISORDERS,,,750,SCHIZOPHRENIA,19,MENTAL DISEASES AND DISORDERS,1,Minor,Minor,Medical,Medicaid,,,,,Y,97270.52,35706.29
New York City,Manhattan,7002053,001463,NYU Langone Hospitals,30 to 49,100,F,Black/African American,Not Span/Hispanic,9,Emergency,Home or Self Care,2020,MBD001,SCHIZOPHRENIA SPECTRUM AND OTHER PSYCHOTIC DISORDERS,,,750,SCHIZOPHRENIA,19,MENTAL DISEASES AND DISORDERS,2,Moderate,Minor,Medical,Medicaid,,,,,Y,85008.21,35608.12
New York City,Manhattan,7002053,001463,NYU Langone Hospitals,18 to 29,104,M,Other Race,Spanish/Hispanic,9,Emergency,Home or Self Care,2020,MBD001,SCHIZOPHRENIA SPECTRUM AND OTHER PSYCHOTIC DISORDERS,MHT002,PSYCHOTHERAPY FOR MENTAL HEALTH (EXCLUDING SUBSTANCE USE),750,SCHIZOPHRENIA,19,MENTAL DISEASES AND DISORDERS,2,Moderate,Minor,Medical,Medicaid,,,,,Y,77370.3,34655.67
New York City,Manhattan,7002053,001463,NYU Langone Hospitals,18 to 29,OOS,M,White,Not Span/Hispanic,5,Emergency,Left Against Medical Advice,2020,MBD001,SCHIZOPHRENIA SPECTRUM AND OTHER PSYCHOTIC DISORDERS,,,750,SCHIZOPHRENIA,19,MENTAL DISEASES AND DISORDERS,2,Moderate,Minor,Medical,Medicaid,,,,,Y,46870.3,19842.53
New York City,Manhattan,7002053,001463,NYU Langone Hospitals,70 or Older,100,M,White,Not Span/Hispanic,7,Elective,Home or Self Care,2020,MBD001,SCHIZOPHRENIA SPECTRUM AND OTHER PSYCHOTIC DISORDERS,,,750,SCHIZOPHRENIA,19,MENTAL DISEASES AND DISORDERS,2,Moderate,Minor,Medical,Medicare,Medicaid,,,,N,58212.22,26507.26
New York City,Manhattan,7002053,001463,NYU Langone Hospitals,50 to 69,100,M,White,Not Span/Hispanic,7,Emergency,Psychiatric Hospital or Unit of Hosp,2020,MBD001,SCHIZOPHRENIA SPECTRUM AND OTHER PSYCHOTIC DISORDERS,,,750,SCHIZOPHRENIA,19,MENTAL DISEASES AND DISORDERS,3,Major,Extreme,Medical,Medicaid,,,,,Y,91926.71,33435.61
New York City,Manhattan,7002053,001463,NYU Langone Hospitals,30 to 49,112,M,Other Race,Not Span/Hispanic,10,Emergency,Left Against Medical Advice,2020,MBD001,SCHIZOPHRENIA SPECTRUM AND OTHER PSYCHOTIC DISORDERS,,,750,SCHIZOPHRENIA,19,MENTAL DISEASES AND DISORDERS,3,Major,Major,Medical,Medicaid,,,,,Y,89543.91,38901.75
New York City,Manhattan,7002053,001463,NYU Langone Hospitals,50 to 69,100,M,White,Not Span/Hispanic,12,Elective,Home or Self Care,2020,MBD001,SCHIZOPHRENIA SPECTRUM AND OTHER PSYCHOTIC DISORDERS,,,750,SCHIZOPHRENIA,19,MENTAL DISEASES AND DISORDERS,2,Moderate,Minor,Medical,Medicaid,,,,,N,92913.85,44627.78
New York City,Manhattan,7002053,001463,NYU Langone Hospitals,18 to 29,112,M,Black/African American,Not Span/Hispanic,11,Emergency,Home or Self Care,2020,MBD001,SCHIZOPHRENIA SPECTRUM AND OTHER PSYCHOTIC DISORDERS,MHT002,PSYCHOTHERAPY FOR MENTAL HEALTH (EXCLUDING SUBSTANCE USE),750,SCHIZOPHRENIA,19,MENTAL DISEASES AND DISORDERS,2,Moderate,Minor,Medical,Private Health Insurance,,,,,Y,100093.24,42980.23
New York City,Manhattan,7002053,001463,NYU Langone Hospitals,30 to 49,100,M,Black/African American,Not Span/Hispanic,4,Emergency,Home or Self Care,2020,MBD001,SCHIZOPHRENIA SPECTRUM AND OTHER PSYCHOTIC DISORDERS,,,750,SCHIZOPHRENIA,19,MENTAL DISEASES AND DISORDERS,2,Moderate,Minor,Medical,Medicare,,,,,Y,39104.96,16124.51
New York City,Manhattan,7002053,001463,NYU Langone Hospitals,18 to 29,112,F,White,Not Span/Hispanic,10,Emergency,Left Against Medical Advice,2020,MBD001,SCHIZOPHRENIA SPECTRUM AND OTHER PSYCHOTIC DISORDERS,MHT002,PSYCHOTHERAPY FOR MENTAL HEALTH (EXCLUDING SUBSTANCE USE),750,SCHIZOPHRENIA,19,MENTAL DISEASES AND DISORDERS,2,Moderate,Minor,Medical,Blue Cross/Blue Shield,,,,,Y,85234.94,38384.03
New York City,Manhattan,7002053,001463,NYU Langone Hospitals,50 to 69,101,F,Black/African American,Not Span/Hispanic,5,Emergency,Home or Self Care,2020,MBD001,SCHIZOPHRENIA SPECTRUM AND OTHER PSYCHOTIC DISORDERS,,,750,SCHIZOPHRENIA,19,MENTAL DISEASES AND DISORDERS,2,Moderate,Minor,Medical,Medicaid,,,,,Y,48864.62,20424.51
New York City,Manhattan,7002053,001463,NYU Langone Hospitals,30 to 49,104,F,White,Not Span/Hispanic,9,Emergency,Home or Self Care,2020,MBD001,SCHIZOPHRENIA SPECTRUM AND OTHER PSYCHOTIC DISORDERS,,,750,SCHIZOPHRENIA,19,MENTAL DISEASES AND DISORDERS,2,Moderate,Minor,Medical,Medicare,Medicaid,,,,Y,78119.64,34615.58
New York City,Manhattan,7002053,001463,NYU Langone Hospitals,30 to 49,104,M,White,Not Span/Hispanic,6,Emergency,Home or Self Care,2020,MBD001,SCHIZOPHRENIA SPECTRUM AND OTHER PSYCHOTIC DISORDERS,MHT002,PSYCHOTHERAPY FOR MENTAL HEALTH (EXCLUDING SUBSTANCE USE),750,SCHIZOPHRENIA,19,MENTAL DISEASES AND DISORDERS,1,Minor,Minor,Medical,Medicaid,,,,,Y,63187.57,23832.39
New York City,Manhattan,7002053,001463,NYU Langone Hospitals,70 or Older,112,M,White,Not Span/Hispanic,6,Emergency,Home or Self Care,2020,MBD001,SCHIZOPHRENIA SPECTRUM AND OTHER PSYCHOTIC DISORDERS,,,750,SCHIZOPHRENIA,19,MENTAL DISEASES AND DISORDERS,2,Moderate,Minor,Medical,Medicare,Medicaid,,,,Y,76048.87,24656.32
New York City,Manhattan,7002053,001463,NYU Langone Hospitals,18 to 29,OOS,M,Black/African American,Not Span/Hispanic,14,Emergency,Home or Self Care,2020,MBD001,SCHIZOPHRENIA SPECTRUM AND OTHER PSYCHOTIC DISORDERS,,,750,SCHIZOPHRENIA,19,MENTAL DISEASES AND DISORDERS,2,Moderate,Minor,Medical,Private Health Insurance,,,,,Y,116030.84,53228.13
New York City,Manhattan,7002053,001463,NYU Langone Hospitals,18 to 29,112,M,Black/African American,Unknown,14,Emergency,Home or Self Care,2020,MBD001,SCHIZOPHRENIA SPECTRUM AND OTHER PSYCHOTIC DISORDERS,,,750,SCHIZOPHRENIA,19,MENTAL DISEASES AND DISORDERS,2,Moderate,Minor,Medical,Medicaid,,,,,Y,124918,54029.28
New York City,Manhattan,7002053,001463,NYU Langone Hospitals,18 to 29,104,M,Other Race,Spanish/Hispanic,10,Emergency,Home or Self Care,2020,MBD001,SCHIZOPHRENIA SPECTRUM AND OTHER PSYCHOTIC DISORDERS,ADM010,VACCINATIONS,750,SCHIZOPHRENIA,19,MENTAL DISEASES AND DISORDERS,2,Moderate,Minor,Medical,Medicaid,,,,,Y,88591.29,38700.9
New York City,Manhattan,7002053,001463,NYU Langone Hospitals,30 to 49,OOS,M,White,Unknown,5,Emergency,Left Against Medical Advice,2020,MBD001,SCHIZOPHRENIA SPECTRUM AND OTHER PSYCHOTIC DISORDERS,ADM010,VACCINATIONS,750,SCHIZOPHRENIA,19,MENTAL DISEASES AND DISORDERS,2,Moderate,Minor,Medical,Medicaid,,,,,Y,52898.12,20418.56
New York City,Manhattan,7002053,001463,NYU Langone Hospitals,50 to 69,OOS,F,Other Race,Not Span/Hispanic,10,Emergency,Left Against Medical Advice,2020,MBD001,SCHIZOPHRENIA SPECTRUM AND OTHER PSYCHOTIC DISORDERS,,,750,SCHIZOPHRENIA,19,MENTAL DISEASES AND DISORDERS,1,Minor,Minor,Medical,Private Health Insurance,,,,,Y,87607.53,38565.97
New York City,Manhattan,7002053,001463,NYU Langone Hospitals,18 to 29,111,F,White,Not Span/Hispanic,19,Elective,Home or Self Care,2020,MBD001,SCHIZOPHRENIA SPECTRUM AND OTHER PSYCHOTIC DISORDERS,,,750,SCHIZOPHRENIA,19,MENTAL DISEASES AND DISORDERS,1,Minor,Minor,Medical,Private Health Insurance,,,,,N,149072.88,70970.92
New York City,Manhattan,7002053,001463,NYU Langone Hospitals,30 to 49,109,M,White,Not Span/Hispanic,64,Emergency,Home or Self Care,2020,MBD001,SCHIZOPHRENIA SPECTRUM AND OTHER PSYCHOTIC DISORDERS,ADM010,VACCINATIONS,750,SCHIZOPHRENIA,19,MENTAL DISEASES AND DISORDERS,2,Moderate,Moderate,Medical,Medicaid,,,,,Y,532258.72,240653.32
New York City,Manhattan,7002053,001463,NYU Langone Hospitals,18 to 29,OOS,F,White,Not Span/Hispanic,18,Emergency,Home or Self Care,2020,MBD001,SCHIZOPHRENIA SPECTRUM AND OTHER PSYCHOTIC DISORDERS,,,750,SCHIZOPHRENIA,19,MENTAL DISEASES AND DISORDERS,2,Moderate,Minor,Medical,Blue Cross/Blue Shield,,,,,Y,159334.6,68828.59
New York City,Manhattan,7002053,001463,NYU Langone Hospitals,18 to 29,112,M,Other Race,Not Span/Hispanic,21,Emergency,Left Against Medical Advice,2020,MBD001,SCHIZOPHRENIA SPECTRUM AND OTHER PSYCHOTIC DISORDERS,MHT002,PSYCHOTHERAPY FOR MENTAL HEALTH (EXCLUDING SUBSTANCE USE),750,SCHIZOPHRENIA,19,MENTAL DISEASES AND DISORDERS,2,Moderate,Minor,Medical,Medicaid,,,,,Y,196856.74,80328.08
New York City,Manhattan,7002053,001463,NYU Langone Hospitals,18 to 29,100,M,Black/African American,Spanish/Hispanic,6,Emergency,Home or Self Care,2020,MBD001,SCHIZOPHRENIA SPECTRUM AND OTHER PSYCHOTIC DISORDERS,,,750,SCHIZOPHRENIA,19,MENTAL DISEASES AND DISORDERS,2,Moderate,Minor,Medical,Medicaid,,,,,Y,55624.15,23638.08
New York City,Manhattan,7002053,001463,NYU Langone Hospitals,30 to 49,OOS,M,Black/African American,Not Span/Hispanic,8,Emergency,Left Against Medical Advice,2020,MBD001,SCHIZOPHRENIA SPECTRUM AND OTHER PSYCHOTIC DISORDERS,,,750,SCHIZOPHRENIA,19,MENTAL DISEASES AND DISORDERS,2,Moderate,Minor,Medical,Medicare,,,,,Y,72245.27,31231.8
New York City,Manhattan,7002053,001463,NYU Langone Hospitals,70 or Older,100,F,White,Not Span/Hispanic,4,Emergency,Psychiatric Hospital or Unit of Hosp,2020,MBD001,SCHIZOPHRENIA SPECTRUM AND OTHER PSYCHOTIC DISORDERS,ESA001,HEMODIALYSIS,750,SCHIZOPHRENIA,19,MENTAL DISEASES AND DISORDERS,2,Moderate,Moderate,Medical,Medicare,Blue Cross/Blue Shield,,,,Y,80327.74,27750.59
New York City,Manhattan,7002053,001463,NYU Langone Hospitals,30 to 49,OOS,F,Other Race,Spanish/Hispanic,3,Emergency,Home or Self Care,2020,MBD001,SCHIZOPHRENIA SPECTRUM AND OTHER PSYCHOTIC DISORDERS,,,750,SCHIZOPHRENIA,19,MENTAL DISEASES AND DISORDERS,2,Moderate,Minor,Medical,Private Health Insurance,,,,,Y,38577.26,12695.95
New York City,Manhattan,7002053,001463,NYU Langone Hospitals,30 to 49,112,F,White,Unknown,5,Emergency,Psychiatric Hospital or Unit of Hosp,2020,MBD001,SCHIZOPHRENIA SPECTRUM AND OTHER PSYCHOTIC DISORDERS,MAM011,ELECTROENCEPHALOGRAM (EEG),750,SCHIZOPHRENIA,19,MENTAL DISEASES AND DISORDERS,2,Moderate,Minor,Medical,Medicaid,,,,,Y,74939.92,24730.14
New York City,Manhattan,7002053,001463,NYU Langone Hospitals,18 to 29,100,M,Black/African American,Not Span/Hispanic,6,Emergency,Left Against Medical Advice,2020,MBD001,SCHIZOPHRENIA SPECTRUM AND OTHER PSYCHOTIC DISORDERS,,,750,SCHIZOPHRENIA,19,MENTAL DISEASES AND DISORDERS,2,Moderate,Minor,Medical,Medicaid,,,,,Y,65089.64,24235.8
New York City,Manhattan,7002053,001463,NYU Langone Hospitals,30 to 49,100,M,White,Not Span/Hispanic,19,Elective,Left Against Medical Advice,2020,MBD001,SCHIZOPHRENIA SPECTRUM AND OTHER PSYCHOTIC DISORDERS,MHT002,PSYCHOTHERAPY FOR MENTAL HEALTH (EXCLUDING SUBSTANCE USE),750,SCHIZOPHRENIA,19,MENTAL DISEASES AND DISORDERS,2,Moderate,Minor,Medical,Medicare,Medicaid,,,,N,171334.21,72148.28
New York City,Manhattan,7002053,001463,NYU Langone Hospitals,30 to 49,100,M,Black/African American,Not Span/Hispanic,7,Emergency,Home or Self Care,2020,MBD001,SCHIZOPHRENIA SPECTRUM AND OTHER PSYCHOTIC DISORDERS,,,750,SCHIZOPHRENIA,19,MENTAL DISEASES AND DISORDERS,2,Moderate,Minor,Medical,Medicaid,,,,,Y,70976.34,27739.5
New York City,Manhattan,7002053,001463,NYU Langone Hospitals,30 to 49,113,M,White,Not Span/Hispanic,12,Emergency,Home or Self Care,2020,MBD001,SCHIZOPHRENIA SPECTRUM AND OTHER PSYCHOTIC DISORDERS,MHT002,PSYCHOTHERAPY FOR MENTAL HEALTH (EXCLUDING SUBSTANCE USE),750,SCHIZOPHRENIA,19,MENTAL DISEASES AND DISORDERS,2,Moderate,Minor,Medical,Private Health Insurance,Medicaid,,,,Y,103845.45,46329.39
