Hospital Service Area,Hospital County,Operating Certificate Number,Permanent Facility Id,Facility Name,Age Group,Zip Code - 3 digits,Gender,Race,Ethnicity,Length of Stay,Type of Admission,Patient Disposition,Discharge Year,CCS Diagnosis Code,CCS Diagnosis Description,CCS Procedure Code,CCS Procedure Description,APR DRG Code,APR DRG Description,APR MDC Code,APR MDC Description,APR Severity of Illness Code,APR Severity of Illness Description,APR Risk of Mortality,APR Medical Surgical Description,Payment Typology 1,Payment Typology 2,Payment Typology 3,Birth Weight,Abortion Edit Indicator,Emergency Department Indicator,Total Charges,Total Costs
New York City,Kings,7002053,001304,NYU Langone Hospital-Brooklyn,30 to 49,112,F,White,Spanish/Hispanic,8,Emergency,Home or Self Care,2020,MBD001,SCHIZOPHRENIA SPECTRUM AND OTHER PSYCHOTIC DISORDERS,,,751,MAJOR DEPRESSIVE DISORDERS & OTHER/UNSPECIFIED PSYCHOSES,19,MENTAL DISEASES AND DISORDERS,1,Minor,Minor,Medical,Medicaid,,,,,Y,56668.43,21896.29
New York City,Kings,7002053,001304,NYU Langone Hospital-Brooklyn,18 to 29,112,M,Black/African American,Not Span/Hispanic,6,Elective,Home w/ Home Health Services,2020,MBD002,DEPRESSIVE DISORDERS,MHT002,PSYCHOTHERAPY FOR MENTAL HEALTH (EXCLUDING SUBSTANCE USE),751,MAJOR DEPRESSIVE DISORDERS & OTHER/UNSPECIFIED PSYCHOSES,19,MENTAL DISEASES AND DISORDERS,2,Moderate,Moderate,Medical,Medicaid,,,,,N,31287.24,15171.94
New York City,Kings,7002053,001304,NYU Langone Hospital-Brooklyn,70 or Older,112,M,White,Not Span/Hispanic,5,Emergency,Home w/ Home Health Services,2020,MBD002,DEPRESSIVE DISORDERS,,,751,MAJOR DEPRESSIVE DISORDERS & OTHER/UNSPECIFIED PSYCHOSES,19,MENTAL DISEASES AND DISORDERS,2,Moderate,Moderate,Medical,Medicare,,,,,Y,36810.69,14128.49
New York City,Kings,7002053,001304,NYU Langone Hospital-Brooklyn,30 to 49,113,M,Other Race,Not Span/Hispanic,2,Emergency,Home or Self Care,2020,MBD001,SCHIZOPHRENIA SPECTRUM AND OTHER PSYCHOTIC DISORDERS,MHT002,PSYCHOTHERAPY FOR MENTAL HEALTH (EXCLUDING SUBSTANCE USE),751,MAJOR DEPRESSIVE DISORDERS & OTHER/UNSPECIFIED PSYCHOSES,19,MENTAL DISEASES AND DISORDERS,1,Minor,Minor,Medical,Medicaid,,,,,Y,19788.06,6356.74
New York City,Kings,7002053,001304,NYU Langone Hospital-Brooklyn,18 to 29,112,F,Other Race,Spanish/Hispanic,3,Emergency,Home or Self Care,2020,MBD002,DEPRESSIVE DISORDERS,,,751,MAJOR DEPRESSIVE DISORDERS & OTHER/UNSPECIFIED PSYCHOSES,19,MENTAL DISEASES AND DISORDERS,2,Moderate,Minor,Medical,Medicaid,,,,,Y,23885.28,8739.98
New York City,Kings,7002053,001304,NYU Langone Hospital-Brooklyn,18 to 29,112,M,White,Not Span/Hispanic,9,Emergency,Home or Self Care,2020,MBD001,SCHIZOPHRENIA SPECTRUM AND OTHER PSYCHOTIC DISORDERS,,,751,MAJOR DEPRESSIVE DISORDERS & OTHER/UNSPECIFIED PSYCHOSES,19,MENTAL DISEASES AND DISORDERS,1,Minor,Minor,Medical,Private Health Insurance,,,,,Y,61665.95,24140.16
New York City,Kings,7002053,001304,NYU Langone Hospital-Brooklyn,50 to 69,112,M,White,Not Span/Hispanic,12,Elective,Home w/ Home Health Services,2020,MBD002,DEPRESSIVE DISORDERS,,,751,MAJOR DEPRESSIVE DISORDERS & OTHER/UNSPECIFIED PSYCHOSES,19,MENTAL DISEASES AND DISORDERS,2,Moderate,Minor,Medical,Medicaid,,,,,N,86262.77,31548.53
New York City,Kings,7002053,001304,NYU Langone Hospital-Brooklyn,30 to 49,112,M,Other Race,Not Span/Hispanic,6,Emergency,Home or Self Care,2020,MBD001,SCHIZOPHRENIA SPECTRUM AND OTHER PSYCHOTIC DISORDERS,MHT002,PSYCHOTHERAPY FOR MENTAL HEALTH (EXCLUDING SUBSTANCE USE),751,MAJOR DEPRESSIVE DISORDERS & OTHER/UNSPECIFIED PSYCHOSES,19,MENTAL DISEASES AND DISORDERS,1,Minor,Minor,Medical,Self-Pay,,,,,Y,41816.92,16605.97
New York City,Kings,7002053,001304,NYU Langone Hospital-Brooklyn,18 to 29,112,F,White,Not Span/Hispanic,12,Emergency,Home or Self Care,2020,MBD001,SCHIZOPHRENIA SPECTRUM AND OTHER PSYCHOTIC DISORDERS,MHT002,PSYCHOTHERAPY FOR MENTAL HEALTH (EXCLUDING SUBSTANCE USE),751,MAJOR DEPRESSIVE DISORDERS & OTHER/UNSPECIFIED PSYCHOSES,19,MENTAL DISEASES AND DISORDERS,2,Moderate,Minor,Medical,Private Health Insurance,,,,,Y,74592.02,31892.03
New York City,Kings,7002053,001304,NYU Langone Hospital-Brooklyn,18 to 29,OOS,M,Black/African American,Not Span/Hispanic,9,Emergency,Home or Self Care,2020,MBD001,SCHIZOPHRENIA SPECTRUM AND OTHER PSYCHOTIC DISORDERS,MHT002,PSYCHOTHERAPY FOR MENTAL HEALTH (EXCLUDING SUBSTANCE USE),751,MAJOR DEPRESSIVE DISORDERS & OTHER/UNSPECIFIED PSYCHOSES,19,MENTAL DISEASES AND DISORDERS,1,Minor,Minor,Medical,Private Health Insurance,,,,,Y,71363.4,25109.21
New York City,Kings,7002053,001304,NYU Langone Hospital-Brooklyn,18 to 29,112,F,Multi-racial,Spanish/Hispanic,9,Emergency,Home or Self Care,2020,MBD002,DEPRESSIVE DISORDERS,,,751,MAJOR DEPRESSIVE DISORDERS & OTHER/UNSPECIFIED PSYCHOSES,19,MENTAL DISEASES AND DISORDERS,2,Moderate,Minor,Medical,Private Health Insurance,Medicaid,,,,Y,56755.3,24077.52
New York City,Kings,7002053,001304,NYU Langone Hospital-Brooklyn,50 to 69,112,M,White,Not Span/Hispanic,10,Emergency,Home w/ Home Health Services,2020,MBD002,DEPRESSIVE DISORDERS,MHT002,PSYCHOTHERAPY FOR MENTAL HEALTH (EXCLUDING SUBSTANCE USE),751,MAJOR DEPRESSIVE DISORDERS & OTHER/UNSPECIFIED PSYCHOSES,19,MENTAL DISEASES AND DISORDERS,2,Moderate,Moderate,Medical,Private Health Insurance,Medicaid,,,,Y,75760.69,27777.36
New York City,Kings,7002053,001304,NYU Langone Hospital-Brooklyn,18 to 29,100,M,White,Unknown,49,Emergency,Home or Self Care,2020,MBD001,SCHIZOPHRENIA SPECTRUM AND OTHER PSYCHOTIC DISORDERS,MHT002,PSYCHOTHERAPY FOR MENTAL HEALTH (EXCLUDING SUBSTANCE USE),751,MAJOR DEPRESSIVE DISORDERS & OTHER/UNSPECIFIED PSYCHOSES,19,MENTAL DISEASES AND DISORDERS,1,Minor,Minor,Medical,Medicaid,,,,,Y,272216.11,125717.06
New York City,Kings,7002053,001304,NYU Langone Hospital-Brooklyn,70 or Older,112,F,White,Not Span/Hispanic,39,Emergency,Home or Self Care,2020,MBD001,SCHIZOPHRENIA SPECTRUM AND OTHER PSYCHOTIC DISORDERS,MHT002,PSYCHOTHERAPY FOR MENTAL HEALTH (EXCLUDING SUBSTANCE USE),751,MAJOR DEPRESSIVE DISORDERS & OTHER/UNSPECIFIED PSYCHOSES,19,MENTAL DISEASES AND DISORDERS,2,Moderate,Minor,Medical,Medicare,,,,,Y,226776.83,100844.02
New York City,Kings,7002053,001304,NYU Langone Hospital-Brooklyn,50 to 69,112,M,White,Spanish/Hispanic,3,Emergency,Home or Self Care,2020,MBD002,DEPRESSIVE DISORDERS,,,751,MAJOR DEPRESSIVE DISORDERS & OTHER/UNSPECIFIED PSYCHOSES,19,MENTAL DISEASES AND DISORDERS,2,Moderate,Minor,Medical,Medicare,Medicaid,,,,Y,26359.54,8924.8
New York City,Kings,7002053,001304,NYU Langone Hospital-Brooklyn,50 to 69,112,F,White,Not Span/Hispanic,11,Emergency,Home w/ Home Health Services,2020,MBD002,DEPRESSIVE DISORDERS,MHT002,PSYCHOTHERAPY FOR MENTAL HEALTH (EXCLUDING SUBSTANCE USE),751,MAJOR DEPRESSIVE DISORDERS & OTHER/UNSPECIFIED PSYCHOSES,19,MENTAL DISEASES AND DISORDERS,3,Major,Moderate,Medical,Medicare,Medicaid,,,,Y,81749.26,30020.58
New York City,Kings,7002053,001304,NYU Langone Hospital-Brooklyn,30 to 49,112,F,Black/African American,Spanish/Hispanic,3,Emergency,Home or Self Care,2020,MBD002,DEPRESSIVE DISORDERS,,,751,MAJOR DEPRESSIVE DISORDERS & OTHER/UNSPECIFIED PSYCHOSES,19,MENTAL DISEASES AND DISORDERS,1,Minor,Minor,Medical,Blue Cross/Blue Shield,,,,,Y,23970.98,8748.54
New York City,Kings,7002053,001304,NYU Langone Hospital-Brooklyn,30 to 49,112,M,Other Race,Not Span/Hispanic,3,Elective,Home or Self Care,2020,MBD002,DEPRESSIVE DISORDERS,,,751,MAJOR DEPRESSIVE DISORDERS & OTHER/UNSPECIFIED PSYCHOSES,19,MENTAL DISEASES AND DISORDERS,2,Moderate,Minor,Medical,Medicaid,,,,,N,17264.61,7701.5
New York City,Kings,7002053,001304,NYU Langone Hospital-Brooklyn,18 to 29,112,M,Other Race,Not Span/Hispanic,7,Emergency,Home or Self Care,2020,MBD002,DEPRESSIVE DISORDERS,MHT002,PSYCHOTHERAPY FOR MENTAL HEALTH (EXCLUDING SUBSTANCE USE),751,MAJOR DEPRESSIVE DISORDERS & OTHER/UNSPECIFIED PSYCHOSES,19,MENTAL DISEASES AND DISORDERS,2,Moderate,Moderate,Medical,Medicaid,,,,,Y,50204.63,19134.4
New York City,Kings,7002053,001304,NYU Langone Hospital-Brooklyn,18 to 29,112,M,White,Not Span/Hispanic,4,Emergency,Home or Self Care,2020,MBD002,DEPRESSIVE DISORDERS,,,751,MAJOR DEPRESSIVE DISORDERS & OTHER/UNSPECIFIED PSYCHOSES,19,MENTAL DISEASES AND DISORDERS,2,Moderate,Minor,Medical,Medicaid,,,,,Y,29187.78,11277.87
New York City,Kings,7002053,001304,NYU Langone Hospital-Brooklyn,30 to 49,109,M,White,Not Span/Hispanic,2,Emergency,Home or Self Care,2020,MBD002,DEPRESSIVE DISORDERS,MHT002,PSYCHOTHERAPY FOR MENTAL HEALTH (EXCLUDING SUBSTANCE USE),751,MAJOR DEPRESSIVE DISORDERS & OTHER/UNSPECIFIED PSYCHOSES,19,MENTAL DISEASES AND DISORDERS,3,Major,Moderate,Medical,Medicare,,,,,Y,36185.41,7074.87
New York City,Kings,7002053,001304,NYU Langone Hospital-Brooklyn,18 to 29,112,F,White,Not Span/Hispanic,4,Emergency,Home or Self Care,2020,MBD002,DEPRESSIVE DISORDERS,,,751,MAJOR DEPRESSIVE DISORDERS & OTHER/UNSPECIFIED PSYCHOSES,19,MENTAL DISEASES AND DISORDERS,2,Moderate,Minor,Medical,Private Health Insurance,,,,,Y,30230.51,11386.97
New York City,Kings,7002053,001304,NYU Langone Hospital-Brooklyn,18 to 29,112,M,Black/African American,Not Span/Hispanic,5,Emergency,Home or Self Care,2020,MBD002,DEPRESSIVE DISORDERS,MHT002,PSYCHOTHERAPY FOR MENTAL HEALTH (EXCLUDING SUBSTANCE USE),751,MAJOR DEPRESSIVE DISORDERS & OTHER/UNSPECIFIED PSYCHOSES,19,MENTAL DISEASES AND DISORDERS,2,Moderate,Minor,Medical,Blue Cross/Blue Shield,,,,,Y,33908.39,13754.89
New York City,Kings,7002053,001304,NYU Langone Hospital-Brooklyn,50 to 69,112,F,Other Race,Spanish/Hispanic,4,Emergency,Home or Self Care,2020,MBD002,DEPRESSIVE DISORDERS,MHT002,PSYCHOTHERAPY FOR MENTAL HEALTH (EXCLUDING SUBSTANCE USE),751,MAJOR DEPRESSIVE DISORDERS & OTHER/UNSPECIFIED PSYCHOSES,19,MENTAL DISEASES AND DISORDERS,2,Moderate,Minor,Medical,Medicaid,,,,,Y,28859.19,11226.24
New York City,Kings,7002053,001304,NYU Langone Hospital-Brooklyn,50 to 69,112,M,Other Race,Not Span/Hispanic,7,Emergency,Home or Self Care,2020,MBD002,DEPRESSIVE DISORDERS,,,751,MAJOR DEPRESSIVE DISORDERS & OTHER/UNSPECIFIED PSYCHOSES,19,MENTAL DISEASES AND DISORDERS,2,Moderate,Minor,Medical,Medicaid,,,,,Y,49230.53,19373.91
New York City,Kings,7002053,001304,NYU Langone Hospital-Brooklyn,50 to 69,112,M,Black/African American,Unknown,8,Emergency,Home or Self Care,2020,MBD001,SCHIZOPHRENIA SPECTRUM AND OTHER PSYCHOTIC DISORDERS,MHT002,PSYCHOTHERAPY FOR MENTAL HEALTH (EXCLUDING SUBSTANCE USE),751,MAJOR DEPRESSIVE DISORDERS & OTHER/UNSPECIFIED PSYCHOSES,19,MENTAL DISEASES AND DISORDERS,2,Moderate,Minor,Medical,Medicaid,,,,,Y,50327.89,21422.13
New York City,Kings,7002053,001304,NYU Langone Hospital-Brooklyn,50 to 69,112,M,White,Spanish/Hispanic,2,Emergency,Home or Self Care,2020,MBD002,DEPRESSIVE DISORDERS,MHT002,PSYCHOTHERAPY FOR MENTAL HEALTH (EXCLUDING SUBSTANCE USE),751,MAJOR DEPRESSIVE DISORDERS & OTHER/UNSPECIFIED PSYCHOSES,19,MENTAL DISEASES AND DISORDERS,1,Minor,Minor,Medical,Blue Cross/Blue Shield,,,,,Y,18658.25,6209.98
New York City,Kings,7002053,001304,NYU Langone Hospital-Brooklyn,30 to 49,112,F,White,Not Span/Hispanic,14,Emergency,Home or Self Care,2020,MBD001,SCHIZOPHRENIA SPECTRUM AND OTHER PSYCHOTIC DISORDERS,MHT002,PSYCHOTHERAPY FOR MENTAL HEALTH (EXCLUDING SUBSTANCE USE),751,MAJOR DEPRESSIVE DISORDERS & OTHER/UNSPECIFIED PSYCHOSES,19,MENTAL DISEASES AND DISORDERS,1,Minor,Minor,Medical,Medicaid,,,,,Y,80825.26,36494.79
New York City,Kings,7002053,001304,NYU Langone Hospital-Brooklyn,18 to 29,112,F,Other Race,Unknown,5,Emergency,Home or Self Care,2020,MBD002,DEPRESSIVE DISORDERS,,,751,MAJOR DEPRESSIVE DISORDERS & OTHER/UNSPECIFIED PSYCHOSES,19,MENTAL DISEASES AND DISORDERS,2,Moderate,Minor,Medical,Medicaid,,,,,Y,36615.45,14042.28
New York City,Kings,7002053,001304,NYU Langone Hospital-Brooklyn,18 to 29,112,F,Other Race,Not Span/Hispanic,9,Emergency,Home or Self Care,2020,MBD002,DEPRESSIVE DISORDERS,,,751,MAJOR DEPRESSIVE DISORDERS & OTHER/UNSPECIFIED PSYCHOSES,19,MENTAL DISEASES AND DISORDERS,2,Moderate,Minor,Medical,Medicaid,,,,,Y,55387.02,23932.96
New York City,Kings,7002053,001304,NYU Langone Hospital-Brooklyn,50 to 69,112,F,Black/African American,Not Span/Hispanic,10,Emergency,Home or Self Care,2020,MBD001,SCHIZOPHRENIA SPECTRUM AND OTHER PSYCHOTIC DISORDERS,,,751,MAJOR DEPRESSIVE DISORDERS & OTHER/UNSPECIFIED PSYCHOSES,19,MENTAL DISEASES AND DISORDERS,2,Moderate,Minor,Medical,Medicaid,,,,,Y,59576.34,26339.14
New York City,Kings,7002053,001304,NYU Langone Hospital-Brooklyn,30 to 49,100,F,White,Not Span/Hispanic,6,Emergency,Home or Self Care,2020,MBD001,SCHIZOPHRENIA SPECTRUM AND OTHER PSYCHOTIC DISORDERS,,,751,MAJOR DEPRESSIVE DISORDERS & OTHER/UNSPECIFIED PSYCHOSES,19,MENTAL DISEASES AND DISORDERS,1,Minor,Minor,Medical,Medicaid,,,,,Y,41525.63,16574.08
New York City,Kings,7002053,001304,NYU Langone Hospital-Brooklyn,30 to 49,112,F,White,Not Span/Hispanic,8,Emergency,Home or Self Care,2020,MBD002,DEPRESSIVE DISORDERS,MHT002,PSYCHOTHERAPY FOR MENTAL HEALTH (EXCLUDING SUBSTANCE USE),751,MAJOR DEPRESSIVE DISORDERS & OTHER/UNSPECIFIED PSYCHOSES,19,MENTAL DISEASES AND DISORDERS,2,Moderate,Moderate,Medical,Medicaid,,,,,N,55301.44,21524.99
New York City,Kings,7002053,001304,NYU Langone Hospital-Brooklyn,50 to 69,112,M,White,Spanish/Hispanic,7,Emergency,Home or Self Care,2020,MBD002,DEPRESSIVE DISORDERS,,,751,MAJOR DEPRESSIVE DISORDERS & OTHER/UNSPECIFIED PSYCHOSES,19,MENTAL DISEASES AND DISORDERS,1,Minor,Moderate,Medical,Medicare,Medicaid,,,,Y,44983.13,18879.62
New York City,Kings,7002053,001304,NYU Langone Hospital-Brooklyn,70 or Older,112,M,White,Not Span/Hispanic,4,Emergency,Home or Self Care,2020,MBD002,DEPRESSIVE DISORDERS,MHT002,PSYCHOTHERAPY FOR MENTAL HEALTH (EXCLUDING SUBSTANCE USE),751,MAJOR DEPRESSIVE DISORDERS & OTHER/UNSPECIFIED PSYCHOSES,19,MENTAL DISEASES AND DISORDERS,2,Moderate,Moderate,Medical,Medicare,Medicaid,,,,Y,38224.75,11836.78
New York City,Kings,7002053,001304,NYU Langone Hospital-Brooklyn,30 to 49,112,M,Other Race,Unknown,8,Emergency,Home or Self Care,2020,MBD001,SCHIZOPHRENIA SPECTRUM AND OTHER PSYCHOTIC DISORDERS,,,751,MAJOR DEPRESSIVE DISORDERS & OTHER/UNSPECIFIED PSYCHOSES,19,MENTAL DISEASES AND DISORDERS,2,Moderate,Minor,Medical,Medicaid,,,,,Y,50227.78,21411.66
New York City,Kings,7002053,001304,NYU Langone Hospital-Brooklyn,18 to 29,,F,White,Spanish/Hispanic,4,Emergency,Home or Self Care,2020,MBD002,DEPRESSIVE DISORDERS,,,751,MAJOR DEPRESSIVE DISORDERS & OTHER/UNSPECIFIED PSYCHOSES,19,MENTAL DISEASES AND DISORDERS,1,Minor,Minor,Medical,Blue Cross/Blue Shield,,,,,Y,29339.21,11293.72
New York City,Kings,7002053,001304,NYU Langone Hospital-Brooklyn,70 or Older,112,F,White,Not Span/Hispanic,33,Emergency,Home or Self Care,2020,MBD002,DEPRESSIVE DISORDERS,MAM011,ELECTROENCEPHALOGRAM (EEG),751,MAJOR DEPRESSIVE DISORDERS & OTHER/UNSPECIFIED PSYCHOSES,19,MENTAL DISEASES AND DISORDERS,3,Major,Moderate,Medical,Medicare,,,,,Y,296443.37,90149.13
New York City,Kings,7002053,001304,NYU Langone Hospital-Brooklyn,50 to 69,112,M,Black/African American,Unknown,4,Emergency,Home or Self Care,2020,MBD002,DEPRESSIVE DISORDERS,,,751,MAJOR DEPRESSIVE DISORDERS & OTHER/UNSPECIFIED PSYCHOSES,19,MENTAL DISEASES AND DISORDERS,1,Minor,Minor,Medical,Medicaid,,,,,Y,30120.74,11374.88
New York City,Kings,7002053,001304,NYU Langone Hospital-Brooklyn,50 to 69,112,F,White,Not Span/Hispanic,7,Emergency,Home or Self Care,2020,MBD002,DEPRESSIVE DISORDERS,MHT002,PSYCHOTHERAPY FOR MENTAL HEALTH (EXCLUDING SUBSTANCE USE),751,MAJOR DEPRESSIVE DISORDERS & OTHER/UNSPECIFIED PSYCHOSES,19,MENTAL DISEASES AND DISORDERS,1,Minor,Minor,Medical,Blue Cross/Blue Shield,,,,,Y,49829.25,19453.4
New York City,Kings,7002053,001304,NYU Langone Hospital-Brooklyn,50 to 69,112,M,White,Spanish/Hispanic,7,Emergency,Home or Self Care,2020,MBD002,DEPRESSIVE DISORDERS,,,751,MAJOR DEPRESSIVE DISORDERS & OTHER/UNSPECIFIED PSYCHOSES,19,MENTAL DISEASES AND DISORDERS,1,Minor,Moderate,Medical,Medicare,Medicaid,,,,Y,49346.6,19102.37
New York City,Kings,7002053,001304,NYU Langone Hospital-Brooklyn,30 to 49,104,M,Other Race,Spanish/Hispanic,5,Emergency,Home or Self Care,2020,MBD002,DEPRESSIVE DISORDERS,MHT002,PSYCHOTHERAPY FOR MENTAL HEALTH (EXCLUDING SUBSTANCE USE),751,MAJOR DEPRESSIVE DISORDERS & OTHER/UNSPECIFIED PSYCHOSES,19,MENTAL DISEASES AND DISORDERS,2,Moderate,Moderate,Medical,Medicaid,,,,,Y,35575.84,13926.42
New York City,Kings,7002053,001304,NYU Langone Hospital-Brooklyn,30 to 49,112,F,Black/African American,Spanish/Hispanic,7,Emergency,Home or Self Care,2020,MBD001,SCHIZOPHRENIA SPECTRUM AND OTHER PSYCHOTIC DISORDERS,MHT002,PSYCHOTHERAPY FOR MENTAL HEALTH (EXCLUDING SUBSTANCE USE),751,MAJOR DEPRESSIVE DISORDERS & OTHER/UNSPECIFIED PSYCHOSES,19,MENTAL DISEASES AND DISORDERS,2,Moderate,Minor,Medical,Medicaid,,,,,Y,59562.8,19825.99
New York City,Kings,7002053,001304,NYU Langone Hospital-Brooklyn,30 to 49,112,F,Black/African American,Spanish/Hispanic,5,Emergency,Home or Self Care,2020,MBD001,SCHIZOPHRENIA SPECTRUM AND OTHER PSYCHOTIC DISORDERS,MHT002,PSYCHOTHERAPY FOR MENTAL HEALTH (EXCLUDING SUBSTANCE USE),751,MAJOR DEPRESSIVE DISORDERS & OTHER/UNSPECIFIED PSYCHOSES,19,MENTAL DISEASES AND DISORDERS,2,Moderate,Minor,Medical,Medicaid,,,,,Y,34552.35,13822.26
New York City,Kings,7002053,001304,NYU Langone Hospital-Brooklyn,50 to 69,112,M,Other Race,Not Span/Hispanic,3,Emergency,Home or Self Care,2020,MBD002,DEPRESSIVE DISORDERS,MHT002,PSYCHOTHERAPY FOR MENTAL HEALTH (EXCLUDING SUBSTANCE USE),751,MAJOR DEPRESSIVE DISORDERS & OTHER/UNSPECIFIED PSYCHOSES,19,MENTAL DISEASES AND DISORDERS,2,Moderate,Minor,Medical,Private Health Insurance,Private Health Insurance,,,,Y,23934.54,8745.13
New York City,Kings,7002053,001304,NYU Langone Hospital-Brooklyn,30 to 49,112,M,Other Race,Not Span/Hispanic,10,Emergency,Home or Self Care,2020,MBD002,DEPRESSIVE DISORDERS,MHT002,PSYCHOTHERAPY FOR MENTAL HEALTH (EXCLUDING SUBSTANCE USE),751,MAJOR DEPRESSIVE DISORDERS & OTHER/UNSPECIFIED PSYCHOSES,19,MENTAL DISEASES AND DISORDERS,1,Minor,Minor,Medical,Medicare,,,,,Y,59493.45,26330.27
New York City,Kings,7002053,001304,NYU Langone Hospital-Brooklyn,50 to 69,,M,White,Unknown,13,Elective,Home or Self Care,2020,MBD002,DEPRESSIVE DISORDERS,,,751,MAJOR DEPRESSIVE DISORDERS & OTHER/UNSPECIFIED PSYCHOSES,19,MENTAL DISEASES AND DISORDERS,2,Moderate,Moderate,Medical,Medicaid,,,,,N,78628.03,33632.95
New York City,Kings,7002053,001304,NYU Langone Hospital-Brooklyn,70 or Older,112,F,White,Not Span/Hispanic,44,Emergency,Skilled Nursing Home,2020,MBD002,DEPRESSIVE DISORDERS,MHT002,PSYCHOTHERAPY FOR MENTAL HEALTH (EXCLUDING SUBSTANCE USE),751,MAJOR DEPRESSIVE DISORDERS & OTHER/UNSPECIFIED PSYCHOSES,19,MENTAL DISEASES AND DISORDERS,3,Major,Major,Medical,Medicare,Blue Cross/Blue Shield,,,,Y,257788.76,114789.92
New York City,Kings,7002053,001304,NYU Langone Hospital-Brooklyn,30 to 49,112,M,Other Race,Not Span/Hispanic,8,Emergency,Home or Self Care,2020,MBD001,SCHIZOPHRENIA SPECTRUM AND OTHER PSYCHOTIC DISORDERS,MHT002,PSYCHOTHERAPY FOR MENTAL HEALTH (EXCLUDING SUBSTANCE USE),751,MAJOR DEPRESSIVE DISORDERS & OTHER/UNSPECIFIED PSYCHOSES,19,MENTAL DISEASES AND DISORDERS,1,Minor,Minor,Medical,Medicaid,,,,,Y,59763.98,22136.56
New York City,Kings,7002053,001304,NYU Langone Hospital-Brooklyn,30 to 49,112,F,White,Not Span/Hispanic,14,Emergency,Home or Self Care,2020,MBD002,DEPRESSIVE DISORDERS,MHT002,PSYCHOTHERAPY FOR MENTAL HEALTH (EXCLUDING SUBSTANCE USE),751,MAJOR DEPRESSIVE DISORDERS & OTHER/UNSPECIFIED PSYCHOSES,19,MENTAL DISEASES AND DISORDERS,2,Moderate,Minor,Medical,Private Health Insurance,,,,,Y,81111.77,36524.76
New York City,Kings,7002053,001304,NYU Langone Hospital-Brooklyn,30 to 49,112,M,Other Race,Not Span/Hispanic,16,Emergency,Home or Self Care,2020,MBD001,SCHIZOPHRENIA SPECTRUM AND OTHER PSYCHOTIC DISORDERS,PLC001,IMMOBILIZATION BY SPLINT OR OTHER EXTERNAL DEVICE,751,MAJOR DEPRESSIVE DISORDERS & OTHER/UNSPECIFIED PSYCHOSES,19,MENTAL DISEASES AND DISORDERS,2,Moderate,Minor,Medical,Medicaid,,,,,Y,125470.43,44547.09
New York City,Kings,7002053,001304,NYU Langone Hospital-Brooklyn,18 to 29,112,M,White,Spanish/Hispanic,4,Emergency,Home or Self Care,2020,MBD001,SCHIZOPHRENIA SPECTRUM AND OTHER PSYCHOTIC DISORDERS,MHT002,PSYCHOTHERAPY FOR MENTAL HEALTH (EXCLUDING SUBSTANCE USE),751,MAJOR DEPRESSIVE DISORDERS & OTHER/UNSPECIFIED PSYCHOSES,19,MENTAL DISEASES AND DISORDERS,2,Moderate,Minor,Medical,Medicaid,,,,,Y,33345.63,11895.94
New York City,Kings,7002053,001304,NYU Langone Hospital-Brooklyn,30 to 49,112,F,White,Not Span/Hispanic,7,Elective,Home or Self Care,2020,MBD001,SCHIZOPHRENIA SPECTRUM AND OTHER PSYCHOTIC DISORDERS,MHT002,PSYCHOTHERAPY FOR MENTAL HEALTH (EXCLUDING SUBSTANCE USE),751,MAJOR DEPRESSIVE DISORDERS & OTHER/UNSPECIFIED PSYCHOSES,19,MENTAL DISEASES AND DISORDERS,1,Minor,Minor,Medical,Private Health Insurance,,,,,N,37042.85,17757.44
New York City,Kings,7002053,001304,NYU Langone Hospital-Brooklyn,50 to 69,112,M,White,Not Span/Hispanic,5,Emergency,Home or Self Care,2020,MBD002,DEPRESSIVE DISORDERS,OTR004,ISOLATION PROCEDURES,751,MAJOR DEPRESSIVE DISORDERS & OTHER/UNSPECIFIED PSYCHOSES,19,MENTAL DISEASES AND DISORDERS,2,Moderate,Minor,Medical,Private Health Insurance,,,,,Y,36377.15,13996.32
New York City,Kings,7002053,001304,NYU Langone Hospital-Brooklyn,30 to 49,112,M,White,Not Span/Hispanic,3,Emergency,Home or Self Care,2020,MBD001,SCHIZOPHRENIA SPECTRUM AND OTHER PSYCHOTIC DISORDERS,OTR004,ISOLATION PROCEDURES,751,MAJOR DEPRESSIVE DISORDERS & OTHER/UNSPECIFIED PSYCHOSES,19,MENTAL DISEASES AND DISORDERS,3,Major,Major,Medical,Medicare,Medicaid,,,,Y,44243.57,12058.82
New York City,Kings,7002053,001304,NYU Langone Hospital-Brooklyn,30 to 49,112,M,Black/African American,Not Span/Hispanic,6,Emergency,Home or Self Care,2020,MBD001,SCHIZOPHRENIA SPECTRUM AND OTHER PSYCHOTIC DISORDERS,MHT002,PSYCHOTHERAPY FOR MENTAL HEALTH (EXCLUDING SUBSTANCE USE),751,MAJOR DEPRESSIVE DISORDERS & OTHER/UNSPECIFIED PSYCHOSES,19,MENTAL DISEASES AND DISORDERS,2,Moderate,Minor,Medical,Self-Pay,,,,,Y,43104.04,14289
New York City,Kings,7002053,001304,NYU Langone Hospital-Brooklyn,30 to 49,112,F,White,Not Span/Hispanic,6,Emergency,Home or Self Care,2020,MBD002,DEPRESSIVE DISORDERS,MHT002,PSYCHOTHERAPY FOR MENTAL HEALTH (EXCLUDING SUBSTANCE USE),751,MAJOR DEPRESSIVE DISORDERS & OTHER/UNSPECIFIED PSYCHOSES,19,MENTAL DISEASES AND DISORDERS,2,Moderate,Minor,Medical,Medicaid,,,,,Y,40172.32,16393.37
New York City,Kings,7002053,001304,NYU Langone Hospital-Brooklyn,70 or Older,112,F,Other Race,Not Span/Hispanic,3,Emergency,Short-term Hospital,2020,MBD002,DEPRESSIVE DISORDERS,OTR004,ISOLATION PROCEDURES,751,MAJOR DEPRESSIVE DISORDERS & OTHER/UNSPECIFIED PSYCHOSES,19,MENTAL DISEASES AND DISORDERS,3,Major,Moderate,Medical,Medicare,,,,,Y,40123.87,10697.62
New York City,Kings,7002053,001304,NYU Langone Hospital-Brooklyn,30 to 49,,F,Black/African American,Unknown,42,Emergency,Home or Self Care,2020,MBD002,DEPRESSIVE DISORDERS,MHT002,PSYCHOTHERAPY FOR MENTAL HEALTH (EXCLUDING SUBSTANCE USE),751,MAJOR DEPRESSIVE DISORDERS & OTHER/UNSPECIFIED PSYCHOSES,19,MENTAL DISEASES AND DISORDERS,2,Moderate,Minor,Medical,Medicaid,,,,,Y,230110.17,107663.1
New York City,Kings,7002053,001304,NYU Langone Hospital-Brooklyn,18 to 29,115,M,Other Race,Spanish/Hispanic,10,Elective,Home or Self Care,2020,MBD001,SCHIZOPHRENIA SPECTRUM AND OTHER PSYCHOTIC DISORDERS,MHT002,PSYCHOTHERAPY FOR MENTAL HEALTH (EXCLUDING SUBSTANCE USE),751,MAJOR DEPRESSIVE DISORDERS & OTHER/UNSPECIFIED PSYCHOSES,19,MENTAL DISEASES AND DISORDERS,1,Minor,Minor,Medical,Medicaid,,,,,Y,64890.27,26694.24
New York City,Kings,7002053,001304,NYU Langone Hospital-Brooklyn,30 to 49,112,M,Other Race,Unknown,19,Emergency,Home or Self Care,2020,MBD001,SCHIZOPHRENIA SPECTRUM AND OTHER PSYCHOTIC DISORDERS,MHT002,PSYCHOTHERAPY FOR MENTAL HEALTH (EXCLUDING SUBSTANCE USE),751,MAJOR DEPRESSIVE DISORDERS & OTHER/UNSPECIFIED PSYCHOSES,19,MENTAL DISEASES AND DISORDERS,2,Moderate,Minor,Medical,Self-Pay,,,,,Y,103886.75,46712.15