Hospital Service Area,Hospital County,Operating Certificate Number,Permanent Facility Id,Facility Name,Age Group,Zip Code - 3 digits,Gender,Race,Ethnicity,Length of Stay,Type of Admission,Patient Disposition,Discharge Year,CCS Diagnosis Code,CCS Diagnosis Description,CCS Procedure Code,CCS Procedure Description,APR DRG Code,APR DRG Description,APR MDC Code,APR MDC Description,APR Severity of Illness Code,APR Severity of Illness Description,APR Risk of Mortality,APR Medical Surgical Description,Payment Typology 1,Payment Typology 2,Payment Typology 3,Birth Weight,Abortion Edit Indicator,Emergency Department Indicator,Total Charges,Total Costs
New York City,Manhattan,7002001,001438,Bellevue Hospital Center,30 to 49,112,M,White,Not Span/Hispanic,3,Emergency,Home or Self Care,2020,MBD001,SCHIZOPHRENIA SPECTRUM AND OTHER PSYCHOTIC DISORDERS,MHT001,PHARMACOTHERAPY FOR MENTAL HEALTH (EXCLUDING SUBSTANCE USE),751,MAJOR DEPRESSIVE DISORDERS & OTHER/UNSPECIFIED PSYCHOSES,19,MENTAL DISEASES AND DISORDERS,1,Minor,Minor,Medical,Medicaid,,,,,Y,5982.74,3440.58
New York City,Manhattan,7002001,001438,Bellevue Hospital Center,0 to 17,113,M,Other Race,Unknown,8,Emergency,Home or Self Care,2020,MBD002,DEPRESSIVE DISORDERS,MHT001,PHARMACOTHERAPY FOR MENTAL HEALTH (EXCLUDING SUBSTANCE USE),751,MAJOR DEPRESSIVE DISORDERS & OTHER/UNSPECIFIED PSYCHOSES,19,MENTAL DISEASES AND DISORDERS,2,Moderate,Minor,Medical,Medicaid,,,,,Y,12026.87,6916.46
New York City,Manhattan,7002001,001438,Bellevue Hospital Center,30 to 49,100,F,White,Unknown,7,Emergency,Home or Self Care,2020,MBD001,SCHIZOPHRENIA SPECTRUM AND OTHER PSYCHOTIC DISORDERS,MHT001,PHARMACOTHERAPY FOR MENTAL HEALTH (EXCLUDING SUBSTANCE USE),751,MAJOR DEPRESSIVE DISORDERS & OTHER/UNSPECIFIED PSYCHOSES,19,MENTAL DISEASES AND DISORDERS,1,Minor,Minor,Medical,Private Health Insurance,,,,,Y,11928.35,6859.8
New York City,Manhattan,7002001,001438,Bellevue Hospital Center,0 to 17,113,F,Other Race,Not Span/Hispanic,1,Emergency,Home or Self Care,2020,MBD002,DEPRESSIVE DISORDERS,MHT001,PHARMACOTHERAPY FOR MENTAL HEALTH (EXCLUDING SUBSTANCE USE),751,MAJOR DEPRESSIVE DISORDERS & OTHER/UNSPECIFIED PSYCHOSES,19,MENTAL DISEASES AND DISORDERS,1,Minor,Minor,Medical,Medicaid,,,,,Y,2383.48,1370.7
New York City,Manhattan,7002001,001438,Bellevue Hospital Center,18 to 29,100,M,Other Race,Spanish/Hispanic,1,Emergency,Home or Self Care,2020,MBD001,SCHIZOPHRENIA SPECTRUM AND OTHER PSYCHOTIC DISORDERS,MHT001,PHARMACOTHERAPY FOR MENTAL HEALTH (EXCLUDING SUBSTANCE USE),751,MAJOR DEPRESSIVE DISORDERS & OTHER/UNSPECIFIED PSYCHOSES,19,MENTAL DISEASES AND DISORDERS,1,Minor,Minor,Medical,Medicaid,,,,,Y,2654.89,1526.78
New York City,Manhattan,7002001,001438,Bellevue Hospital Center,0 to 17,112,F,Other Race,Spanish/Hispanic,29,Emergency,Home or Self Care,2020,MBD001,SCHIZOPHRENIA SPECTRUM AND OTHER PSYCHOTIC DISORDERS,MHT001,PHARMACOTHERAPY FOR MENTAL HEALTH (EXCLUDING SUBSTANCE USE),751,MAJOR DEPRESSIVE DISORDERS & OTHER/UNSPECIFIED PSYCHOSES,19,MENTAL DISEASES AND DISORDERS,1,Minor,Minor,Medical,Private Health Insurance,,,,,Y,44019.1,25314.68
New York City,Manhattan,7002001,001438,Bellevue Hospital Center,30 to 49,113,M,White,Spanish/Hispanic,5,Emergency,Home or Self Care,2020,MBD002,DEPRESSIVE DISORDERS,MHT001,PHARMACOTHERAPY FOR MENTAL HEALTH (EXCLUDING SUBSTANCE USE),751,MAJOR DEPRESSIVE DISORDERS & OTHER/UNSPECIFIED PSYCHOSES,19,MENTAL DISEASES AND DISORDERS,2,Moderate,Minor,Medical,Private Health Insurance,Private Health Insurance,,,,Y,8380.15,4819.29
New York City,Manhattan,7002001,001438,Bellevue Hospital Center,0 to 17,OOS,F,White,Not Span/Hispanic,1,Emergency,Home or Self Care,2020,MBD002,DEPRESSIVE DISORDERS,MHT001,PHARMACOTHERAPY FOR MENTAL HEALTH (EXCLUDING SUBSTANCE USE),751,MAJOR DEPRESSIVE DISORDERS & OTHER/UNSPECIFIED PSYCHOSES,19,MENTAL DISEASES AND DISORDERS,1,Minor,Minor,Medical,Private Health Insurance,,,,,Y,2948.71,1695.76
New York City,Manhattan,7002001,001438,Bellevue Hospital Center,0 to 17,104,M,Other Race,Spanish/Hispanic,20,Emergency,Home or Self Care,2020,MBD001,SCHIZOPHRENIA SPECTRUM AND OTHER PSYCHOTIC DISORDERS,MHT001,PHARMACOTHERAPY FOR MENTAL HEALTH (EXCLUDING SUBSTANCE USE),751,MAJOR DEPRESSIVE DISORDERS & OTHER/UNSPECIFIED PSYCHOSES,19,MENTAL DISEASES AND DISORDERS,1,Minor,Minor,Medical,Medicaid,,,,,Y,29615.25,17031.26
New York City,Manhattan,7002001,001438,Bellevue Hospital Center,0 to 17,100,F,Black/African American,Not Span/Hispanic,19,Emergency,Home or Self Care,2020,MBD002,DEPRESSIVE DISORDERS,MHT001,PHARMACOTHERAPY FOR MENTAL HEALTH (EXCLUDING SUBSTANCE USE),751,MAJOR DEPRESSIVE DISORDERS & OTHER/UNSPECIFIED PSYCHOSES,19,MENTAL DISEASES AND DISORDERS,1,Minor,Minor,Medical,Self-Pay,,,,,Y,28354.81,16306.4
New York City,Manhattan,7002001,001438,Bellevue Hospital Center,50 to 69,104,M,Black/African American,Not Span/Hispanic,3,Emergency,Home or Self Care,2020,MBD002,DEPRESSIVE DISORDERS,MHT002,PSYCHOTHERAPY FOR MENTAL HEALTH (EXCLUDING SUBSTANCE USE),751,MAJOR DEPRESSIVE DISORDERS & OTHER/UNSPECIFIED PSYCHOSES,19,MENTAL DISEASES AND DISORDERS,2,Moderate,Minor,Medical,Self-Pay,,,,,Y,5172.41,2974.57
New York City,Manhattan,7002001,001438,Bellevue Hospital Center,0 to 17,112,M,Other Race,Spanish/Hispanic,13,Emergency,Home or Self Care,2020,MBD002,DEPRESSIVE DISORDERS,MHT001,PHARMACOTHERAPY FOR MENTAL HEALTH (EXCLUDING SUBSTANCE USE),751,MAJOR DEPRESSIVE DISORDERS & OTHER/UNSPECIFIED PSYCHOSES,19,MENTAL DISEASES AND DISORDERS,2,Moderate,Minor,Medical,Private Health Insurance,,,,,Y,19461.2,11191.82
New York City,Manhattan,7002001,001438,Bellevue Hospital Center,0 to 17,113,F,White,Not Span/Hispanic,62,Emergency,Home or Self Care,2020,MBD002,DEPRESSIVE DISORDERS,MHT002,PSYCHOTHERAPY FOR MENTAL HEALTH (EXCLUDING SUBSTANCE USE),751,MAJOR DEPRESSIVE DISORDERS & OTHER/UNSPECIFIED PSYCHOSES,19,MENTAL DISEASES AND DISORDERS,1,Minor,Minor,Medical,Private Health Insurance,,,,,Y,89408.59,51417.45
New York City,Manhattan,7002001,001438,Bellevue Hospital Center,30 to 49,100,M,Other Race,Spanish/Hispanic,3,Emergency,Home or Self Care,2020,MBD002,DEPRESSIVE DISORDERS,MHT001,PHARMACOTHERAPY FOR MENTAL HEALTH (EXCLUDING SUBSTANCE USE),751,MAJOR DEPRESSIVE DISORDERS & OTHER/UNSPECIFIED PSYCHOSES,19,MENTAL DISEASES AND DISORDERS,2,Moderate,Minor,Medical,Medicare,,,,,Y,6693.21,3849.16
New York City,Manhattan,7002001,001438,Bellevue Hospital Center,30 to 49,104,M,Other Race,Spanish/Hispanic,3,Emergency,Home or Self Care,2020,MBD001,SCHIZOPHRENIA SPECTRUM AND OTHER PSYCHOTIC DISORDERS,MHT001,PHARMACOTHERAPY FOR MENTAL HEALTH (EXCLUDING SUBSTANCE USE),751,MAJOR DEPRESSIVE DISORDERS & OTHER/UNSPECIFIED PSYCHOSES,19,MENTAL DISEASES AND DISORDERS,2,Moderate,Minor,Medical,Medicaid,,,,,Y,5800.43,3335.73
New York City,Manhattan,7002001,001438,Bellevue Hospital Center,0 to 17,100,F,White,Spanish/Hispanic,42,Emergency,Home or Self Care,2020,MBD002,DEPRESSIVE DISORDERS,MHT001,PHARMACOTHERAPY FOR MENTAL HEALTH (EXCLUDING SUBSTANCE USE),751,MAJOR DEPRESSIVE DISORDERS & OTHER/UNSPECIFIED PSYCHOSES,19,MENTAL DISEASES AND DISORDERS,1,Minor,Minor,Medical,Private Health Insurance,,,,,Y,62716.63,36067.33
New York City,Manhattan,7002001,001438,Bellevue Hospital Center,50 to 69,112,M,Black/African American,Spanish/Hispanic,13,Urgent,Home or Self Care,2020,MBD002,DEPRESSIVE DISORDERS,MHT001,PHARMACOTHERAPY FOR MENTAL HEALTH (EXCLUDING SUBSTANCE USE),751,MAJOR DEPRESSIVE DISORDERS & OTHER/UNSPECIFIED PSYCHOSES,19,MENTAL DISEASES AND DISORDERS,2,Moderate,Minor,Medical,Medicare,Medicaid,,,,N,21547.77,12391.78
New York City,Manhattan,7002001,001438,Bellevue Hospital Center,30 to 49,100,M,Black/African American,Not Span/Hispanic,1,Emergency,Home or Self Care,2020,MBD001,SCHIZOPHRENIA SPECTRUM AND OTHER PSYCHOTIC DISORDERS,MHT001,PHARMACOTHERAPY FOR MENTAL HEALTH (EXCLUDING SUBSTANCE USE),751,MAJOR DEPRESSIVE DISORDERS & OTHER/UNSPECIFIED PSYCHOSES,19,MENTAL DISEASES AND DISORDERS,2,Moderate,Minor,Medical,Medicaid,,,,,Y,2796.65,1608.31
New York City,Manhattan,7002001,001438,Bellevue Hospital Center,50 to 69,100,F,Black/African American,Unknown,8,Emergency,Home or Self Care,2020,MBD001,SCHIZOPHRENIA SPECTRUM AND OTHER PSYCHOTIC DISORDERS,MHT001,PHARMACOTHERAPY FOR MENTAL HEALTH (EXCLUDING SUBSTANCE USE),751,MAJOR DEPRESSIVE DISORDERS & OTHER/UNSPECIFIED PSYCHOSES,19,MENTAL DISEASES AND DISORDERS,2,Moderate,Minor,Medical,Medicare,Medicaid,,,,Y,13069.33,7515.96
New York City,Manhattan,7002001,001438,Bellevue Hospital Center,18 to 29,100,F,Black/African American,Not Span/Hispanic,3,Emergency,Home or Self Care,2020,MBD001,SCHIZOPHRENIA SPECTRUM AND OTHER PSYCHOTIC DISORDERS,MHT001,PHARMACOTHERAPY FOR MENTAL HEALTH (EXCLUDING SUBSTANCE USE),751,MAJOR DEPRESSIVE DISORDERS & OTHER/UNSPECIFIED PSYCHOSES,19,MENTAL DISEASES AND DISORDERS,2,Moderate,Minor,Medical,Medicaid,,,,,Y,5909.71,3398.58
New York City,Manhattan,7002001,001438,Bellevue Hospital Center,30 to 49,100,M,Black/African American,Unknown,1,Emergency,Home or Self Care,2020,MBD001,SCHIZOPHRENIA SPECTRUM AND OTHER PSYCHOTIC DISORDERS,MHT005,"MENTAL HEALTH PROCEDURES, NEC",751,MAJOR DEPRESSIVE DISORDERS & OTHER/UNSPECIFIED PSYCHOSES,19,MENTAL DISEASES AND DISORDERS,2,Moderate,Minor,Medical,Medicaid,,,,,Y,2120.1,1219.24
New York City,Manhattan,7002001,001438,Bellevue Hospital Center,0 to 17,100,F,Other Race,Spanish/Hispanic,13,Emergency,Home or Self Care,2020,MBD002,DEPRESSIVE DISORDERS,MHT001,PHARMACOTHERAPY FOR MENTAL HEALTH (EXCLUDING SUBSTANCE USE),751,MAJOR DEPRESSIVE DISORDERS & OTHER/UNSPECIFIED PSYCHOSES,19,MENTAL DISEASES AND DISORDERS,2,Moderate,Minor,Medical,Private Health Insurance,,,,,Y,19626.9,11287.12
New York City,Manhattan,7002001,001438,Bellevue Hospital Center,30 to 49,115,M,Black/African American,Not Span/Hispanic,19,Emergency,Home or Self Care,2020,MBD001,SCHIZOPHRENIA SPECTRUM AND OTHER PSYCHOTIC DISORDERS,MHT001,PHARMACOTHERAPY FOR MENTAL HEALTH (EXCLUDING SUBSTANCE USE),751,MAJOR DEPRESSIVE DISORDERS & OTHER/UNSPECIFIED PSYCHOSES,19,MENTAL DISEASES AND DISORDERS,1,Minor,Minor,Medical,Private Health Insurance,,,,,Y,30355.45,17456.93
New York City,Manhattan,7002001,001438,Bellevue Hospital Center,50 to 69,100,M,Other Race,Unknown,4,Emergency,Home or Self Care,2020,MBD002,DEPRESSIVE DISORDERS,MHT001,PHARMACOTHERAPY FOR MENTAL HEALTH (EXCLUDING SUBSTANCE USE),751,MAJOR DEPRESSIVE DISORDERS & OTHER/UNSPECIFIED PSYCHOSES,19,MENTAL DISEASES AND DISORDERS,2,Moderate,Minor,Medical,Medicaid,,,,,Y,7186.48,4132.83
New York City,Manhattan,7002001,001438,Bellevue Hospital Center,18 to 29,112,M,Other Race,Spanish/Hispanic,10,Emergency,Home or Self Care,2020,MBD002,DEPRESSIVE DISORDERS,MHT001,PHARMACOTHERAPY FOR MENTAL HEALTH (EXCLUDING SUBSTANCE USE),751,MAJOR DEPRESSIVE DISORDERS & OTHER/UNSPECIFIED PSYCHOSES,19,MENTAL DISEASES AND DISORDERS,2,Moderate,Moderate,Medical,Private Health Insurance,,,,,Y,15977.03,9188.13
New York City,Manhattan,7002001,001438,Bellevue Hospital Center,50 to 69,100,M,White,Unknown,17,Emergency,Home or Self Care,2020,MBD002,DEPRESSIVE DISORDERS,MHT001,PHARMACOTHERAPY FOR MENTAL HEALTH (EXCLUDING SUBSTANCE USE),751,MAJOR DEPRESSIVE DISORDERS & OTHER/UNSPECIFIED PSYCHOSES,19,MENTAL DISEASES AND DISORDERS,2,Moderate,Minor,Medical,Medicaid,,,,,Y,27711.38,15936.37
New York City,Manhattan,7002001,001438,Bellevue Hospital Center,30 to 49,112,M,Other Race,Not Span/Hispanic,12,Emergency,Home or Self Care,2020,MBD002,DEPRESSIVE DISORDERS,MHT003,ELECTROCONVULSIVE THERAPY,751,MAJOR DEPRESSIVE DISORDERS & OTHER/UNSPECIFIED PSYCHOSES,19,MENTAL DISEASES AND DISORDERS,3,Major,Minor,Medical,Private Health Insurance,Private Health Insurance,,,,Y,28244.88,16243.18
New York City,Manhattan,7002001,001438,Bellevue Hospital Center,50 to 69,112,M,Black/African American,Spanish/Hispanic,1,Emergency,Home or Self Care,2020,MBD002,DEPRESSIVE DISORDERS,MHT001,PHARMACOTHERAPY FOR MENTAL HEALTH (EXCLUDING SUBSTANCE USE),751,MAJOR DEPRESSIVE DISORDERS & OTHER/UNSPECIFIED PSYCHOSES,19,MENTAL DISEASES AND DISORDERS,2,Moderate,Moderate,Medical,Medicare,Medicaid,,,,Y,3551.02,2042.13
New York City,Manhattan,7002001,001438,Bellevue Hospital Center,30 to 49,104,M,Black/African American,Unknown,2,Emergency,Home or Self Care,2020,MBD001,SCHIZOPHRENIA SPECTRUM AND OTHER PSYCHOTIC DISORDERS,MHT001,PHARMACOTHERAPY FOR MENTAL HEALTH (EXCLUDING SUBSTANCE USE),751,MAJOR DEPRESSIVE DISORDERS & OTHER/UNSPECIFIED PSYCHOSES,19,MENTAL DISEASES AND DISORDERS,1,Minor,Minor,Medical,Medicaid,,,,,Y,3881.67,2232.29
New York City,Manhattan,7002001,001438,Bellevue Hospital Center,0 to 17,100,F,White,Not Span/Hispanic,2,Emergency,Home or Self Care,2020,MBD002,DEPRESSIVE DISORDERS,MHT002,PSYCHOTHERAPY FOR MENTAL HEALTH (EXCLUDING SUBSTANCE USE),751,MAJOR DEPRESSIVE DISORDERS & OTHER/UNSPECIFIED PSYCHOSES,19,MENTAL DISEASES AND DISORDERS,2,Moderate,Minor,Medical,Private Health Insurance,,,,,Y,5239.18,3012.97
New York City,Manhattan,7002001,001438,Bellevue Hospital Center,0 to 17,111,F,Other Race,Not Span/Hispanic,3,Emergency,Home or Self Care,2020,MBD002,DEPRESSIVE DISORDERS,MHT001,PHARMACOTHERAPY FOR MENTAL HEALTH (EXCLUDING SUBSTANCE USE),751,MAJOR DEPRESSIVE DISORDERS & OTHER/UNSPECIFIED PSYCHOSES,19,MENTAL DISEASES AND DISORDERS,1,Minor,Minor,Medical,Private Health Insurance,,,,,Y,5572.22,3204.49
New York City,Manhattan,7002001,001438,Bellevue Hospital Center,0 to 17,112,F,Other Race,Spanish/Hispanic,29,Emergency,Home or Self Care,2020,MBD002,DEPRESSIVE DISORDERS,MHT001,PHARMACOTHERAPY FOR MENTAL HEALTH (EXCLUDING SUBSTANCE USE),751,MAJOR DEPRESSIVE DISORDERS & OTHER/UNSPECIFIED PSYCHOSES,19,MENTAL DISEASES AND DISORDERS,2,Moderate,Minor,Medical,Private Health Insurance,,,,,Y,42794.29,24610.31
New York City,Manhattan,7002001,001438,Bellevue Hospital Center,0 to 17,100,M,Black/African American,Unknown,17,Emergency,Home or Self Care,2020,MBD001,SCHIZOPHRENIA SPECTRUM AND OTHER PSYCHOTIC DISORDERS,MHT001,PHARMACOTHERAPY FOR MENTAL HEALTH (EXCLUDING SUBSTANCE USE),751,MAJOR DEPRESSIVE DISORDERS & OTHER/UNSPECIFIED PSYCHOSES,19,MENTAL DISEASES AND DISORDERS,1,Minor,Minor,Medical,Self-Pay,,,,,Y,25439.37,14629.77
New York City,Manhattan,7002001,001438,Bellevue Hospital Center,30 to 49,112,M,Black/African American,Not Span/Hispanic,1,Emergency,Home or Self Care,2020,MBD001,SCHIZOPHRENIA SPECTRUM AND OTHER PSYCHOTIC DISORDERS,MHT001,PHARMACOTHERAPY FOR MENTAL HEALTH (EXCLUDING SUBSTANCE USE),751,MAJOR DEPRESSIVE DISORDERS & OTHER/UNSPECIFIED PSYCHOSES,19,MENTAL DISEASES AND DISORDERS,1,Minor,Minor,Medical,Medicaid,,,,,Y,2195.09,1262.36
New York City,Manhattan,7002001,001438,Bellevue Hospital Center,30 to 49,104,M,Other Race,Unknown,11,Emergency,Home or Self Care,2020,MBD001,SCHIZOPHRENIA SPECTRUM AND OTHER PSYCHOTIC DISORDERS,MHT001,PHARMACOTHERAPY FOR MENTAL HEALTH (EXCLUDING SUBSTANCE USE),751,MAJOR DEPRESSIVE DISORDERS & OTHER/UNSPECIFIED PSYCHOSES,19,MENTAL DISEASES AND DISORDERS,1,Minor,Minor,Medical,Medicaid,,,,,Y,17904.56,10296.63
New York City,Manhattan,7002001,001438,Bellevue Hospital Center,0 to 17,,M,White,Not Span/Hispanic,9,Emergency,Home or Self Care,2020,MBD002,DEPRESSIVE DISORDERS,MHT001,PHARMACOTHERAPY FOR MENTAL HEALTH (EXCLUDING SUBSTANCE USE),751,MAJOR DEPRESSIVE DISORDERS & OTHER/UNSPECIFIED PSYCHOSES,19,MENTAL DISEASES AND DISORDERS,1,Minor,Minor,Medical,Private Health Insurance,,,,,Y,13995.84,8048.78
New York City,Manhattan,7002001,001438,Bellevue Hospital Center,30 to 49,112,F,White,Not Span/Hispanic,9,Emergency,Home or Self Care,2020,MBD002,DEPRESSIVE DISORDERS,MHT001,PHARMACOTHERAPY FOR MENTAL HEALTH (EXCLUDING SUBSTANCE USE),751,MAJOR DEPRESSIVE DISORDERS & OTHER/UNSPECIFIED PSYCHOSES,19,MENTAL DISEASES AND DISORDERS,1,Minor,Minor,Medical,Medicaid,,,,,Y,13647.51,7848.46
New York City,Manhattan,7002001,001438,Bellevue Hospital Center,0 to 17,100,M,Multi-racial,Not Span/Hispanic,30,Emergency,Home or Self Care,2020,MBD002,DEPRESSIVE DISORDERS,MHT001,PHARMACOTHERAPY FOR MENTAL HEALTH (EXCLUDING SUBSTANCE USE),751,MAJOR DEPRESSIVE DISORDERS & OTHER/UNSPECIFIED PSYCHOSES,19,MENTAL DISEASES AND DISORDERS,1,Minor,Minor,Medical,Private Health Insurance,Private Health Insurance,,,,Y,43551.66,25045.86
New York City,Manhattan,7002001,001438,Bellevue Hospital Center,30 to 49,112,F,White,Not Span/Hispanic,1,Emergency,Home or Self Care,2020,MBD001,SCHIZOPHRENIA SPECTRUM AND OTHER PSYCHOTIC DISORDERS,MHT001,PHARMACOTHERAPY FOR MENTAL HEALTH (EXCLUDING SUBSTANCE USE),751,MAJOR DEPRESSIVE DISORDERS & OTHER/UNSPECIFIED PSYCHOSES,19,MENTAL DISEASES AND DISORDERS,1,Minor,Minor,Medical,Medicaid,,,,,Y,2368.26,1361.95
New York City,Manhattan,7002001,001438,Bellevue Hospital Center,30 to 49,100,M,Black/African American,Not Span/Hispanic,14,Elective,Home or Self Care,2020,MBD001,SCHIZOPHRENIA SPECTRUM AND OTHER PSYCHOTIC DISORDERS,MHT001,PHARMACOTHERAPY FOR MENTAL HEALTH (EXCLUDING SUBSTANCE USE),751,MAJOR DEPRESSIVE DISORDERS & OTHER/UNSPECIFIED PSYCHOSES,19,MENTAL DISEASES AND DISORDERS,1,Minor,Minor,Medical,Medicare,Medicaid,,,,N,20024.4,11515.71
New York City,Manhattan,7002001,001438,Bellevue Hospital Center,50 to 69,100,M,Other Race,Spanish/Hispanic,12,Elective,Home or Self Care,2020,MBD002,DEPRESSIVE DISORDERS,MHT001,PHARMACOTHERAPY FOR MENTAL HEALTH (EXCLUDING SUBSTANCE USE),751,MAJOR DEPRESSIVE DISORDERS & OTHER/UNSPECIFIED PSYCHOSES,19,MENTAL DISEASES AND DISORDERS,2,Moderate,Minor,Medical,Medicaid,,,,,Y,18400.4,10581.78
New York City,Manhattan,7002001,001438,Bellevue Hospital Center,30 to 49,114,M,Black/African American,Not Span/Hispanic,6,Elective,Home or Self Care,2020,MBD002,DEPRESSIVE DISORDERS,MHT001,PHARMACOTHERAPY FOR MENTAL HEALTH (EXCLUDING SUBSTANCE USE),751,MAJOR DEPRESSIVE DISORDERS & OTHER/UNSPECIFIED PSYCHOSES,19,MENTAL DISEASES AND DISORDERS,2,Moderate,Moderate,Medical,Medicaid,,,,,N,9396.48,5403.77
New York City,Manhattan,7002001,001438,Bellevue Hospital Center,18 to 29,104,M,Black/African American,Not Span/Hispanic,12,Emergency,Home or Self Care,2020,MBD001,SCHIZOPHRENIA SPECTRUM AND OTHER PSYCHOTIC DISORDERS,MHT001,PHARMACOTHERAPY FOR MENTAL HEALTH (EXCLUDING SUBSTANCE USE),751,MAJOR DEPRESSIVE DISORDERS & OTHER/UNSPECIFIED PSYCHOSES,19,MENTAL DISEASES AND DISORDERS,2,Moderate,Minor,Medical,Medicaid,,,,,Y,24209.76,13922.65
New York City,Manhattan,7002001,001438,Bellevue Hospital Center,18 to 29,104,M,Other Race,Unknown,23,Emergency,Home or Self Care,2020,MBD001,SCHIZOPHRENIA SPECTRUM AND OTHER PSYCHOTIC DISORDERS,MHT002,PSYCHOTHERAPY FOR MENTAL HEALTH (EXCLUDING SUBSTANCE USE),751,MAJOR DEPRESSIVE DISORDERS & OTHER/UNSPECIFIED PSYCHOSES,19,MENTAL DISEASES AND DISORDERS,2,Moderate,Minor,Medical,Private Health Insurance,,,,,Y,50102.33,28813.05
New York City,Manhattan,7002001,001438,Bellevue Hospital Center,50 to 69,104,M,Other Race,Unknown,7,Emergency,Home or Self Care,2020,MBD002,DEPRESSIVE DISORDERS,MHT001,PHARMACOTHERAPY FOR MENTAL HEALTH (EXCLUDING SUBSTANCE USE),751,MAJOR DEPRESSIVE DISORDERS & OTHER/UNSPECIFIED PSYCHOSES,19,MENTAL DISEASES AND DISORDERS,2,Moderate,Minor,Medical,Medicare,,,,,Y,12147.17,6985.64
New York City,Manhattan,7002001,001438,Bellevue Hospital Center,0 to 17,112,M,White,Not Span/Hispanic,15,Emergency,Home or Self Care,2020,MBD001,SCHIZOPHRENIA SPECTRUM AND OTHER PSYCHOTIC DISORDERS,MHT002,PSYCHOTHERAPY FOR MENTAL HEALTH (EXCLUDING SUBSTANCE USE),751,MAJOR DEPRESSIVE DISORDERS & OTHER/UNSPECIFIED PSYCHOSES,19,MENTAL DISEASES AND DISORDERS,2,Moderate,Minor,Medical,Private Health Insurance,,,,,Y,22640.61,13020.25
New York City,Manhattan,7002001,001438,Bellevue Hospital Center,30 to 49,100,M,Black/African American,Not Span/Hispanic,31,Emergency,Home or Self Care,2020,MBD002,DEPRESSIVE DISORDERS,MHT001,PHARMACOTHERAPY FOR MENTAL HEALTH (EXCLUDING SUBSTANCE USE),751,MAJOR DEPRESSIVE DISORDERS & OTHER/UNSPECIFIED PSYCHOSES,19,MENTAL DISEASES AND DISORDERS,2,Moderate,Minor,Medical,Medicaid,,,,,Y,45300.36,26051.51
New York City,Manhattan,7002001,001438,Bellevue Hospital Center,0 to 17,100,F,Other Race,Not Span/Hispanic,1,Emergency,Home or Self Care,2020,MBD002,DEPRESSIVE DISORDERS,MHT001,PHARMACOTHERAPY FOR MENTAL HEALTH (EXCLUDING SUBSTANCE USE),751,MAJOR DEPRESSIVE DISORDERS & OTHER/UNSPECIFIED PSYCHOSES,19,MENTAL DISEASES AND DISORDERS,1,Minor,Minor,Medical,Private Health Insurance,,,,,Y,2093.92,1204.18
New York City,Manhattan,7002001,001438,Bellevue Hospital Center,0 to 17,104,F,Black/African American,Not Span/Hispanic,21,Emergency,Home or Self Care,2020,MBD002,DEPRESSIVE DISORDERS,MHT001,PHARMACOTHERAPY FOR MENTAL HEALTH (EXCLUDING SUBSTANCE USE),751,MAJOR DEPRESSIVE DISORDERS & OTHER/UNSPECIFIED PSYCHOSES,19,MENTAL DISEASES AND DISORDERS,2,Moderate,Minor,Medical,Private Health Insurance,,,,,Y,34153.26,19640.99
New York City,Manhattan,7002001,001438,Bellevue Hospital Center,0 to 17,112,M,White,Not Span/Hispanic,50,Emergency,Home or Self Care,2020,MBD001,SCHIZOPHRENIA SPECTRUM AND OTHER PSYCHOTIC DISORDERS,MHT001,PHARMACOTHERAPY FOR MENTAL HEALTH (EXCLUDING SUBSTANCE USE),751,MAJOR DEPRESSIVE DISORDERS & OTHER/UNSPECIFIED PSYCHOSES,19,MENTAL DISEASES AND DISORDERS,1,Minor,Minor,Medical,Medicaid,,,,,Y,76000.76,43706.82
New York City,Manhattan,7002001,001438,Bellevue Hospital Center,0 to 17,100,M,Other Race,Spanish/Hispanic,15,Emergency,Home or Self Care,2020,MBD002,DEPRESSIVE DISORDERS,MHT002,PSYCHOTHERAPY FOR MENTAL HEALTH (EXCLUDING SUBSTANCE USE),751,MAJOR DEPRESSIVE DISORDERS & OTHER/UNSPECIFIED PSYCHOSES,19,MENTAL DISEASES AND DISORDERS,2,Moderate,Minor,Medical,Private Health Insurance,,,,,Y,22989.49,13220.89
New York City,Manhattan,7002001,001438,Bellevue Hospital Center,50 to 69,OOS,M,Black/African American,Not Span/Hispanic,1,Emergency,Home or Self Care,2020,MBD001,SCHIZOPHRENIA SPECTRUM AND OTHER PSYCHOTIC DISORDERS,MHT001,PHARMACOTHERAPY FOR MENTAL HEALTH (EXCLUDING SUBSTANCE USE),751,MAJOR DEPRESSIVE DISORDERS & OTHER/UNSPECIFIED PSYCHOSES,19,MENTAL DISEASES AND DISORDERS,2,Moderate,Minor,Medical,Private Health Insurance,Medicaid,,,,Y,2654.72,1526.69
New York City,Manhattan,7002001,001438,Bellevue Hospital Center,18 to 29,,M,Black/African American,Not Span/Hispanic,23,Emergency,Home or Self Care,2020,MBD001,SCHIZOPHRENIA SPECTRUM AND OTHER PSYCHOTIC DISORDERS,MHT001,PHARMACOTHERAPY FOR MENTAL HEALTH (EXCLUDING SUBSTANCE USE),751,MAJOR DEPRESSIVE DISORDERS & OTHER/UNSPECIFIED PSYCHOSES,19,MENTAL DISEASES AND DISORDERS,2,Moderate,Minor,Medical,Self-Pay,,,,,Y,34246.26,19694.48
New York City,Manhattan,7002001,001438,Bellevue Hospital Center,18 to 29,112,M,Black/African American,Not Span/Hispanic,1,Emergency,Home or Self Care,2020,MBD001,SCHIZOPHRENIA SPECTRUM AND OTHER PSYCHOTIC DISORDERS,MHT001,PHARMACOTHERAPY FOR MENTAL HEALTH (EXCLUDING SUBSTANCE USE),751,MAJOR DEPRESSIVE DISORDERS & OTHER/UNSPECIFIED PSYCHOSES,19,MENTAL DISEASES AND DISORDERS,1,Minor,Minor,Medical,Medicaid,,,,,Y,3064.6,1762.4
New York City,Manhattan,7002001,001438,Bellevue Hospital Center,30 to 49,113,M,Black/African American,Unknown,7,Emergency,Home or Self Care,2020,MBD001,SCHIZOPHRENIA SPECTRUM AND OTHER PSYCHOTIC DISORDERS,MHT001,PHARMACOTHERAPY FOR MENTAL HEALTH (EXCLUDING SUBSTANCE USE),751,MAJOR DEPRESSIVE DISORDERS & OTHER/UNSPECIFIED PSYCHOSES,19,MENTAL DISEASES AND DISORDERS,2,Moderate,Minor,Medical,Self-Pay,,,,,Y,11877.67,6830.66
New York City,Manhattan,7002001,001438,Bellevue Hospital Center,18 to 29,112,M,Black/African American,Not Span/Hispanic,7,Emergency,Home or Self Care,2020,MBD001,SCHIZOPHRENIA SPECTRUM AND OTHER PSYCHOTIC DISORDERS,MHT001,PHARMACOTHERAPY FOR MENTAL HEALTH (EXCLUDING SUBSTANCE USE),751,MAJOR DEPRESSIVE DISORDERS & OTHER/UNSPECIFIED PSYCHOSES,19,MENTAL DISEASES AND DISORDERS,2,Moderate,Minor,Medical,Medicaid,,,,,Y,11044.1,6351.29