Hospital Service Area,Hospital County,Operating Certificate Number,Permanent Facility Id,Facility Name,Age Group,Zip Code - 3 digits,Gender,Race,Ethnicity,Length of Stay,Type of Admission,Patient Disposition,Discharge Year,CCS Diagnosis Code,CCS Diagnosis Description,CCS Procedure Code,CCS Procedure Description,APR DRG Code,APR DRG Description,APR MDC Code,APR MDC Description,APR Severity of Illness Code,APR Severity of Illness Description,APR Risk of Mortality,APR Medical Surgical Description,Payment Typology 1,Payment Typology 2,Payment Typology 3,Birth Weight,Abortion Edit Indicator,Emergency Department Indicator,Total Charges,Total Costs
New York City,Manhattan,7002001,001438,Bellevue Hospital Center,18 to 29,OOS,F,Black/African American,Not Span/Hispanic,7,Emergency,Home or Self Care,2017,658,Personality disorders,218,PSYCHO/PSYCHI EVAL/THER,752,Disorders of personality & impulse control,19,Mental Diseases and Disorders,2,Moderate,Minor,Medical,Medicaid,Medicaid,,,N,Y,11086.89,7148.25
New York City,Manhattan,7002001,001438,Bellevue Hospital Center,18 to 29,105,M,White,Not Span/Hispanic,13,Emergency,Home or Self Care,2017,658,Personality disorders,228,PROPHYLACTIC VAC/INOCUL,752,Disorders of personality & impulse control,19,Mental Diseases and Disorders,3,Major,Minor,Medical,Private Health Insurance,Medicaid,,,N,Y,20625.69,13298.37
New York City,Manhattan,7002001,001438,Bellevue Hospital Center,30 to 49,OOS,F,White,Not Span/Hispanic,16,Emergency,Home or Self Care,2017,658,Personality disorders,219,ALCO/DRUG REHAB/DETOX,752,Disorders of personality & impulse control,19,Mental Diseases and Disorders,2,Moderate,Minor,Medical,Medicaid,Medicaid,,,N,Y,24627.99,15878.85
New York City,Manhattan,7002001,001438,Bellevue Hospital Center,30 to 49,104,M,Other Race,Spanish/Hispanic,5,Emergency,Home or Self Care,2017,658,Personality disorders,000,NO PROC,752,Disorders of personality & impulse control,19,Mental Diseases and Disorders,1,Minor,Minor,Medical,Private Health Insurance,Medicaid,,,N,Y,8290.33,5345.17
New York City,Manhattan,7002001,001438,Bellevue Hospital Center,50 to 69,100,F,Other Race,Spanish/Hispanic,14,Emergency,Home or Self Care,2017,658,Personality disorders,000,NO PROC,752,Disorders of personality & impulse control,19,Mental Diseases and Disorders,2,Moderate,Minor,Medical,Medicare,,,,N,Y,22195.84,14310.72
New York City,Manhattan,7002001,001438,Bellevue Hospital Center,30 to 49,,F,White,Not Span/Hispanic,1,Emergency,Home or Self Care,2017,658,Personality disorders,000,NO PROC,752,Disorders of personality & impulse control,19,Mental Diseases and Disorders,2,Moderate,Minor,Medical,Medicare,Medicaid,,,N,Y,2313.42,1491.57
New York City,Manhattan,7002001,001438,Bellevue Hospital Center,30 to 49,100,M,White,Not Span/Hispanic,1,Emergency,Home or Self Care,2017,658,Personality disorders,218,PSYCHO/PSYCHI EVAL/THER,752,Disorders of personality & impulse control,19,Mental Diseases and Disorders,2,Moderate,Minor,Medical,Medicaid,Medicaid,,,N,Y,2614.38,1685.62
New York City,Manhattan,7002001,001438,Bellevue Hospital Center,50 to 69,,F,Black/African American,Not Span/Hispanic,13,Emergency,Home or Self Care,2017,658,Personality disorders,000,NO PROC,752,Disorders of personality & impulse control,19,Mental Diseases and Disorders,2,Moderate,Minor,Medical,Medicare,,,,N,Y,20793.91,13406.83
New York City,Manhattan,7002001,001438,Bellevue Hospital Center,18 to 29,100,F,White,Not Span/Hispanic,2,Emergency,Another Type Not Listed,2017,658,Personality disorders,000,NO PROC,752,Disorders of personality & impulse control,19,Mental Diseases and Disorders,2,Moderate,Minor,Medical,Medicaid,Medicaid,,,N,Y,4321.22,2786.10
New York City,Manhattan,7002001,001438,Bellevue Hospital Center,18 to 29,100,M,Black/African American,Not Span/Hispanic,1,Emergency,Home or Self Care,2017,658,Personality disorders,000,NO PROC,752,Disorders of personality & impulse control,19,Mental Diseases and Disorders,2,Moderate,Minor,Medical,Medicaid,,,,N,Y,2863.54,1846.26
New York City,Manhattan,7002001,001438,Bellevue Hospital Center,30 to 49,100,F,White,Not Span/Hispanic,20,Emergency,Home or Self Care,2017,658,Personality disorders,218,PSYCHO/PSYCHI EVAL/THER,752,Disorders of personality & impulse control,19,Mental Diseases and Disorders,2,Moderate,Minor,Medical,Self-Pay,,,,N,Y,29990.50,19336.31
New York City,Manhattan,7002001,001438,Bellevue Hospital Center,18 to 29,100,F,White,Not Span/Hispanic,11,Emergency,Home or Self Care,2017,658,Personality disorders,000,NO PROC,752,Disorders of personality & impulse control,19,Mental Diseases and Disorders,2,Moderate,Minor,Medical,Private Health Insurance,Medicaid,,,N,Y,17173.67,11072.69
New York City,Manhattan,7002001,001438,Bellevue Hospital Center,30 to 49,100,M,Other Race,Not Span/Hispanic,2,Emergency,Home or Self Care,2017,658,Personality disorders,063,OT NON-OR THER CARDIO,752,Disorders of personality & impulse control,19,Mental Diseases and Disorders,1,Minor,Minor,Medical,Medicaid,,,,N,Y,4334.95,2794.95
New York City,Manhattan,7002001,001438,Bellevue Hospital Center,30 to 49,112,M,Black/African American,Not Span/Hispanic,1,Emergency,Home or Self Care,2017,658,Personality disorders,218,PSYCHO/PSYCHI EVAL/THER,752,Disorders of personality & impulse control,19,Mental Diseases and Disorders,2,Moderate,Minor,Medical,Medicaid,Medicaid,,,N,Y,2981.66,1922.42
New York City,Manhattan,7002001,001438,Bellevue Hospital Center,30 to 49,104,M,Other Race,Not Span/Hispanic,3,Emergency,Home or Self Care,2017,658,Personality disorders,218,PSYCHO/PSYCHI EVAL/THER,752,Disorders of personality & impulse control,19,Mental Diseases and Disorders,2,Moderate,Minor,Medical,Private Health Insurance,Medicaid,,,N,Y,7038.89,4538.31
New York City,Manhattan,7002001,001438,Bellevue Hospital Center,18 to 29,100,M,Black/African American,Not Span/Hispanic,1,Emergency,Home or Self Care,2017,658,Personality disorders,218,PSYCHO/PSYCHI EVAL/THER,752,Disorders of personality & impulse control,19,Mental Diseases and Disorders,2,Moderate,Minor,Medical,Medicaid,,,,N,Y,2796.31,1802.92
New York City,Manhattan,7002001,001438,Bellevue Hospital Center,30 to 49,100,F,Black/African American,Not Span/Hispanic,10,Emergency,Home or Self Care,2017,658,Personality disorders,218,PSYCHO/PSYCHI EVAL/THER,752,Disorders of personality & impulse control,19,Mental Diseases and Disorders,2,Moderate,Minor,Medical,Medicaid,Medicaid,,,N,N,14090.24,9084.65
New York City,Manhattan,7002001,001438,Bellevue Hospital Center,50 to 69,100,M,Other Race,Not Span/Hispanic,1,Emergency,Home or Self Care,2017,658,Personality disorders,218,PSYCHO/PSYCHI EVAL/THER,752,Disorders of personality & impulse control,19,Mental Diseases and Disorders,1,Minor,Minor,Medical,Medicaid,Medicaid,,,N,Y,2965.98,1912.31
New York City,Manhattan,7002001,001438,Bellevue Hospital Center,18 to 29,100,M,Black/African American,Not Span/Hispanic,9,Emergency,Home or Self Care,2017,658,Personality disorders,218,PSYCHO/PSYCHI EVAL/THER,752,Disorders of personality & impulse control,19,Mental Diseases and Disorders,2,Moderate,Minor,Medical,Department of Corrections,,,,N,Y,14302.77,9221.68
New York City,Manhattan,7002001,001438,Bellevue Hospital Center,18 to 29,100,M,Black/African American,Not Span/Hispanic,1,Emergency,Home or Self Care,2017,658,Personality disorders,218,PSYCHO/PSYCHI EVAL/THER,752,Disorders of personality & impulse control,19,Mental Diseases and Disorders,1,Minor,Minor,Medical,Medicaid,,,,N,Y,2874.11,1853.08
New York City,Manhattan,7002001,001438,Bellevue Hospital Center,30 to 49,112,F,White,Not Span/Hispanic,18,Emergency,Home or Self Care,2017,658,Personality disorders,218,PSYCHO/PSYCHI EVAL/THER,752,Disorders of personality & impulse control,19,Mental Diseases and Disorders,2,Moderate,Minor,Medical,Medicaid,Medicaid,,,N,Y,26387.99,17013.60
New York City,Manhattan,7002001,001438,Bellevue Hospital Center,50 to 69,100,F,White,Not Span/Hispanic,2,Emergency,Home or Self Care,2017,658,Personality disorders,218,PSYCHO/PSYCHI EVAL/THER,752,Disorders of personality & impulse control,19,Mental Diseases and Disorders,2,Moderate,Minor,Medical,Medicaid,Medicaid,,,N,Y,4171.56,2689.60
New York City,Manhattan,7002001,001438,Bellevue Hospital Center,30 to 49,103,M,White,Not Span/Hispanic,3,Emergency,Home or Self Care,2017,658,Personality disorders,218,PSYCHO/PSYCHI EVAL/THER,752,Disorders of personality & impulse control,19,Mental Diseases and Disorders,2,Moderate,Minor,Medical,Private Health Insurance,Medicaid,,,N,Y,6226.17,4014.31
New York City,Manhattan,7002001,001438,Bellevue Hospital Center,30 to 49,100,M,White,Not Span/Hispanic,1,Emergency,Home or Self Care,2017,658,Personality disorders,218,PSYCHO/PSYCHI EVAL/THER,752,Disorders of personality & impulse control,19,Mental Diseases and Disorders,2,Moderate,Minor,Medical,Private Health Insurance,Medicaid,,,N,Y,2880.42,1857.15
New York City,Manhattan,7002001,001438,Bellevue Hospital Center,30 to 49,100,M,White,Not Span/Hispanic,34,Emergency,Home or Self Care,2017,658,Personality disorders,218,PSYCHO/PSYCHI EVAL/THER,752,Disorders of personality & impulse control,19,Mental Diseases and Disorders,2,Moderate,Minor,Medical,Medicaid,,,,N,Y,48999.74,31592.48
New York City,Manhattan,7002001,001438,Bellevue Hospital Center,18 to 29,100,F,Black/African American,Not Span/Hispanic,16,Emergency,Home or Self Care,2017,658,Personality disorders,218,PSYCHO/PSYCHI EVAL/THER,752,Disorders of personality & impulse control,19,Mental Diseases and Disorders,2,Moderate,Minor,Medical,Medicaid,,,,N,Y,24150.03,15570.68
New York City,Manhattan,7002001,001438,Bellevue Hospital Center,30 to 49,OOS,M,Black/African American,Not Span/Hispanic,1,Emergency,Home or Self Care,2017,658,Personality disorders,218,PSYCHO/PSYCHI EVAL/THER,752,Disorders of personality & impulse control,19,Mental Diseases and Disorders,1,Minor,Minor,Medical,Medicaid,,,,N,Y,2636.90,1700.14
New York City,Manhattan,7002001,001438,Bellevue Hospital Center,50 to 69,103,F,White,Not Span/Hispanic,1,Emergency,Home or Self Care,2017,658,Personality disorders,218,PSYCHO/PSYCHI EVAL/THER,752,Disorders of personality & impulse control,19,Mental Diseases and Disorders,2,Moderate,Minor,Medical,Medicare,Medicare,Medicaid,,N,Y,2172.99,1401.03
New York City,Manhattan,7002001,001438,Bellevue Hospital Center,18 to 29,OOS,M,Black/African American,Not Span/Hispanic,7,Emergency,Home or Self Care,2017,658,Personality disorders,000,NO PROC,752,Disorders of personality & impulse control,19,Mental Diseases and Disorders,2,Moderate,Minor,Medical,Medicare,,,,N,Y,11263.14,7261.89
New York City,Manhattan,7002001,001438,Bellevue Hospital Center,30 to 49,100,F,Black/African American,Not Span/Hispanic,1,Emergency,Home or Self Care,2017,658,Personality disorders,218,PSYCHO/PSYCHI EVAL/THER,752,Disorders of personality & impulse control,19,Mental Diseases and Disorders,2,Moderate,Minor,Medical,Medicaid,,,,N,Y,2543.08,1639.65
New York City,Manhattan,7002001,001438,Bellevue Hospital Center,30 to 49,100,M,Black/African American,Not Span/Hispanic,3,Emergency,Home or Self Care,2017,658,Personality disorders,218,PSYCHO/PSYCHI EVAL/THER,752,Disorders of personality & impulse control,19,Mental Diseases and Disorders,2,Moderate,Minor,Medical,Medicare,Private Health Insurance,,,N,Y,5052.93,3257.87
New York City,Manhattan,7002001,001438,Bellevue Hospital Center,30 to 49,112,M,Black/African American,Not Span/Hispanic,2,Emergency,Home or Self Care,2017,658,Personality disorders,218,PSYCHO/PSYCHI EVAL/THER,752,Disorders of personality & impulse control,19,Mental Diseases and Disorders,2,Moderate,Minor,Medical,Medicaid,Medicaid,,,N,Y,4004.68,2582.01
New York City,Manhattan,7002001,001438,Bellevue Hospital Center,50 to 69,114,M,Black/African American,Not Span/Hispanic,1,Emergency,Home or Self Care,2017,658,Personality disorders,218,PSYCHO/PSYCHI EVAL/THER,752,Disorders of personality & impulse control,19,Mental Diseases and Disorders,1,Minor,Minor,Medical,Medicaid,Medicaid,,,N,Y,3285.01,2118.00
New York City,Manhattan,7002001,001438,Bellevue Hospital Center,30 to 49,100,F,Black/African American,Not Span/Hispanic,5,Emergency,Home or Self Care,2017,658,Personality disorders,218,PSYCHO/PSYCHI EVAL/THER,752,Disorders of personality & impulse control,19,Mental Diseases and Disorders,2,Moderate,Minor,Medical,Medicaid,Medicaid,,,N,Y,8593.36,5540.55
New York City,Manhattan,7002001,001438,Bellevue Hospital Center,50 to 69,112,F,White,Not Span/Hispanic,1,Emergency,Home or Self Care,2017,658,Personality disorders,218,PSYCHO/PSYCHI EVAL/THER,752,Disorders of personality & impulse control,19,Mental Diseases and Disorders,2,Moderate,Minor,Medical,Self-Pay,,,,N,Y,3009.19,1940.17
New York City,Manhattan,7002001,001438,Bellevue Hospital Center,18 to 29,104,M,Other Race,Not Span/Hispanic,2,Emergency,Home or Self Care,2017,658,Personality disorders,218,PSYCHO/PSYCHI EVAL/THER,752,Disorders of personality & impulse control,19,Mental Diseases and Disorders,2,Moderate,Minor,Medical,Medicaid,,,,N,Y,6187.85,3989.60
New York City,Manhattan,7002001,001438,Bellevue Hospital Center,30 to 49,100,M,Black/African American,Not Span/Hispanic,1,Emergency,Home or Self Care,2017,658,Personality disorders,218,PSYCHO/PSYCHI EVAL/THER,752,Disorders of personality & impulse control,19,Mental Diseases and Disorders,1,Minor,Minor,Medical,Medicaid,Medicaid,,,N,Y,1846.93,1190.80
New York City,Manhattan,7002001,001438,Bellevue Hospital Center,30 to 49,113,M,Other Race,Not Span/Hispanic,5,Emergency,Home or Self Care,2017,658,Personality disorders,218,PSYCHO/PSYCHI EVAL/THER,752,Disorders of personality & impulse control,19,Mental Diseases and Disorders,2,Moderate,Minor,Medical,Medicaid,,,,N,N,7375.10,4755.08
New York City,Manhattan,7002001,001438,Bellevue Hospital Center,30 to 49,112,F,White,Not Span/Hispanic,1,Emergency,Home or Self Care,2017,658,Personality disorders,218,PSYCHO/PSYCHI EVAL/THER,752,Disorders of personality & impulse control,19,Mental Diseases and Disorders,2,Moderate,Minor,Medical,Private Health Insurance,,,,N,Y,2398.54,1546.45
New York City,Manhattan,7002001,001438,Bellevue Hospital Center,30 to 49,112,F,White,Not Span/Hispanic,1,Emergency,Home or Self Care,2017,658,Personality disorders,218,PSYCHO/PSYCHI EVAL/THER,752,Disorders of personality & impulse control,19,Mental Diseases and Disorders,2,Moderate,Minor,Medical,Medicaid,Medicaid,,,N,Y,2841.20,1831.86
New York City,Manhattan,7002001,001438,Bellevue Hospital Center,18 to 29,114,F,Black/African American,Not Span/Hispanic,20,Emergency,Another Type Not Listed,2017,658,Personality disorders,218,PSYCHO/PSYCHI EVAL/THER,752,Disorders of personality & impulse control,19,Mental Diseases and Disorders,2,Moderate,Minor,Medical,Medicaid,,,,N,Y,39787.09,25652.65
New York City,Manhattan,7002001,001438,Bellevue Hospital Center,50 to 69,112,M,Other Race,Spanish/Hispanic,11,Emergency,Home or Self Care,2017,658,Personality disorders,218,PSYCHO/PSYCHI EVAL/THER,752,Disorders of personality & impulse control,19,Mental Diseases and Disorders,2,Moderate,Minor,Medical,Medicaid,Medicaid,,,N,Y,16642.21,10730.03
New York City,Manhattan,7002001,001438,Bellevue Hospital Center,30 to 49,111,M,Other Race,Not Span/Hispanic,17,Emergency,Home or Self Care,2017,658,Personality disorders,218,PSYCHO/PSYCHI EVAL/THER,752,Disorders of personality & impulse control,19,Mental Diseases and Disorders,2,Moderate,Minor,Medical,Medicaid,,,,N,Y,26177.54,16877.92
New York City,Manhattan,7002001,001438,Bellevue Hospital Center,30 to 49,100,M,White,Not Span/Hispanic,4,Emergency,Home or Self Care,2017,658,Personality disorders,218,PSYCHO/PSYCHI EVAL/THER,752,Disorders of personality & impulse control,19,Mental Diseases and Disorders,2,Moderate,Minor,Medical,Medicare,,,,N,Y,6531.05,4210.88
New York City,Manhattan,7002001,001438,Bellevue Hospital Center,30 to 49,100,M,Black/African American,Not Span/Hispanic,7,Emergency,Home or Self Care,2017,658,Personality disorders,218,PSYCHO/PSYCHI EVAL/THER,752,Disorders of personality & impulse control,19,Mental Diseases and Disorders,2,Moderate,Minor,Medical,Medicaid,Medicaid,,,N,Y,11587.69,7471.14
New York City,Manhattan,7002001,001438,Bellevue Hospital Center,18 to 29,100,M,Other Race,Not Span/Hispanic,11,Emergency,Home or Self Care,2017,658,Personality disorders,218,PSYCHO/PSYCHI EVAL/THER,752,Disorders of personality & impulse control,19,Mental Diseases and Disorders,1,Minor,Minor,Medical,Self-Pay,,,,N,Y,16831.42,10852.02
New York City,Manhattan,7002001,001438,Bellevue Hospital Center,18 to 29,100,F,White,Not Span/Hispanic,12,Emergency,Home or Self Care,2017,658,Personality disorders,218,PSYCHO/PSYCHI EVAL/THER,752,Disorders of personality & impulse control,19,Mental Diseases and Disorders,2,Moderate,Minor,Medical,Medicaid,Medicaid,,,N,Y,19510.28,12579.21
New York City,Manhattan,7002001,001438,Bellevue Hospital Center,50 to 69,100,M,Black/African American,Not Span/Hispanic,1,Emergency,Home or Self Care,2017,658,Personality disorders,218,PSYCHO/PSYCHI EVAL/THER,752,Disorders of personality & impulse control,19,Mental Diseases and Disorders,1,Minor,Minor,Medical,Medicaid,,,,N,Y,2636.08,1699.61
New York City,Manhattan,7002001,001438,Bellevue Hospital Center,18 to 29,113,M,Black/African American,Not Span/Hispanic,8,Emergency,Home or Self Care,2017,658,Personality disorders,218,PSYCHO/PSYCHI EVAL/THER,752,Disorders of personality & impulse control,19,Mental Diseases and Disorders,2,Moderate,Minor,Medical,Self-Pay,,,,N,Y,12428.50,8013.25
New York City,Manhattan,7002001,001438,Bellevue Hospital Center,18 to 29,100,F,White,Not Span/Hispanic,6,Emergency,Home or Self Care,2017,658,Personality disorders,218,PSYCHO/PSYCHI EVAL/THER,752,Disorders of personality & impulse control,19,Mental Diseases and Disorders,2,Moderate,Minor,Medical,Medicaid,Medicaid,,,N,Y,9343.02,6023.89
New York City,Manhattan,7002001,001438,Bellevue Hospital Center,18 to 29,100,M,Black/African American,Not Span/Hispanic,4,Emergency,Home or Self Care,2017,670,Miscellaneous disorders,179,CT SCAN ABDOMEN,752,Disorders of personality & impulse control,19,Mental Diseases and Disorders,1,Minor,Minor,Medical,Department of Corrections,,,,N,Y,28223.18,18196.84
New York City,Manhattan,7002001,001438,Bellevue Hospital Center,18 to 29,100,M,Other Race,Not Span/Hispanic,4,Emergency,Home or Self Care,2017,658,Personality disorders,218,PSYCHO/PSYCHI EVAL/THER,752,Disorders of personality & impulse control,19,Mental Diseases and Disorders,2,Moderate,Minor,Medical,Medicaid,Medicaid,,,N,Y,6653.12,4289.59
New York City,Manhattan,7002001,001438,Bellevue Hospital Center,70 or Older,100,F,White,Not Span/Hispanic,14,Emergency,Home or Self Care,2017,658,Personality disorders,218,PSYCHO/PSYCHI EVAL/THER,752,Disorders of personality & impulse control,19,Mental Diseases and Disorders,2,Moderate,Minor,Medical,Medicare,Private Health Insurance,,,N,Y,22669.07,14615.84
New York City,Manhattan,7002001,001438,Bellevue Hospital Center,30 to 49,100,F,White,Not Span/Hispanic,1,Emergency,Home or Self Care,2017,658,Personality disorders,000,NO PROC,752,Disorders of personality & impulse control,19,Mental Diseases and Disorders,2,Moderate,Minor,Medical,Medicaid,Medicaid,,,N,Y,1937.06,1248.92
New York City,Manhattan,7002001,001438,Bellevue Hospital Center,18 to 29,112,F,Other Race,Spanish/Hispanic,7,Emergency,Home or Self Care,2017,658,Personality disorders,218,PSYCHO/PSYCHI EVAL/THER,752,Disorders of personality & impulse control,19,Mental Diseases and Disorders,2,Moderate,Minor,Medical,Medicaid,Medicaid,,,N,Y,11051.41,7125.37
New York City,Manhattan,7002001,001438,Bellevue Hospital Center,50 to 69,112,F,Other Race,Spanish/Hispanic,1,Emergency,Home or Self Care,2017,658,Personality disorders,218,PSYCHO/PSYCHI EVAL/THER,752,Disorders of personality & impulse control,19,Mental Diseases and Disorders,2,Moderate,Minor,Medical,Medicaid,Medicaid,,,N,Y,2824.14,1820.86
New York City,Manhattan,7002001,001438,Bellevue Hospital Center,30 to 49,100,F,White,Not Span/Hispanic,1,Emergency,Home or Self Care,2017,658,Personality disorders,218,PSYCHO/PSYCHI EVAL/THER,752,Disorders of personality & impulse control,19,Mental Diseases and Disorders,2,Moderate,Minor,Medical,Medicaid,Medicaid,,,N,Y,2729.50,1759.84
New York City,Manhattan,7002001,001438,Bellevue Hospital Center,18 to 29,112,M,Other Race,Spanish/Hispanic,4,Emergency,Home or Self Care,2017,658,Personality disorders,219,ALCO/DRUG REHAB/DETOX,752,Disorders of personality & impulse control,19,Mental Diseases and Disorders,1,Minor,Minor,Medical,Private Health Insurance,,,,N,Y,5900.72,3804.48
New York City,Manhattan,7002001,001438,Bellevue Hospital Center,30 to 49,100,F,Other Race,Not Span/Hispanic,1,Emergency,Home or Self Care,2017,658,Personality disorders,218,PSYCHO/PSYCHI EVAL/THER,752,Disorders of personality & impulse control,19,Mental Diseases and Disorders,2,Moderate,Minor,Medical,Medicaid,Medicaid,,,N,Y,2551.34,1644.97
New York City,Manhattan,7002001,001438,Bellevue Hospital Center,18 to 29,112,F,Other Race,Not Span/Hispanic,1,Emergency,Home or Self Care,2017,658,Personality disorders,219,ALCO/DRUG REHAB/DETOX,752,Disorders of personality & impulse control,19,Mental Diseases and Disorders,2,Moderate,Minor,Medical,Medicaid,Medicaid,,,N,Y,2714.60,1750.23
New York City,Manhattan,7002001,001438,Bellevue Hospital Center,18 to 29,112,M,Other Race,Not Span/Hispanic,2,Emergency,Home or Self Care,2017,658,Personality disorders,219,ALCO/DRUG REHAB/DETOX,752,Disorders of personality & impulse control,19,Mental Diseases and Disorders,2,Moderate,Minor,Medical,Medicaid,Medicaid,,,N,Y,3589.09,2314.06
New York City,Manhattan,7002001,001438,Bellevue Hospital Center,30 to 49,100,F,Other Race,Not Span/Hispanic,1,Emergency,Home or Self Care,2017,658,Personality disorders,218,PSYCHO/PSYCHI EVAL/THER,752,Disorders of personality & impulse control,19,Mental Diseases and Disorders,2,Moderate,Minor,Medical,Medicare,Medicaid,,,N,Y,2825.50,1821.74
New York City,Manhattan,7002001,001438,Bellevue Hospital Center,18 to 29,100,M,Other Race,Not Span/Hispanic,9,Emergency,Home or Self Care,2017,658,Personality disorders,218,PSYCHO/PSYCHI EVAL/THER,752,Disorders of personality & impulse control,19,Mental Diseases and Disorders,2,Moderate,Minor,Medical,Medicaid,Medicaid,,,N,Y,14304.90,9223.06
New York City,Manhattan,7002001,001438,Bellevue Hospital Center,18 to 29,100,F,Other Race,Spanish/Hispanic,1,Emergency,Home or Self Care,2017,658,Personality disorders,218,PSYCHO/PSYCHI EVAL/THER,752,Disorders of personality & impulse control,19,Mental Diseases and Disorders,2,Moderate,Minor,Medical,Medicaid,Medicaid,,,N,Y,1846.93,1190.80
New York City,Manhattan,7002001,001438,Bellevue Hospital Center,18 to 29,100,F,Other Race,Not Span/Hispanic,5,Emergency,Home or Self Care,2017,658,Personality disorders,000,NO PROC,752,Disorders of personality & impulse control,19,Mental Diseases and Disorders,2,Moderate,Minor,Medical,Blue Cross/Blue Shield,,,,N,Y,8210.60,5293.77
New York City,Manhattan,7002001,001438,Bellevue Hospital Center,30 to 49,100,M,Black/African American,Not Span/Hispanic,1,Emergency,Home or Self Care,2017,658,Personality disorders,218,PSYCHO/PSYCHI EVAL/THER,752,Disorders of personality & impulse control,19,Mental Diseases and Disorders,2,Moderate,Minor,Medical,Medicaid,,,,N,Y,3146.95,2028.99
New York City,Manhattan,7002001,001438,Bellevue Hospital Center,30 to 49,100,M,Other Race,Spanish/Hispanic,1,Emergency,Home or Self Care,2017,658,Personality disorders,218,PSYCHO/PSYCHI EVAL/THER,752,Disorders of personality & impulse control,19,Mental Diseases and Disorders,1,Minor,Minor,Medical,Medicaid,Medicaid,,,N,Y,2829.27,1824.17
New York City,Manhattan,7002001,001438,Bellevue Hospital Center,18 to 29,100,F,Black/African American,Not Span/Hispanic,1,Emergency,Home or Self Care,2017,658,Personality disorders,218,PSYCHO/PSYCHI EVAL/THER,752,Disorders of personality & impulse control,19,Mental Diseases and Disorders,2,Moderate,Minor,Medical,Medicaid,Medicaid,,,N,Y,2129.99,1373.31