Hospital Service Area,Hospital County,Operating Certificate Number,Permanent Facility Id,Facility Name,Age Group,Zip Code - 3 digits,Gender,Race,Ethnicity,Length of Stay,Type of Admission,Patient Disposition,Discharge Year,CCS Diagnosis Code,CCS Diagnosis Description,CCS Procedure Code,CCS Procedure Description,APR DRG Code,APR DRG Description,APR MDC Code,APR MDC Description,APR Severity of Illness Code,APR Severity of Illness Description,APR Risk of Mortality,APR Medical Surgical Description,Payment Typology 1,Payment Typology 2,Payment Typology 3,Birth Weight,Abortion Edit Indicator,Emergency Department Indicator,Total Charges,Total Costs
Hudson Valley,Putnam,3950000,000752,Putnam Hospital,18 to 29,125,F,White,Not Span/Hispanic,6,Emergency,Facility w/ Custodial/Supportive Care,2018,MBD009,PERSONALITY DISORDERS,,,752,DISORDERS OF PERSONALITY & IMPULSE CONTROL,19,MENTAL DISEASES AND DISORDERS,2,Moderate,Minor,Medical,"Managed Care, Unspecified",,,,,true,24277.68,10469.76
Hudson Valley,Putnam,3950000,000752,Putnam Hospital,50 to 69,105,F,White,Not Span/Hispanic,1,Emergency,Home or Self Care,2018,MBD009,PERSONALITY DISORDERS,,,752,DISORDERS OF PERSONALITY & IMPULSE CONTROL,19,MENTAL DISEASES AND DISORDERS,1,Minor,Minor,Medical,Medicaid,,,,,true,8770.85,2838.03
Western NY,Erie,1401005,000210,Erie County Medical Center,30 to 49,142,F,White,Not Span/Hispanic,10,Emergency,Home or Self Care,2018,MBD009,PERSONALITY DISORDERS,,,752,DISORDERS OF PERSONALITY & IMPULSE CONTROL,19,MENTAL DISEASES AND DISORDERS,2,Moderate,Minor,Medical,Private Health Insurance,,,,,false,16078.43,11341.98
New York City,Manhattan,7002032,001469,Mount Sinai Morningside,30 to 49,100,F,Other Race,Spanish/Hispanic,12,Emergency,Home or Self Care,2018,MBD007,TRAUMA- AND STRESSOR-RELATED DISORDERS,MHT001,PHARMACOTHERAPY FOR MENTAL HEALTH (EXCLUDING SUBSTANCE USE),752,DISORDERS OF PERSONALITY & IMPULSE CONTROL,19,MENTAL DISEASES AND DISORDERS,2,Moderate,Minor,Medical,Private Health Insurance,Medicaid,Self-Pay,,,true,52474,24734.44
Western NY,Erie,1401005,000210,Erie County Medical Center,50 to 69,148,F,White,Not Span/Hispanic,9,Elective,Home or Self Care,2018,MBD009,PERSONALITY DISORDERS,,,752,DISORDERS OF PERSONALITY & IMPULSE CONTROL,19,MENTAL DISEASES AND DISORDERS,2,Moderate,Minor,Medical,Medicare,Medicaid,,,,false,15944.05,9529.27
Western NY,Erie,1401005,000210,Erie County Medical Center,0 to 17,141,M,Other Race,Not Span/Hispanic,17,Urgent,Psychiatric Hospital or Unit of Hosp,2018,MBD009,PERSONALITY DISORDERS,,,752,DISORDERS OF PERSONALITY & IMPULSE CONTROL,19,MENTAL DISEASES AND DISORDERS,2,Moderate,Minor,Medical,Medicaid,,,,,false,25330.17,16665.57
Central NY,Onondaga,3301007,000628,UPSTATE University Hospital at Community General,30 to 49,132,M,Other Race,Not Span/Hispanic,5,Emergency,Home or Self Care,2018,MBD009,PERSONALITY DISORDERS,MHT002,PSYCHOTHERAPY FOR MENTAL HEALTH (EXCLUDING SUBSTANCE USE),752,DISORDERS OF PERSONALITY & IMPULSE CONTROL,19,MENTAL DISEASES AND DISORDERS,2,Moderate,Minor,Medical,Medicaid,,,,,true,24375.5,6289.67
New York City,Queens,7003004,001630,Long Island Jewish Medical Center,18 to 29,114,F,Other Race,Unknown,7,Urgent,Home or Self Care,2018,MBD009,PERSONALITY DISORDERS,MHT001,PHARMACOTHERAPY FOR MENTAL HEALTH (EXCLUDING SUBSTANCE USE),752,DISORDERS OF PERSONALITY & IMPULSE CONTROL,19,MENTAL DISEASES AND DISORDERS,2,Moderate,Minor,Medical,Medicaid,Medicaid,Self-Pay,,,false,43885,9232.55
New York City,Manhattan,7002017,001450,Lenox Hill Hospital,30 to 49,112,F,Other Race,Not Span/Hispanic,25,Emergency,Home or Self Care,2018,MBD009,PERSONALITY DISORDERS,,,752,DISORDERS OF PERSONALITY & IMPULSE CONTROL,19,MENTAL DISEASES AND DISORDERS,2,Moderate,Minor,Medical,Medicaid,Medicaid,,,,true,176080.06,54955.55
Capital/Adirond,Schenectady,4601001,000829,Ellis Hospital,50 to 69,121,F,White,Not Span/Hispanic,24,Emergency,Home or Self Care,2018,MBD009,PERSONALITY DISORDERS,MHT003,ELECTROCONVULSIVE THERAPY,752,DISORDERS OF PERSONALITY & IMPULSE CONTROL,19,MENTAL DISEASES AND DISORDERS,2,Moderate,Moderate,Medical,Medicare,Medicare,Medicaid,,,true,96754.65,31822.56
Capital/Adirond,Albany,0101000,000001,Albany Medical Center Hospital,30 to 49,122,M,Black/African American,Not Span/Hispanic,3,Emergency,Home or Self Care,2018,MBD009,PERSONALITY DISORDERS,,,752,DISORDERS OF PERSONALITY & IMPULSE CONTROL,19,MENTAL DISEASES AND DISORDERS,2,Moderate,Minor,Medical,Medicare,Medicaid,,,,true,12710.6,4213.2
Hudson Valley,Dutchess,5957001,000180,Mid-Hudson Valley Division of Westchester Medical Center,30 to 49,126,F,White,Not Span/Hispanic,2,Emergency,Home or Self Care,2018,MBD009,PERSONALITY DISORDERS,MHT002,PSYCHOTHERAPY FOR MENTAL HEALTH (EXCLUDING SUBSTANCE USE),752,DISORDERS OF PERSONALITY & IMPULSE CONTROL,19,MENTAL DISEASES AND DISORDERS,2,Moderate,Minor,Medical,Medicare,,,,,true,10616.24,1396.32
Capital/Adirond,Rensselaer,4102002,000756,Samaritan Hospital,18 to 29,120,F,White,Not Span/Hispanic,11,Emergency,Home or Self Care,2018,MBD009,PERSONALITY DISORDERS,SUD001,SUBSTANCE USE DETOXIFICATION,752,DISORDERS OF PERSONALITY & IMPULSE CONTROL,19,MENTAL DISEASES AND DISORDERS,2,Moderate,Moderate,Medical,Private Health Insurance,,,,,true,21984.3,10170.93
New York City,Manhattan,7002054,001464,New York-Presbyterian Hospital - Columbia Presbyterian Center,30 to 49,113,F,Other Race,Not Span/Hispanic,3,Emergency,Psychiatric Hospital or Unit of Hosp,2018,MBD009,PERSONALITY DISORDERS,,,752,DISORDERS OF PERSONALITY & IMPULSE CONTROL,19,MENTAL DISEASES AND DISORDERS,2,Moderate,Minor,Medical,Medicaid,Medicaid,Self-Pay,,,true,24473.55,5994.39
New York City,Queens,7003004,001630,Long Island Jewish Medical Center,18 to 29,113,F,Other Race,Not Span/Hispanic,5,Urgent,Home or Self Care,2018,MBD009,PERSONALITY DISORDERS,MHT001,PHARMACOTHERAPY FOR MENTAL HEALTH (EXCLUDING SUBSTANCE USE),752,DISORDERS OF PERSONALITY & IMPULSE CONTROL,19,MENTAL DISEASES AND DISORDERS,2,Moderate,Minor,Medical,Medicaid,Medicaid,Self-Pay,,,false,31678,6638.68
New York City,Queens,7003004,001630,Long Island Jewish Medical Center,18 to 29,110,M,Other Race,Not Span/Hispanic,1,Emergency,Short-term Hospital,2018,MBD009,PERSONALITY DISORDERS,MHT002,PSYCHOTHERAPY FOR MENTAL HEALTH (EXCLUDING SUBSTANCE USE),752,DISORDERS OF PERSONALITY & IMPULSE CONTROL,19,MENTAL DISEASES AND DISORDERS,2,Moderate,Minor,Medical,Medicaid,Medicaid,Self-Pay,,,false,7346.35,1462.25
Capital/Adirond,Albany,0101000,000001,Albany Medical Center Hospital,30 to 49,125,M,White,Not Span/Hispanic,9,Urgent,Home or Self Care,2018,MBD009,PERSONALITY DISORDERS,,,752,DISORDERS OF PERSONALITY & IMPULSE CONTROL,19,MENTAL DISEASES AND DISORDERS,2,Moderate,Minor,Medical,Medicare,Medicaid,,,,true,43774.29,11318.75
Western NY,Erie,1401005,000210,Erie County Medical Center,18 to 29,142,M,White,Not Span/Hispanic,1,Elective,Home or Self Care,2018,MBD009,PERSONALITY DISORDERS,,,752,DISORDERS OF PERSONALITY & IMPULSE CONTROL,19,MENTAL DISEASES AND DISORDERS,2,Moderate,Minor,Medical,Medicaid,Medicaid,,,,false,1319.76,944.36
New York City,Manhattan,7002001,001438,Bellevue Hospital Center,0 to 17,104,F,Other Race,Spanish/Hispanic,1,Emergency,Home or Self Care,2018,MBD009,PERSONALITY DISORDERS,MHT002,PSYCHOTHERAPY FOR MENTAL HEALTH (EXCLUDING SUBSTANCE USE),752,DISORDERS OF PERSONALITY & IMPULSE CONTROL,19,MENTAL DISEASES AND DISORDERS,2,Moderate,Minor,Medical,Private Health Insurance,,,,,false,1542.24,1024.97
Central NY,Onondaga,3301007,000628,UPSTATE University Hospital at Community General,18 to 29,136,M,White,Not Span/Hispanic,2,Emergency,Home or Self Care,2018,MBD009,PERSONALITY DISORDERS,MHT002,PSYCHOTHERAPY FOR MENTAL HEALTH (EXCLUDING SUBSTANCE USE),752,DISORDERS OF PERSONALITY & IMPULSE CONTROL,19,MENTAL DISEASES AND DISORDERS,2,Moderate,Minor,Medical,Medicaid,,,,,false,9767.6,2411.08
Central NY,Onondaga,3301007,000628,UPSTATE University Hospital at Community General,18 to 29,132,M,White,Not Span/Hispanic,5,Emergency,Home or Self Care,2018,MBD009,PERSONALITY DISORDERS,,,752,DISORDERS OF PERSONALITY & IMPULSE CONTROL,19,MENTAL DISEASES AND DISORDERS,3,Major,Moderate,Medical,Medicaid,,,,,true,28268.3,6706.83
Western NY,Erie,1401005,000210,Erie County Medical Center,18 to 29,142,M,White,Not Span/Hispanic,2,Emergency,Home or Self Care,2018,MBD009,PERSONALITY DISORDERS,,,752,DISORDERS OF PERSONALITY & IMPULSE CONTROL,19,MENTAL DISEASES AND DISORDERS,2,Moderate,Minor,Medical,Medicaid,Medicaid,,,,false,3869.17,2871.62
New York City,Manhattan,7002001,001438,Bellevue Hospital Center,30 to 49,100,M,Other Race,Not Span/Hispanic,8,Emergency,Home or Self Care,2018,MBD009,PERSONALITY DISORDERS,MHT002,PSYCHOTHERAPY FOR MENTAL HEALTH (EXCLUDING SUBSTANCE USE),752,DISORDERS OF PERSONALITY & IMPULSE CONTROL,19,MENTAL DISEASES AND DISORDERS,2,Moderate,Minor,Medical,Private Health Insurance,Medicaid,,,,true,12239.8,8134.57
Capital/Adirond,Schenectady,4601001,000829,Ellis Hospital,0 to 17,122,F,White,Not Span/Hispanic,9,Emergency,Home or Self Care,2018,MBD009,PERSONALITY DISORDERS,,,752,DISORDERS OF PERSONALITY & IMPULSE CONTROL,19,MENTAL DISEASES AND DISORDERS,2,Moderate,Minor,Medical,Medicaid,,,,,true,23306.3,8184.12
Hudson Valley,Westchester,7002054,001047,New York-Presbyterian Westchester Behavioral Health Center,0 to 17,100,F,Other Race,Spanish/Hispanic,10,Emergency,Home or Self Care,2018,MBD009,PERSONALITY DISORDERS,,,752,DISORDERS OF PERSONALITY & IMPULSE CONTROL,19,MENTAL DISEASES AND DISORDERS,2,Moderate,Minor,Medical,Private Health Insurance,Self-Pay,,,,true,61424.72,15231
Central NY,Onondaga,3301007,000635,University Hospital SUNY Health Science Center,30 to 49,130,F,White,Not Span/Hispanic,6,Emergency,Home or Self Care,2018,MBD009,PERSONALITY DISORDERS,,,752,DISORDERS OF PERSONALITY & IMPULSE CONTROL,19,MENTAL DISEASES AND DISORDERS,2,Moderate,Minor,Medical,Private Health Insurance,,,,,true,25361.52,6657.35
Long Island,Nassau,2951001,000550,Syosset Hospital,18 to 29,112,F,White,Not Span/Hispanic,5,Emergency,Home or Self Care,2018,MBD009,PERSONALITY DISORDERS,,,752,DISORDERS OF PERSONALITY & IMPULSE CONTROL,19,MENTAL DISEASES AND DISORDERS,2,Moderate,Minor,Medical,Medicare,,,,,true,36706.67,10054.16
Capital/Adirond,Saratoga,4501000,000818,Saratoga Hospital,30 to 49,128,F,White,Not Span/Hispanic,1,Emergency,Home or Self Care,2018,MBD009,PERSONALITY DISORDERS,,,752,DISORDERS OF PERSONALITY & IMPULSE CONTROL,19,MENTAL DISEASES AND DISORDERS,2,Moderate,Minor,Medical,Medicaid,,,,,true,7729.81,2099.37
Central NY,Onondaga,3301007,000635,University Hospital SUNY Health Science Center,50 to 69,130,F,White,Not Span/Hispanic,4,Emergency,Home or Self Care,2018,MBD009,PERSONALITY DISORDERS,,,752,DISORDERS OF PERSONALITY & IMPULSE CONTROL,19,MENTAL DISEASES AND DISORDERS,3,Major,Moderate,Medical,Medicare,,,,,true,20704.2,5328.97
New York City,Kings,7001046,001309,Interfaith Medical Center,50 to 69,112,M,Black/African American,Not Span/Hispanic,4,Emergency,Home or Self Care,2018,MBD009,PERSONALITY DISORDERS,,,752,DISORDERS OF PERSONALITY & IMPULSE CONTROL,19,MENTAL DISEASES AND DISORDERS,2,Moderate,Moderate,Medical,Medicare,Medicare,,,,false,19468.01,5060.21
New York City,Kings,7001016,001301,Kings County Hospital Center,18 to 29,112,F,Other Race,Not Span/Hispanic,2,Emergency,Home or Self Care,2018,MBD009,PERSONALITY DISORDERS,,,752,DISORDERS OF PERSONALITY & IMPULSE CONTROL,19,MENTAL DISEASES AND DISORDERS,2,Moderate,Minor,Medical,Blue Cross/Blue Shield,,,,,true,3294.65,2340.39
New York City,Richmond,7004003,001737,Staten Island University Hospital Prince's Bay,18 to 29,103,F,White,Not Span/Hispanic,4,Emergency,Home or Self Care,2018,MBD009,PERSONALITY DISORDERS,MHT002,PSYCHOTHERAPY FOR MENTAL HEALTH (EXCLUDING SUBSTANCE USE),752,DISORDERS OF PERSONALITY & IMPULSE CONTROL,19,MENTAL DISEASES AND DISORDERS,2,Moderate,Minor,Medical,Medicaid,,,,,true,18971.19,8876.42
New York City,Queens,7003004,001630,Long Island Jewish Medical Center,18 to 29,115,M,Other Race,Not Span/Hispanic,6,Emergency,Home or Self Care,2018,MBD009,PERSONALITY DISORDERS,MHT001,PHARMACOTHERAPY FOR MENTAL HEALTH (EXCLUDING SUBSTANCE USE),752,DISORDERS OF PERSONALITY & IMPULSE CONTROL,19,MENTAL DISEASES AND DISORDERS,1,Minor,Minor,Medical,Blue Cross/Blue Shield,Self-Pay,,,,false,39059.81,8111.76
Central NY,Onondaga,3301003,000630,St. Joseph's Hospital Health Center,30 to 49,132,M,White,Not Span/Hispanic,4,Emergency,Home or Self Care,2018,MBD009,PERSONALITY DISORDERS,MHT002,PSYCHOTHERAPY FOR MENTAL HEALTH (EXCLUDING SUBSTANCE USE),752,DISORDERS OF PERSONALITY & IMPULSE CONTROL,19,MENTAL DISEASES AND DISORDERS,2,Moderate,Minor,Medical,Medicaid,,,,,true,7357.9,4366.33
New York City,Queens,7003000,001626,Elmhurst Hospital Center,18 to 29,114,M,Black/African American,Not Span/Hispanic,1,Emergency,Home or Self Care,2018,MBD009,PERSONALITY DISORDERS,,,752,DISORDERS OF PERSONALITY & IMPULSE CONTROL,19,MENTAL DISEASES AND DISORDERS,2,Moderate,Minor,Medical,Medicaid,,,,,true,1741.7,1036.25
Finger Lakes,Monroe,2754001,000412,Unity Specialty Hospital,50 to 69,146,F,White,Not Span/Hispanic,20,Urgent,Home or Self Care,2018,MBD009,PERSONALITY DISORDERS,,,752,DISORDERS OF PERSONALITY & IMPULSE CONTROL,19,MENTAL DISEASES AND DISORDERS,2,Moderate,Minor,Medical,Medicare,Medicaid,,,,true,31771.01,23004.86
Finger Lakes,Monroe,2701003,000411,Rochester General Hospital,18 to 29,146,F,White,Not Span/Hispanic,1,Emergency,Home or Self Care,2018,MBD009,PERSONALITY DISORDERS,,,752,DISORDERS OF PERSONALITY & IMPULSE CONTROL,19,MENTAL DISEASES AND DISORDERS,2,Moderate,Minor,Medical,Medicaid,,,,,true,5345.38,2002.95
New York City,Manhattan,7002032,001466,Mount Sinai West,30 to 49,100,F,White,Not Span/Hispanic,2,Emergency,Home or Self Care,2018,MBD009,PERSONALITY DISORDERS,MHT001,PHARMACOTHERAPY FOR MENTAL HEALTH (EXCLUDING SUBSTANCE USE),752,DISORDERS OF PERSONALITY & IMPULSE CONTROL,19,MENTAL DISEASES AND DISORDERS,2,Moderate,Minor,Medical,Medicaid,Medicaid,Self-Pay,,,true,12176.14,5054.68
Western NY,Erie,1401005,000210,Erie County Medical Center,30 to 49,142,F,Black/African American,Not Span/Hispanic,13,Emergency,Home or Self Care,2018,MBD009,PERSONALITY DISORDERS,,,752,DISORDERS OF PERSONALITY & IMPULSE CONTROL,19,MENTAL DISEASES AND DISORDERS,2,Moderate,Minor,Medical,Medicaid,Medicaid,,,,false,20428.36,14257.2
New York City,Bronx,7000006,001168,Montefiore Medical Center-Wakefield Hospital,18 to 29,104,M,Other Race,Spanish/Hispanic,12,Emergency,Home or Self Care,2018,MBD001,SCHIZOPHRENIA SPECTRUM AND OTHER PSYCHOTIC DISORDERS,MHT002,PSYCHOTHERAPY FOR MENTAL HEALTH (EXCLUDING SUBSTANCE USE),752,DISORDERS OF PERSONALITY & IMPULSE CONTROL,19,MENTAL DISEASES AND DISORDERS,2,Moderate,Minor,Medical,Private Health Insurance,,,,,true,67325.65,23011.48
Hudson Valley,Westchester,7002054,001047,New York-Presbyterian Westchester Behavioral Health Center,30 to 49,109,F,White,Not Span/Hispanic,9,Emergency,Home or Self Care,2018,MBD009,PERSONALITY DISORDERS,,,752,DISORDERS OF PERSONALITY & IMPULSE CONTROL,19,MENTAL DISEASES AND DISORDERS,2,Moderate,Minor,Medical,"Managed Care, Unspecified",Medicaid,Self-Pay,,,false,50163.88,12138.08
Central NY,Onondaga,3301007,000635,University Hospital SUNY Health Science Center,50 to 69,130,F,White,Not Span/Hispanic,10,Emergency,Home or Self Care,2018,MBD009,PERSONALITY DISORDERS,MHT002,PSYCHOTHERAPY FOR MENTAL HEALTH (EXCLUDING SUBSTANCE USE),752,DISORDERS OF PERSONALITY & IMPULSE CONTROL,19,MENTAL DISEASES AND DISORDERS,2,Moderate,Minor,Medical,Medicare,Medicaid,,,,true,43190.42,11271.59
Capital/Adirond,Rensselaer,4102002,000756,Samaritan Hospital,18 to 29,122,F,White,Not Span/Hispanic,6,Emergency,Home or Self Care,2018,MBD009,PERSONALITY DISORDERS,SUD001,SUBSTANCE USE DETOXIFICATION,752,DISORDERS OF PERSONALITY & IMPULSE CONTROL,19,MENTAL DISEASES AND DISORDERS,2,Moderate,Minor,Medical,Medicaid,,,,,true,12244.75,5834.65
New York City,Manhattan,7002024,001456,Mount Sinai Hospital,18 to 29,112,F,White,Not Span/Hispanic,8,Emergency,Home or Self Care,2018,MBD009,PERSONALITY DISORDERS,,,752,DISORDERS OF PERSONALITY & IMPULSE CONTROL,19,MENTAL DISEASES AND DISORDERS,2,Moderate,Minor,Medical,Blue Cross/Blue Shield,Self-Pay,,,,true,33859.34,17253.97
New York City,Manhattan,7002001,001438,Bellevue Hospital Center,30 to 49,100,M,Black/African American,Not Span/Hispanic,1,Emergency,Home or Self Care,2018,MBD009,PERSONALITY DISORDERS,MHT002,PSYCHOTHERAPY FOR MENTAL HEALTH (EXCLUDING SUBSTANCE USE),752,DISORDERS OF PERSONALITY & IMPULSE CONTROL,19,MENTAL DISEASES AND DISORDERS,2,Moderate,Minor,Medical,Medicaid,Medicaid,,,,true,2054.31,1365.29
Western NY,Erie,1401005,000210,Erie County Medical Center,50 to 69,142,F,White,Not Span/Hispanic,7,Emergency,Home or Self Care,2018,MBD009,PERSONALITY DISORDERS,,,752,DISORDERS OF PERSONALITY & IMPULSE CONTROL,19,MENTAL DISEASES AND DISORDERS,2,Moderate,Minor,Medical,Medicaid,,,,,true,14198.48,8309.01
New York City,Manhattan,7002054,001458,New York-Presbyterian Hospital - New York Weill Cornell Center,70 or Older,100,F,White,Not Span/Hispanic,60,Emergency,Home or Self Care,2018,MBD009,PERSONALITY DISORDERS,MHT002,PSYCHOTHERAPY FOR MENTAL HEALTH (EXCLUDING SUBSTANCE USE),752,DISORDERS OF PERSONALITY & IMPULSE CONTROL,19,MENTAL DISEASES AND DISORDERS,3,Major,Moderate,Medical,Medicare,Blue Cross/Blue Shield,Self-Pay,,,true,426031.52,104332.17
New York City,Richmond,7004003,001737,Staten Island University Hospital Prince's Bay,18 to 29,103,F,White,Not Span/Hispanic,8,Emergency,Home or Self Care,2018,MBD009,PERSONALITY DISORDERS,,,752,DISORDERS OF PERSONALITY & IMPULSE CONTROL,19,MENTAL DISEASES AND DISORDERS,2,Moderate,Minor,Medical,Private Health Insurance,,,,,true,30228,16900.46
Central NY,Onondaga,3301007,000628,UPSTATE University Hospital at Community General,18 to 29,133,F,White,Not Span/Hispanic,3,Emergency,Home or Self Care,2018,MBD009,PERSONALITY DISORDERS,MHT002,PSYCHOTHERAPY FOR MENTAL HEALTH (EXCLUDING SUBSTANCE USE),752,DISORDERS OF PERSONALITY & IMPULSE CONTROL,19,MENTAL DISEASES AND DISORDERS,2,Moderate,Minor,Medical,Medicaid,,,,,true,17092.1,4472.73
Central NY,Onondaga,3301007,000628,UPSTATE University Hospital at Community General,30 to 49,131,F,White,Not Span/Hispanic,7,Emergency,Home or Self Care,2018,MBD009,PERSONALITY DISORDERS,,,752,DISORDERS OF PERSONALITY & IMPULSE CONTROL,19,MENTAL DISEASES AND DISORDERS,2,Moderate,Minor,Medical,Medicaid,,,,,true,43176.92,10945.42
New York City,Kings,7001016,001301,Kings County Hospital Center,50 to 69,112,F,White,Not Span/Hispanic,23,Emergency,Home or Self Care,2018,MBD009,PERSONALITY DISORDERS,MHT001,PHARMACOTHERAPY FOR MENTAL HEALTH (EXCLUDING SUBSTANCE USE),752,DISORDERS OF PERSONALITY & IMPULSE CONTROL,19,MENTAL DISEASES AND DISORDERS,2,Moderate,Minor,Medical,Medicare,Medicaid,,,,false,32983.52,23430.21
New York City,Queens,7003004,001630,Long Island Jewish Medical Center,18 to 29,118,F,White,Not Span/Hispanic,7,Emergency,Home or Self Care,2018,MBD009,PERSONALITY DISORDERS,MHT002,PSYCHOTHERAPY FOR MENTAL HEALTH (EXCLUDING SUBSTANCE USE),752,DISORDERS OF PERSONALITY & IMPULSE CONTROL,19,MENTAL DISEASES AND DISORDERS,2,Moderate,Minor,Medical,Private Health Insurance,Self-Pay,,,,false,44356,9295.06
New York City,Manhattan,7002032,001466,Mount Sinai West,18 to 29,113,F,White,Not Span/Hispanic,2,Emergency,Home or Self Care,2018,MBD009,PERSONALITY DISORDERS,MHT002,PSYCHOTHERAPY FOR MENTAL HEALTH (EXCLUDING SUBSTANCE USE),752,DISORDERS OF PERSONALITY & IMPULSE CONTROL,19,MENTAL DISEASES AND DISORDERS,2,Moderate,Minor,Medical,Medicaid,Medicaid,Self-Pay,,,true,11336.52,4691.57
New York City,Queens,7003004,001630,Long Island Jewish Medical Center,30 to 49,114,F,Other Race,Not Span/Hispanic,8,Urgent,Home or Self Care,2018,MBD009,PERSONALITY DISORDERS,MHT002,PSYCHOTHERAPY FOR MENTAL HEALTH (EXCLUDING SUBSTANCE USE),752,DISORDERS OF PERSONALITY & IMPULSE CONTROL,19,MENTAL DISEASES AND DISORDERS,2,Moderate,Minor,Medical,Medicare,Medicare,Medicaid,,,false,48894,10384.21
New York City,Manhattan,7002024,001456,Mount Sinai Hospital,30 to 49,100,F,White,Spanish/Hispanic,10,Emergency,Home or Self Care,2018,MBD009,PERSONALITY DISORDERS,,,752,DISORDERS OF PERSONALITY & IMPULSE CONTROL,19,MENTAL DISEASES AND DISORDERS,2,Moderate,Minor,Medical,Medicaid,Medicaid,Self-Pay,,,true,43360.7,22128.66
Western NY,Erie,1401005,000210,Erie County Medical Center,0 to 17,141,F,White,Not Span/Hispanic,3,Emergency,Home or Self Care,2018,MBD009,PERSONALITY DISORDERS,,,752,DISORDERS OF PERSONALITY & IMPULSE CONTROL,19,MENTAL DISEASES AND DISORDERS,3,Major,Minor,Medical,Medicaid,,,,,false,6084.5,3997.7
Capital/Adirond,Saratoga,4501000,000818,Saratoga Hospital,30 to 49,128,F,White,Not Span/Hispanic,1,Emergency,Home or Self Care,2018,MBD009,PERSONALITY DISORDERS,,,752,DISORDERS OF PERSONALITY & IMPULSE CONTROL,19,MENTAL DISEASES AND DISORDERS,1,Minor,Minor,Medical,Medicaid,,,,,true,9016.72,2336.44
New York City,Queens,7003004,001630,Long Island Jewish Medical Center,18 to 29,136,F,White,Not Span/Hispanic,11,Emergency,Home or Self Care,2018,MBD009,PERSONALITY DISORDERS,MHT002,PSYCHOTHERAPY FOR MENTAL HEALTH (EXCLUDING SUBSTANCE USE),752,DISORDERS OF PERSONALITY & IMPULSE CONTROL,19,MENTAL DISEASES AND DISORDERS,2,Moderate,Minor,Medical,Blue Cross/Blue Shield,Self-Pay,,,,true,72377,15149.87
Central NY,Onondaga,3301007,000628,UPSTATE University Hospital at Community General,30 to 49,130,F,White,Not Span/Hispanic,6,Emergency,Home or Self Care,2018,MBD009,PERSONALITY DISORDERS,SKB006,SKIN LACERATION REPAIR (EXCLUDING PERINEUM),752,DISORDERS OF PERSONALITY & IMPULSE CONTROL,19,MENTAL DISEASES AND DISORDERS,2,Moderate,Minor,Medical,Medicare,Medicaid,,,,true,35846.72,9425.8
New York City,Manhattan,7002053,001463,NYU Langone Hospitals,18 to 29,100,F,Other Race,Not Span/Hispanic,7,Emergency,Home or Self Care,2018,MBD009,PERSONALITY DISORDERS,,,752,DISORDERS OF PERSONALITY & IMPULSE CONTROL,19,MENTAL DISEASES AND DISORDERS,2,Moderate,Minor,Medical,Private Health Insurance,,,,,true,45747.88,19023.45
New York City,Manhattan,7002001,001438,Bellevue Hospital Center,50 to 69,100,M,White,Not Span/Hispanic,2,Emergency,Home or Self Care,2018,MBD009,PERSONALITY DISORDERS,MHT001,PHARMACOTHERAPY FOR MENTAL HEALTH (EXCLUDING SUBSTANCE USE),752,DISORDERS OF PERSONALITY & IMPULSE CONTROL,19,MENTAL DISEASES AND DISORDERS,2,Moderate,Minor,Medical,Medicaid,Medicaid,,,,false,3080.49,2047.29
Capital/Adirond,Albany,0101004,000005,St. Peter's Hospital,30 to 49,121,F,Black/African American,Not Span/Hispanic,120 +,Emergency,Home or Self Care,2018,MBD011,SOMATIC DISORDERS,ADM016,ADMINISTRATION OF ANTI-INFLAMMATORY AGENTS,752,DISORDERS OF PERSONALITY & IMPULSE CONTROL,19,MENTAL DISEASES AND DISORDERS,2,Moderate,Minor,Medical,Medicaid,Medicaid,,,,true,395343.15,259963.85
Long Island,Suffolk,5157003,000943,St Catherine of Siena Hospital,30 to 49,117,M,White,Not Span/Hispanic,39,Emergency,Home or Self Care,2018,MBD009,PERSONALITY DISORDERS,,,752,DISORDERS OF PERSONALITY & IMPULSE CONTROL,19,MENTAL DISEASES AND DISORDERS,2,Moderate,Minor,Medical,Medicare,Medicaid,,,,true,159045,42318.26
New York City,Manhattan,7002054,001464,New York-Presbyterian Hospital - Columbia Presbyterian Center,18 to 29,104,F,White,Not Span/Hispanic,16,Emergency,Another Type Not Listed,2018,MBD009,PERSONALITY DISORDERS,,,752,DISORDERS OF PERSONALITY & IMPULSE CONTROL,19,MENTAL DISEASES AND DISORDERS,2,Moderate,Minor,Medical,Private Health Insurance,Medicaid,Self-Pay,,,false,117368.58,28743.53
New York City,Queens,7003004,001630,Long Island Jewish Medical Center,18 to 29,114,F,Other Race,Not Span/Hispanic,7,Emergency,Home or Self Care,2018,MBD009,PERSONALITY DISORDERS,MHT002,PSYCHOTHERAPY FOR MENTAL HEALTH (EXCLUDING SUBSTANCE USE),752,DISORDERS OF PERSONALITY & IMPULSE CONTROL,19,MENTAL DISEASES AND DISORDERS,2,Moderate,Minor,Medical,Private Health Insurance,Self-Pay,,,,false,44011,9249.27