Hospital Service Area,Hospital County,Operating Certificate Number,Permanent Facility Id,Facility Name,Age Group,Zip Code - 3 digits,Gender,Race,Ethnicity,Length of Stay,Type of Admission,Patient Disposition,Discharge Year,CCS Diagnosis Code,CCS Diagnosis Description,CCS Procedure Code,CCS Procedure Description,APR DRG Code,APR DRG Description,APR MDC Code,APR MDC Description,APR Severity of Illness Code,APR Severity of Illness Description,APR Risk of Mortality,APR Medical Surgical Description,Payment Typology 1,Payment Typology 2,Payment Typology 3,Birth Weight,Abortion Edit Indicator,Emergency Department Indicator,Total Charges,Total Costs
Long Island,Nassau,2908000,000511,NYU Winthrop Hospital,0 to 17,115,F,White,Spanish/Hispanic,2,Emergency,Psychiatric Hospital or Unit of Hosp,2017,657,Mood disorders,000,NO PROC,754,Depression except major depressive disorder,19,Mental Diseases and Disorders,1,Minor,Minor,Medical,Medicaid,,,,N,Y,11469.40,2815.29
Long Island,Nassau,2908000,000511,NYU Winthrop Hospital,0 to 17,115,M,Black/African American,Not Span/Hispanic,1,Emergency,Home or Self Care,2017,657,Mood disorders,000,NO PROC,754,Depression except major depressive disorder,19,Mental Diseases and Disorders,2,Moderate,Minor,Medical,Blue Cross/Blue Shield,,,,N,Y,8083.00,1796.37
Long Island,Nassau,2908000,000511,NYU Winthrop Hospital,30 to 49,OOS,M,Black/African American,Spanish/Hispanic,1,Emergency,Home or Self Care,2017,657,Mood disorders,000,NO PROC,754,Depression except major depressive disorder,19,Mental Diseases and Disorders,2,Moderate,Moderate,Medical,Medicaid,,,,N,Y,19156.37,4230.18
Long Island,Nassau,2908000,000511,NYU Winthrop Hospital,30 to 49,113,F,White,Not Span/Hispanic,1,Emergency,Home or Self Care,2017,650,Adjustment disorders,000,NO PROC,754,Depression except major depressive disorder,19,Mental Diseases and Disorders,1,Minor,Minor,Medical,Blue Cross/Blue Shield,,,,N,Y,13760.27,2689.66
Long Island,Nassau,2908000,000511,NYU Winthrop Hospital,0 to 17,115,F,White,Spanish/Hispanic,1,Emergency,Psychiatric Hospital or Unit of Hosp,2017,657,Mood disorders,000,NO PROC,754,Depression except major depressive disorder,19,Mental Diseases and Disorders,1,Minor,Minor,Medical,Private Health Insurance,,,,N,Y,20611.06,4080.13
Long Island,Nassau,2908000,000511,NYU Winthrop Hospital,0 to 17,115,M,Other Race,Spanish/Hispanic,1,Emergency,Home or Self Care,2017,657,Mood disorders,000,NO PROC,754,Depression except major depressive disorder,19,Mental Diseases and Disorders,2,Moderate,Minor,Medical,Medicaid,Medicaid,,,N,Y,14405.00,2880.14
Long Island,Nassau,2908000,000511,NYU Winthrop Hospital,0 to 17,115,F,White,Not Span/Hispanic,4,Emergency,Psychiatric Hospital or Unit of Hosp,2017,657,Mood disorders,000,NO PROC,754,Depression except major depressive disorder,19,Mental Diseases and Disorders,1,Minor,Minor,Medical,Blue Cross/Blue Shield,Blue Cross/Blue Shield,,,N,Y,22933.00,5671.95
Long Island,Nassau,2908000,000511,NYU Winthrop Hospital,50 to 69,115,M,White,Not Span/Hispanic,11,Emergency,Home or Self Care,2017,657,Mood disorders,092,OTHER BOWEL DX PRCS,754,Depression except major depressive disorder,19,Mental Diseases and Disorders,3,Major,Moderate,Medical,Medicaid,Medicaid,,,N,Y,120229.57,22720.51
Long Island,Nassau,2908000,000511,NYU Winthrop Hospital,70 or Older,115,M,White,Not Span/Hispanic,2,Emergency,Home or Self Care,2017,657,Mood disorders,000,NO PROC,754,Depression except major depressive disorder,19,Mental Diseases and Disorders,2,Moderate,Minor,Medical,Medicare,Medicare,Private Health Insurance,,N,Y,37589.99,8685.87
Long Island,Nassau,2908000,000511,NYU Winthrop Hospital,18 to 29,114,M,Other Race,Not Span/Hispanic,1,Emergency,Home or Self Care,2017,657,Mood disorders,000,NO PROC,754,Depression except major depressive disorder,19,Mental Diseases and Disorders,1,Minor,Minor,Medical,Medicare,Medicare,Medicaid,,N,Y,14013.56,2819.14
