Hospital Service Area,Hospital County,Operating Certificate Number,Permanent Facility Id,Facility Name,Age Group,Zip Code - 3 digits,Gender,Race,Ethnicity,Length of Stay,Type of Admission,Patient Disposition,Discharge Year,CCS Diagnosis Code,CCS Diagnosis Description,CCS Procedure Code,CCS Procedure Description,APR DRG Code,APR DRG Description,APR MDC Code,APR MDC Description,APR Severity of Illness Code,APR Severity of Illness Description,APR Risk of Mortality,APR Medical Surgical Description,Payment Typology 1,Payment Typology 2,Payment Typology 3,Birth Weight,Abortion Edit Indicator,Emergency Department Indicator,Total Charges,Total Costs
New York City,Manhattan,7002001,001438,Bellevue Hospital Center,0 to 17,112,F,Other Race,Spanish/Hispanic,16,Emergency,Home or Self Care,2020,MBD002,DEPRESSIVE DISORDERS,MHT001,PHARMACOTHERAPY FOR MENTAL HEALTH (EXCLUDING SUBSTANCE USE),754,DEPRESSION EXCEPT MAJOR DEPRESSIVE DISORDER,19,MENTAL DISEASES AND DISORDERS,2,Moderate,Minor,Medical,Medicaid,,,,,Y,24812.49,14269.27
New York City,Manhattan,7002001,001438,Bellevue Hospital Center,50 to 69,104,F,Black/African American,Not Span/Hispanic,9,Emergency,Home or Self Care,2020,MBD002,DEPRESSIVE DISORDERS,MHT001,PHARMACOTHERAPY FOR MENTAL HEALTH (EXCLUDING SUBSTANCE USE),754,DEPRESSION EXCEPT MAJOR DEPRESSIVE DISORDER,19,MENTAL DISEASES AND DISORDERS,2,Moderate,Minor,Medical,Medicaid,,,,,Y,14456.99,8313.98
New York City,Manhattan,7002001,001438,Bellevue Hospital Center,50 to 69,112,M,Black/African American,Not Span/Hispanic,5,Emergency,Home or Self Care,2020,MBD007,TRAUMA- AND STRESSOR-RELATED DISORDERS,MHT001,PHARMACOTHERAPY FOR MENTAL HEALTH (EXCLUDING SUBSTANCE USE),754,DEPRESSION EXCEPT MAJOR DEPRESSIVE DISORDER,19,MENTAL DISEASES AND DISORDERS,1,Minor,Minor,Medical,Medicaid,,,,,Y,9053.88,5206.74
New York City,Manhattan,7002001,001438,Bellevue Hospital Center,0 to 17,111,M,Other Race,Not Span/Hispanic,14,Emergency,Home or Self Care,2020,MBD002,DEPRESSIVE DISORDERS,MHT001,PHARMACOTHERAPY FOR MENTAL HEALTH (EXCLUDING SUBSTANCE USE),754,DEPRESSION EXCEPT MAJOR DEPRESSIVE DISORDER,19,MENTAL DISEASES AND DISORDERS,2,Moderate,Minor,Medical,Medicaid,,,,,Y,20650.87,11875.98
New York City,Manhattan,7002001,001438,Bellevue Hospital Center,18 to 29,100,F,Other Race,Unknown,1,Emergency,Home or Self Care,2020,MBD002,DEPRESSIVE DISORDERS,MHT002,PSYCHOTHERAPY FOR MENTAL HEALTH (EXCLUDING SUBSTANCE USE),754,DEPRESSION EXCEPT MAJOR DEPRESSIVE DISORDER,19,MENTAL DISEASES AND DISORDERS,2,Moderate,Minor,Medical,Medicare,Medicaid,,,,Y,2288.6,1316.14
New York City,Manhattan,7002001,001438,Bellevue Hospital Center,50 to 69,100,M,Other Race,Spanish/Hispanic,8,Emergency,Home or Self Care,2020,MBD007,TRAUMA- AND STRESSOR-RELATED DISORDERS,MHT001,PHARMACOTHERAPY FOR MENTAL HEALTH (EXCLUDING SUBSTANCE USE),754,DEPRESSION EXCEPT MAJOR DEPRESSIVE DISORDER,19,MENTAL DISEASES AND DISORDERS,1,Minor,Moderate,Medical,Medicaid,,,,,Y,14818.73,8522.01
New York City,Manhattan,7002001,001438,Bellevue Hospital Center,30 to 49,100,F,White,Not Span/Hispanic,40,Emergency,Short-term Hospital,2020,MBD002,DEPRESSIVE DISORDERS,MHT002,PSYCHOTHERAPY FOR MENTAL HEALTH (EXCLUDING SUBSTANCE USE),754,DEPRESSION EXCEPT MAJOR DEPRESSIVE DISORDER,19,MENTAL DISEASES AND DISORDERS,2,Moderate,Minor,Medical,Medicaid,,,,,Y,14677.31,8440.69
New York City,Manhattan,7002001,001438,Bellevue Hospital Center,18 to 29,112,M,Other Race,Unknown,10,Emergency,Home or Self Care,2020,MBD002,DEPRESSIVE DISORDERS,MHT001,PHARMACOTHERAPY FOR MENTAL HEALTH (EXCLUDING SUBSTANCE USE),754,DEPRESSION EXCEPT MAJOR DEPRESSIVE DISORDER,19,MENTAL DISEASES AND DISORDERS,2,Moderate,Minor,Medical,Private Health Insurance,,,,,Y,15949.02,9172.03
New York City,Manhattan,7002001,001438,Bellevue Hospital Center,30 to 49,113,M,White,Unknown,1,Emergency,Home or Self Care,2020,MBD002,DEPRESSIVE DISORDERS,MHT001,PHARMACOTHERAPY FOR MENTAL HEALTH (EXCLUDING SUBSTANCE USE),754,DEPRESSION EXCEPT MAJOR DEPRESSIVE DISORDER,19,MENTAL DISEASES AND DISORDERS,1,Minor,Minor,Medical,Medicaid,,,,,Y,2430.16,1397.55
New York City,Manhattan,7002001,001438,Bellevue Hospital Center,50 to 69,112,F,Black/African American,Spanish/Hispanic,2,Emergency,Home or Self Care,2020,MBD002,DEPRESSIVE DISORDERS,MHT002,PSYCHOTHERAPY FOR MENTAL HEALTH (EXCLUDING SUBSTANCE USE),754,DEPRESSION EXCEPT MAJOR DEPRESSIVE DISORDER,19,MENTAL DISEASES AND DISORDERS,1,Minor,Moderate,Medical,Medicare,Medicaid,,,,Y,5639.24,3243.04
New York City,Manhattan,7002001,001438,Bellevue Hospital Center,0 to 17,104,M,Other Race,Spanish/Hispanic,7,Elective,Home or Self Care,2020,MBD002,DEPRESSIVE DISORDERS,MHT001,PHARMACOTHERAPY FOR MENTAL HEALTH (EXCLUDING SUBSTANCE USE),754,DEPRESSION EXCEPT MAJOR DEPRESSIVE DISORDER,19,MENTAL DISEASES AND DISORDERS,1,Minor,Minor,Medical,Private Health Insurance,,,,,Y,11598.75,6670.26
New York City,Manhattan,7002001,001438,Bellevue Hospital Center,30 to 49,100,M,Other Race,Not Span/Hispanic,4,Emergency,Home or Self Care,2020,MBD002,DEPRESSIVE DISORDERS,MHT001,PHARMACOTHERAPY FOR MENTAL HEALTH (EXCLUDING SUBSTANCE USE),754,DEPRESSION EXCEPT MAJOR DEPRESSIVE DISORDER,19,MENTAL DISEASES AND DISORDERS,2,Moderate,Minor,Medical,Medicaid,,,,,Y,6581.2,3784.74
New York City,Manhattan,7002001,001438,Bellevue Hospital Center,18 to 29,100,M,Other Race,Spanish/Hispanic,6,Emergency,Home or Self Care,2020,MBD002,DEPRESSIVE DISORDERS,MHT001,PHARMACOTHERAPY FOR MENTAL HEALTH (EXCLUDING SUBSTANCE USE),754,DEPRESSION EXCEPT MAJOR DEPRESSIVE DISORDER,19,MENTAL DISEASES AND DISORDERS,2,Moderate,Minor,Medical,Medicaid,,,,,Y,9800.71,5636.23
New York City,Manhattan,7002001,001438,Bellevue Hospital Center,30 to 49,103,M,White,Not Span/Hispanic,8,Emergency,Home or Self Care,2020,MBD002,DEPRESSIVE DISORDERS,MHT002,PSYCHOTHERAPY FOR MENTAL HEALTH (EXCLUDING SUBSTANCE USE),754,DEPRESSION EXCEPT MAJOR DEPRESSIVE DISORDER,19,MENTAL DISEASES AND DISORDERS,2,Moderate,Minor,Medical,Private Health Insurance,,,,,Y,12710.32,7309.5
New York City,Manhattan,7002001,001438,Bellevue Hospital Center,50 to 69,100,F,Other Race,Unknown,22,Emergency,Home or Self Care,2020,MBD002,DEPRESSIVE DISORDERS,MHT001,PHARMACOTHERAPY FOR MENTAL HEALTH (EXCLUDING SUBSTANCE USE),754,DEPRESSION EXCEPT MAJOR DEPRESSIVE DISORDER,19,MENTAL DISEASES AND DISORDERS,2,Moderate,Minor,Medical,Medicaid,,,,,Y,36558.13,21024
New York City,Manhattan,7002001,001438,Bellevue Hospital Center,30 to 49,OOS,F,Other Race,Unknown,4,Emergency,Home or Self Care,2020,MBD007,TRAUMA- AND STRESSOR-RELATED DISORDERS,MHT001,PHARMACOTHERAPY FOR MENTAL HEALTH (EXCLUDING SUBSTANCE USE),754,DEPRESSION EXCEPT MAJOR DEPRESSIVE DISORDER,19,MENTAL DISEASES AND DISORDERS,1,Minor,Minor,Medical,Private Health Insurance,,,,,Y,6984.72,4016.8
New York City,Manhattan,7002001,001438,Bellevue Hospital Center,50 to 69,100,M,Black/African American,Not Span/Hispanic,10,Emergency,Home or Self Care,2020,MBD002,DEPRESSIVE DISORDERS,MHT001,PHARMACOTHERAPY FOR MENTAL HEALTH (EXCLUDING SUBSTANCE USE),754,DEPRESSION EXCEPT MAJOR DEPRESSIVE DISORDER,19,MENTAL DISEASES AND DISORDERS,2,Moderate,Minor,Medical,Medicaid,,,,,Y,17314.25,9957.15
New York City,Manhattan,7002001,001438,Bellevue Hospital Center,18 to 29,100,F,Black/African American,Not Span/Hispanic,3,Emergency,Home or Self Care,2020,MBD002,DEPRESSIVE DISORDERS,MHT001,PHARMACOTHERAPY FOR MENTAL HEALTH (EXCLUDING SUBSTANCE USE),754,DEPRESSION EXCEPT MAJOR DEPRESSIVE DISORDER,19,MENTAL DISEASES AND DISORDERS,1,Minor,Minor,Medical,Medicaid,,,,,Y,6221.47,3577.87
New York City,Manhattan,7002001,001438,Bellevue Hospital Center,0 to 17,113,F,Black/African American,Spanish/Hispanic,4,Emergency,Home or Self Care,2020,MBD002,DEPRESSIVE DISORDERS,MHT001,PHARMACOTHERAPY FOR MENTAL HEALTH (EXCLUDING SUBSTANCE USE),754,DEPRESSION EXCEPT MAJOR DEPRESSIVE DISORDER,19,MENTAL DISEASES AND DISORDERS,2,Moderate,Minor,Medical,Medicaid,,,,,Y,6748.75,3881.1
New York City,Manhattan,7002001,001438,Bellevue Hospital Center,0 to 17,,F,Other Race,Unknown,13,Emergency,Home or Self Care,2020,MBD002,DEPRESSIVE DISORDERS,MHT001,PHARMACOTHERAPY FOR MENTAL HEALTH (EXCLUDING SUBSTANCE USE),754,DEPRESSION EXCEPT MAJOR DEPRESSIVE DISORDER,19,MENTAL DISEASES AND DISORDERS,1,Minor,Minor,Medical,Private Health Insurance,Private Health Insurance,Medicaid,,,Y,19601.09,11272.27
New York City,Manhattan,7002001,001438,Bellevue Hospital Center,30 to 49,117,M,Other Race,Spanish/Hispanic,14,Emergency,Home or Self Care,2020,MBD002,DEPRESSIVE DISORDERS,MHT001,PHARMACOTHERAPY FOR MENTAL HEALTH (EXCLUDING SUBSTANCE USE),754,DEPRESSION EXCEPT MAJOR DEPRESSIVE DISORDER,19,MENTAL DISEASES AND DISORDERS,2,Moderate,Minor,Medical,Medicaid,,,,,Y,22493.05,12935.39
New York City,Manhattan,7002001,001438,Bellevue Hospital Center,50 to 69,100,F,White,Not Span/Hispanic,8,Emergency,Home or Self Care,2020,MBD002,DEPRESSIVE DISORDERS,SUD002,PHARMACOTHERAPY FOR SUBSTANCE USE,754,DEPRESSION EXCEPT MAJOR DEPRESSIVE DISORDER,19,MENTAL DISEASES AND DISORDERS,2,Moderate,Moderate,Medical,Medicare,,,,,Y,15366.34,8836.94
New York City,Manhattan,7002001,001438,Bellevue Hospital Center,30 to 49,100,F,White,Not Span/Hispanic,1,Emergency,Home or Self Care,2020,MBD002,DEPRESSIVE DISORDERS,MHT001,PHARMACOTHERAPY FOR MENTAL HEALTH (EXCLUDING SUBSTANCE USE),754,DEPRESSION EXCEPT MAJOR DEPRESSIVE DISORDER,19,MENTAL DISEASES AND DISORDERS,1,Minor,Minor,Medical,Medicaid,,,,,Y,2668.39,1534.55
New York City,Manhattan,7002001,001438,Bellevue Hospital Center,18 to 29,112,F,Other Race,Spanish/Hispanic,11,Emergency,Home or Self Care,2020,MBD002,DEPRESSIVE DISORDERS,MHT001,PHARMACOTHERAPY FOR MENTAL HEALTH (EXCLUDING SUBSTANCE USE),754,DEPRESSION EXCEPT MAJOR DEPRESSIVE DISORDER,19,MENTAL DISEASES AND DISORDERS,1,Minor,Minor,Medical,Medicaid,,,,,Y,17460.97,10041.52
New York City,Manhattan,7002001,001438,Bellevue Hospital Center,18 to 29,,M,White,Not Span/Hispanic,2,Emergency,Home or Self Care,2020,MBD002,DEPRESSIVE DISORDERS,MHT001,PHARMACOTHERAPY FOR MENTAL HEALTH (EXCLUDING SUBSTANCE USE),754,DEPRESSION EXCEPT MAJOR DEPRESSIVE DISORDER,19,MENTAL DISEASES AND DISORDERS,1,Minor,Minor,Medical,Private Health Insurance,,,,,Y,4814.97,2769.01
New York City,Manhattan,7002001,001438,Bellevue Hospital Center,0 to 17,112,M,Other Race,Spanish/Hispanic,17,Emergency,Home or Self Care,2020,MBD002,DEPRESSIVE DISORDERS,MHT001,PHARMACOTHERAPY FOR MENTAL HEALTH (EXCLUDING SUBSTANCE USE),754,DEPRESSION EXCEPT MAJOR DEPRESSIVE DISORDER,19,MENTAL DISEASES AND DISORDERS,1,Minor,Minor,Medical,Medicaid,,,,,Y,24893.61,14315.92
New York City,Manhattan,7002001,001438,Bellevue Hospital Center,50 to 69,112,F,Black/African American,Not Span/Hispanic,1,Emergency,Short-term Hospital,2020,MBD002,DEPRESSIVE DISORDERS,MHT001,PHARMACOTHERAPY FOR MENTAL HEALTH (EXCLUDING SUBSTANCE USE),754,DEPRESSION EXCEPT MAJOR DEPRESSIVE DISORDER,19,MENTAL DISEASES AND DISORDERS,2,Moderate,Moderate,Medical,Medicaid,,,,,Y,2293.29,1318.83
New York City,Manhattan,7002001,001438,Bellevue Hospital Center,0 to 17,112,F,White,Spanish/Hispanic,9,Elective,Home or Self Care,2020,MBD002,DEPRESSIVE DISORDERS,MHT001,PHARMACOTHERAPY FOR MENTAL HEALTH (EXCLUDING SUBSTANCE USE),754,DEPRESSION EXCEPT MAJOR DEPRESSIVE DISORDER,19,MENTAL DISEASES AND DISORDERS,1,Minor,Minor,Medical,Medicaid,,,,,Y,14018.39,8061.75
New York City,Manhattan,7002001,001438,Bellevue Hospital Center,30 to 49,114,M,Other Race,Spanish/Hispanic,6,Emergency,Home or Self Care,2020,MBD002,DEPRESSIVE DISORDERS,MHT001,PHARMACOTHERAPY FOR MENTAL HEALTH (EXCLUDING SUBSTANCE USE),754,DEPRESSION EXCEPT MAJOR DEPRESSIVE DISORDER,19,MENTAL DISEASES AND DISORDERS,3,Major,Moderate,Medical,Medicaid,,,,,Y,10366.89,5961.83
New York City,Manhattan,7002001,001438,Bellevue Hospital Center,0 to 17,112,F,Other Race,Not Span/Hispanic,45,Emergency,Home or Self Care,2020,MBD002,DEPRESSIVE DISORDERS,MHT001,PHARMACOTHERAPY FOR MENTAL HEALTH (EXCLUDING SUBSTANCE USE),754,DEPRESSION EXCEPT MAJOR DEPRESSIVE DISORDER,19,MENTAL DISEASES AND DISORDERS,2,Moderate,Minor,Medical,Private Health Insurance,,,,,Y,66727.94,38374.17
New York City,Manhattan,7002001,001438,Bellevue Hospital Center,30 to 49,100,F,Other Race,Not Span/Hispanic,4,Emergency,Home or Self Care,2020,MBD007,TRAUMA- AND STRESSOR-RELATED DISORDERS,MHT001,PHARMACOTHERAPY FOR MENTAL HEALTH (EXCLUDING SUBSTANCE USE),754,DEPRESSION EXCEPT MAJOR DEPRESSIVE DISORDER,19,MENTAL DISEASES AND DISORDERS,1,Minor,Minor,Medical,Private Health Insurance,,,,,Y,6630.42,3813.05
New York City,Manhattan,7002001,001438,Bellevue Hospital Center,30 to 49,OOS,F,White,Not Span/Hispanic,4,Emergency,Home or Self Care,2020,MBD002,DEPRESSIVE DISORDERS,MHT001,PHARMACOTHERAPY FOR MENTAL HEALTH (EXCLUDING SUBSTANCE USE),754,DEPRESSION EXCEPT MAJOR DEPRESSIVE DISORDER,19,MENTAL DISEASES AND DISORDERS,1,Minor,Minor,Medical,Private Health Insurance,,,,,Y,7653.64,4401.49
New York City,Manhattan,7002001,001438,Bellevue Hospital Center,0 to 17,112,M,White,Not Span/Hispanic,14,Emergency,Home or Self Care,2020,MBD002,DEPRESSIVE DISORDERS,MHT001,PHARMACOTHERAPY FOR MENTAL HEALTH (EXCLUDING SUBSTANCE USE),754,DEPRESSION EXCEPT MAJOR DEPRESSIVE DISORDER,19,MENTAL DISEASES AND DISORDERS,2,Moderate,Minor,Medical,Private Health Insurance,,,,,Y,21328.16,12265.48
New York City,Manhattan,7002001,001438,Bellevue Hospital Center,0 to 17,111,F,Other Race,Not Span/Hispanic,31,Emergency,Short-term Hospital,2020,MBD002,DEPRESSIVE DISORDERS,MHT001,PHARMACOTHERAPY FOR MENTAL HEALTH (EXCLUDING SUBSTANCE USE),754,DEPRESSION EXCEPT MAJOR DEPRESSIVE DISORDER,19,MENTAL DISEASES AND DISORDERS,1,Minor,Minor,Medical,Private Health Insurance,,,,,Y,46067.87,26492.89
New York City,Manhattan,7002001,001438,Bellevue Hospital Center,18 to 29,100,F,Other Race,Not Span/Hispanic,4,Emergency,Home or Self Care,2020,MBD002,DEPRESSIVE DISORDERS,MHT001,PHARMACOTHERAPY FOR MENTAL HEALTH (EXCLUDING SUBSTANCE USE),754,DEPRESSION EXCEPT MAJOR DEPRESSIVE DISORDER,19,MENTAL DISEASES AND DISORDERS,1,Minor,Minor,Medical,Private Health Insurance,,,,,Y,7231.88,4158.94
New York City,Manhattan,7002001,001438,Bellevue Hospital Center,0 to 17,104,F,Other Race,Not Span/Hispanic,1,Emergency,Home or Self Care,2020,MBD002,DEPRESSIVE DISORDERS,,,754,DEPRESSION EXCEPT MAJOR DEPRESSIVE DISORDER,19,MENTAL DISEASES AND DISORDERS,1,Minor,Minor,Medical,Private Health Insurance,,,,,Y,2650.86,1524.47
New York City,Manhattan,7002001,001438,Bellevue Hospital Center,18 to 29,100,F,Black/African American,Spanish/Hispanic,5,Emergency,Home or Self Care,2020,MBD002,DEPRESSIVE DISORDERS,MHT001,PHARMACOTHERAPY FOR MENTAL HEALTH (EXCLUDING SUBSTANCE USE),754,DEPRESSION EXCEPT MAJOR DEPRESSIVE DISORDER,19,MENTAL DISEASES AND DISORDERS,2,Moderate,Minor,Medical,Private Health Insurance,,,,,Y,11439.09,6578.44
New York City,Manhattan,7002001,001438,Bellevue Hospital Center,0 to 17,112,F,Other Race,Not Span/Hispanic,2,Emergency,Home or Self Care,2020,MBD002,DEPRESSIVE DISORDERS,MHT002,PSYCHOTHERAPY FOR MENTAL HEALTH (EXCLUDING SUBSTANCE USE),754,DEPRESSION EXCEPT MAJOR DEPRESSIVE DISORDER,19,MENTAL DISEASES AND DISORDERS,1,Minor,Minor,Medical,Medicaid,,,,,Y,3926.12,2257.85
New York City,Manhattan,7002001,001438,Bellevue Hospital Center,0 to 17,112,F,Other Race,Spanish/Hispanic,1,Emergency,Home or Self Care,2020,MBD002,DEPRESSIVE DISORDERS,MHT002,PSYCHOTHERAPY FOR MENTAL HEALTH (EXCLUDING SUBSTANCE USE),754,DEPRESSION EXCEPT MAJOR DEPRESSIVE DISORDER,19,MENTAL DISEASES AND DISORDERS,2,Moderate,Minor,Medical,Medicaid,,,,,Y,2376.76,1366.84
New York City,Manhattan,7002001,001438,Bellevue Hospital Center,18 to 29,113,M,Other Race,Spanish/Hispanic,4,Elective,Home or Self Care,2020,MBD002,DEPRESSIVE DISORDERS,MHT001,PHARMACOTHERAPY FOR MENTAL HEALTH (EXCLUDING SUBSTANCE USE),754,DEPRESSION EXCEPT MAJOR DEPRESSIVE DISORDER,19,MENTAL DISEASES AND DISORDERS,1,Minor,Minor,Medical,Private Health Insurance,,,,,N,7077.69,4070.27
New York City,Manhattan,7002001,001438,Bellevue Hospital Center,30 to 49,104,F,White,Not Span/Hispanic,6,Emergency,Home or Self Care,2020,MBD002,DEPRESSIVE DISORDERS,MHT001,PHARMACOTHERAPY FOR MENTAL HEALTH (EXCLUDING SUBSTANCE USE),754,DEPRESSION EXCEPT MAJOR DEPRESSIVE DISORDER,19,MENTAL DISEASES AND DISORDERS,1,Minor,Minor,Medical,Medicaid,,,,,Y,10489.16,6032.15
New York City,Manhattan,7002001,001438,Bellevue Hospital Center,18 to 29,112,F,White,Not Span/Hispanic,7,Elective,Home or Self Care,2020,MBD002,DEPRESSIVE DISORDERS,MHT001,PHARMACOTHERAPY FOR MENTAL HEALTH (EXCLUDING SUBSTANCE USE),754,DEPRESSION EXCEPT MAJOR DEPRESSIVE DISORDER,19,MENTAL DISEASES AND DISORDERS,2,Moderate,Minor,Medical,Self-Pay,,,,,N,10304.9,5926.18
New York City,Manhattan,7002001,001438,Bellevue Hospital Center,30 to 49,103,M,Other Race,Unknown,9,Urgent,Home or Self Care,2020,MBD002,DEPRESSIVE DISORDERS,MHT001,PHARMACOTHERAPY FOR MENTAL HEALTH (EXCLUDING SUBSTANCE USE),754,DEPRESSION EXCEPT MAJOR DEPRESSIVE DISORDER,19,MENTAL DISEASES AND DISORDERS,2,Moderate,Minor,Medical,Medicaid,,,,,N,14656.66,8428.81
New York City,Manhattan,7002001,001438,Bellevue Hospital Center,0 to 17,112,F,Black/African American,Not Span/Hispanic,2,Emergency,Home or Self Care,2020,MBD002,DEPRESSIVE DISORDERS,MHT001,PHARMACOTHERAPY FOR MENTAL HEALTH (EXCLUDING SUBSTANCE USE),754,DEPRESSION EXCEPT MAJOR DEPRESSIVE DISORDER,19,MENTAL DISEASES AND DISORDERS,2,Moderate,Minor,Medical,Medicaid,,,,,Y,4452.95,2560.82
New York City,Manhattan,7002001,001438,Bellevue Hospital Center,50 to 69,100,M,White,Unknown,7,Emergency,Home or Self Care,2020,MBD007,TRAUMA- AND STRESSOR-RELATED DISORDERS,MHT002,PSYCHOTHERAPY FOR MENTAL HEALTH (EXCLUDING SUBSTANCE USE),754,DEPRESSION EXCEPT MAJOR DEPRESSIVE DISORDER,19,MENTAL DISEASES AND DISORDERS,1,Minor,Minor,Medical,Medicare,Medicaid,,,,Y,12367.42,7112.31
New York City,Manhattan,7002001,001438,Bellevue Hospital Center,50 to 69,112,F,Black/African American,Not Span/Hispanic,7,Urgent,Home or Self Care,2020,MBD002,DEPRESSIVE DISORDERS,MHT001,PHARMACOTHERAPY FOR MENTAL HEALTH (EXCLUDING SUBSTANCE USE),754,DEPRESSION EXCEPT MAJOR DEPRESSIVE DISORDER,19,MENTAL DISEASES AND DISORDERS,3,Major,Moderate,Medical,Medicaid,,,,,N,11770.51,6769.03
New York City,Manhattan,7002001,001438,Bellevue Hospital Center,50 to 69,100,F,Other Race,Not Span/Hispanic,8,Emergency,Home or Self Care,2020,MBD002,DEPRESSIVE DISORDERS,MHT001,PHARMACOTHERAPY FOR MENTAL HEALTH (EXCLUDING SUBSTANCE USE),754,DEPRESSION EXCEPT MAJOR DEPRESSIVE DISORDER,19,MENTAL DISEASES AND DISORDERS,1,Minor,Minor,Medical,Private Health Insurance,,,,,Y,12893.33,7414.75
New York City,Manhattan,7002001,001438,Bellevue Hospital Center,70 or Older,100,F,White,Not Span/Hispanic,9,Emergency,Home or Self Care,2020,MBD002,DEPRESSIVE DISORDERS,MHT001,PHARMACOTHERAPY FOR MENTAL HEALTH (EXCLUDING SUBSTANCE USE),754,DEPRESSION EXCEPT MAJOR DEPRESSIVE DISORDER,19,MENTAL DISEASES AND DISORDERS,2,Moderate,Minor,Medical,Medicare,Private Health Insurance,,,,Y,16779.28,9649.5
New York City,Manhattan,7002001,001438,Bellevue Hospital Center,0 to 17,100,F,Multi-racial,Not Span/Hispanic,4,Emergency,Home or Self Care,2020,MBD007,TRAUMA- AND STRESSOR-RELATED DISORDERS,MHT001,PHARMACOTHERAPY FOR MENTAL HEALTH (EXCLUDING SUBSTANCE USE),754,DEPRESSION EXCEPT MAJOR DEPRESSIVE DISORDER,19,MENTAL DISEASES AND DISORDERS,1,Minor,Minor,Medical,Medicaid,,,,,Y,6728.73,3869.58
New York City,Manhattan,7002001,001438,Bellevue Hospital Center,30 to 49,OOS,F,White,Not Span/Hispanic,11,Emergency,Home or Self Care,2020,MBD002,DEPRESSIVE DISORDERS,MHT001,PHARMACOTHERAPY FOR MENTAL HEALTH (EXCLUDING SUBSTANCE USE),754,DEPRESSION EXCEPT MAJOR DEPRESSIVE DISORDER,19,MENTAL DISEASES AND DISORDERS,2,Moderate,Minor,Medical,Medicaid,,,,,Y,18231.33,10484.55
New York City,Manhattan,7002001,001438,Bellevue Hospital Center,0 to 17,112,F,Other Race,Spanish/Hispanic,9,Emergency,Home or Self Care,2020,MBD002,DEPRESSIVE DISORDERS,MHT001,PHARMACOTHERAPY FOR MENTAL HEALTH (EXCLUDING SUBSTANCE USE),754,DEPRESSION EXCEPT MAJOR DEPRESSIVE DISORDER,19,MENTAL DISEASES AND DISORDERS,1,Minor,Minor,Medical,Medicaid,,,,,Y,14057.27,8084.11
New York City,Manhattan,7002001,001438,Bellevue Hospital Center,30 to 49,113,F,Other Race,Spanish/Hispanic,8,Emergency,Home or Self Care,2020,MBD002,DEPRESSIVE DISORDERS,MHT002,PSYCHOTHERAPY FOR MENTAL HEALTH (EXCLUDING SUBSTANCE USE),754,DEPRESSION EXCEPT MAJOR DEPRESSIVE DISORDER,19,MENTAL DISEASES AND DISORDERS,1,Minor,Minor,Medical,Medicaid,,,,,Y,12723.4,7317.02
New York City,Manhattan,7002001,001438,Bellevue Hospital Center,18 to 29,OOS,F,Black/African American,Not Span/Hispanic,1,Emergency,Home or Self Care,2020,MBD002,DEPRESSIVE DISORDERS,,,754,DEPRESSION EXCEPT MAJOR DEPRESSIVE DISORDER,19,MENTAL DISEASES AND DISORDERS,2,Moderate,Minor,Medical,Self-Pay,,,,,Y,2093.25,1203.79
New York City,Manhattan,7002001,001438,Bellevue Hospital Center,30 to 49,100,M,Other Race,Unknown,1,Emergency,Home or Self Care,2020,MBD002,DEPRESSIVE DISORDERS,MHT001,PHARMACOTHERAPY FOR MENTAL HEALTH (EXCLUDING SUBSTANCE USE),754,DEPRESSION EXCEPT MAJOR DEPRESSIVE DISORDER,19,MENTAL DISEASES AND DISORDERS,2,Moderate,Minor,Medical,Medicaid,,,,,Y,2456.99,1412.98
New York City,Manhattan,7002001,001438,Bellevue Hospital Center,18 to 29,100,F,Other Race,Spanish/Hispanic,8,Emergency,Home or Self Care,2020,MBD007,TRAUMA- AND STRESSOR-RELATED DISORDERS,MHT001,PHARMACOTHERAPY FOR MENTAL HEALTH (EXCLUDING SUBSTANCE USE),754,DEPRESSION EXCEPT MAJOR DEPRESSIVE DISORDER,19,MENTAL DISEASES AND DISORDERS,1,Minor,Minor,Medical,Medicaid,,,,,Y,12605.57,7249.26
New York City,Manhattan,7002001,001438,Bellevue Hospital Center,30 to 49,112,M,White,Not Span/Hispanic,2,Emergency,Home or Self Care,2020,MBD002,DEPRESSIVE DISORDERS,MHT001,PHARMACOTHERAPY FOR MENTAL HEALTH (EXCLUDING SUBSTANCE USE),754,DEPRESSION EXCEPT MAJOR DEPRESSIVE DISORDER,19,MENTAL DISEASES AND DISORDERS,2,Moderate,Minor,Medical,Medicaid,,,,,Y,3806.09,2188.82
New York City,Manhattan,7002001,001438,Bellevue Hospital Center,30 to 49,100,M,White,Not Span/Hispanic,8,Emergency,Home or Self Care,2020,MBD002,DEPRESSIVE DISORDERS,MHT001,PHARMACOTHERAPY FOR MENTAL HEALTH (EXCLUDING SUBSTANCE USE),754,DEPRESSION EXCEPT MAJOR DEPRESSIVE DISORDER,19,MENTAL DISEASES AND DISORDERS,1,Minor,Minor,Medical,Medicaid,,,,,Y,12943.36,7443.52
New York City,Manhattan,7002001,001438,Bellevue Hospital Center,50 to 69,100,M,Other Race,Spanish/Hispanic,1,Emergency,Short-term Hospital,2020,MBD002,DEPRESSIVE DISORDERS,IMG009,PLAIN RADIOGRAPHY,754,DEPRESSION EXCEPT MAJOR DEPRESSIVE DISORDER,19,MENTAL DISEASES AND DISORDERS,3,Major,Moderate,Medical,Medicare,Medicaid,,,,Y,2750.91,1582
New York City,Manhattan,7002001,001438,Bellevue Hospital Center,30 to 49,116,F,White,Not Span/Hispanic,7,Emergency,Home or Self Care,2020,MBD002,DEPRESSIVE DISORDERS,MHT001,PHARMACOTHERAPY FOR MENTAL HEALTH (EXCLUDING SUBSTANCE USE),754,DEPRESSION EXCEPT MAJOR DEPRESSIVE DISORDER,19,MENTAL DISEASES AND DISORDERS,1,Minor,Minor,Medical,Medicaid,,,,,Y,11180.3,6429.61
New York City,Manhattan,7002001,001438,Bellevue Hospital Center,18 to 29,104,M,Other Race,Spanish/Hispanic,20,Urgent,Home or Self Care,2020,MBD002,DEPRESSIVE DISORDERS,MHT001,PHARMACOTHERAPY FOR MENTAL HEALTH (EXCLUDING SUBSTANCE USE),754,DEPRESSION EXCEPT MAJOR DEPRESSIVE DISORDER,19,MENTAL DISEASES AND DISORDERS,1,Minor,Moderate,Medical,Medicaid,,,,,N,28991.79,16672.71
New York City,Manhattan,7002001,001438,Bellevue Hospital Center,50 to 69,100,M,White,Not Span/Hispanic,1,Emergency,Home or Self Care,2020,MBD002,DEPRESSIVE DISORDERS,MHT001,PHARMACOTHERAPY FOR MENTAL HEALTH (EXCLUDING SUBSTANCE USE),754,DEPRESSION EXCEPT MAJOR DEPRESSIVE DISORDER,19,MENTAL DISEASES AND DISORDERS,2,Moderate,Minor,Medical,Medicaid,,,,,Y,2363.6,1359.27