Hospital Service Area,Hospital County,Operating Certificate Number,Permanent Facility Id,Facility Name,Age Group,Zip Code - 3 digits,Gender,Race,Ethnicity,Length of Stay,Type of Admission,Patient Disposition,Discharge Year,CCS Diagnosis Code,CCS Diagnosis Description,CCS Procedure Code,CCS Procedure Description,APR DRG Code,APR DRG Description,APR MDC Code,APR MDC Description,APR Severity of Illness Code,APR Severity of Illness Description,APR Risk of Mortality,APR Medical Surgical Description,Payment Typology 1,Payment Typology 2,Payment Typology 3,Birth Weight,Abortion Edit Indicator,Emergency Department Indicator,Total Charges,Total Costs
New York City,Kings,7002053,001304,NYU Langone Hospital-Brooklyn,18 to 29,,F,Other Race,Unknown,2,Emergency,Home or Self Care,2020,MBD007,TRAUMA- AND STRESSOR-RELATED DISORDERS,MHT002,PSYCHOTHERAPY FOR MENTAL HEALTH (EXCLUDING SUBSTANCE USE),755,ADJUSTMENT DISORDERS & NEUROSES EXCEPT DEPRESSIVE DIAGNOSES,19,MENTAL DISEASES AND DISORDERS,1,Minor,Minor,Medical,Self-Pay,,,,,Y,18512.27,6177.86
New York City,Kings,7002053,001304,NYU Langone Hospital-Brooklyn,30 to 49,112,M,Other Race,Not Span/Hispanic,2,Emergency,Home or Self Care,2020,MBD007,TRAUMA- AND STRESSOR-RELATED DISORDERS,OTR004,ISOLATION PROCEDURES,755,ADJUSTMENT DISORDERS & NEUROSES EXCEPT DEPRESSIVE DIAGNOSES,19,MENTAL DISEASES AND DISORDERS,1,Minor,Minor,Medical,Private Health Insurance,,,,,Y,18413.81,6167.15
New York City,Kings,7002053,001304,NYU Langone Hospital-Brooklyn,18 to 29,112,M,White,Not Span/Hispanic,2,Emergency,Home or Self Care,2020,MBD007,TRAUMA- AND STRESSOR-RELATED DISORDERS,MHT002,PSYCHOTHERAPY FOR MENTAL HEALTH (EXCLUDING SUBSTANCE USE),755,ADJUSTMENT DISORDERS & NEUROSES EXCEPT DEPRESSIVE DIAGNOSES,19,MENTAL DISEASES AND DISORDERS,1,Minor,Minor,Medical,Blue Cross/Blue Shield,,,,,Y,19333.22,6280.2
New York City,Kings,7002053,001304,NYU Langone Hospital-Brooklyn,18 to 29,,M,Other Race,Not Span/Hispanic,5,Emergency,Home or Self Care,2020,MBD007,TRAUMA- AND STRESSOR-RELATED DISORDERS,MHT002,PSYCHOTHERAPY FOR MENTAL HEALTH (EXCLUDING SUBSTANCE USE),755,ADJUSTMENT DISORDERS & NEUROSES EXCEPT DEPRESSIVE DIAGNOSES,19,MENTAL DISEASES AND DISORDERS,1,Minor,Minor,Medical,Self-Pay,,,,,Y,33386.14,13683.4
New York City,Kings,7002053,001304,NYU Langone Hospital-Brooklyn,30 to 49,112,F,Other Race,Not Span/Hispanic,3,Emergency,Home w/ Home Health Services,2020,MBD011,SOMATIC DISORDERS,ADM021,"ADMINISTRATION OF THERAPEUTIC SUBSTANCES, NEC",755,ADJUSTMENT DISORDERS & NEUROSES EXCEPT DEPRESSIVE DIAGNOSES,19,MENTAL DISEASES AND DISORDERS,3,Major,Moderate,Medical,Medicaid,,,,,Y,40890.86,15192.93
New York City,Kings,7002053,001304,NYU Langone Hospital-Brooklyn,30 to 49,112,M,White,Not Span/Hispanic,15,Emergency,Home or Self Care,2020,MBD006,OBSESSIVE-COMPULSIVE AND RELATED DISORDERS,,,755,ADJUSTMENT DISORDERS & NEUROSES EXCEPT DEPRESSIVE DIAGNOSES,19,MENTAL DISEASES AND DISORDERS,2,Moderate,Moderate,Medical,Private Health Insurance,,,,,Y,125281.02,56953.57
New York City,Kings,7002053,001304,NYU Langone Hospital-Brooklyn,30 to 49,112,M,Other Race,Not Span/Hispanic,11,Emergency,Home or Self Care,2020,MBD006,OBSESSIVE-COMPULSIVE AND RELATED DISORDERS,OTR004,ISOLATION PROCEDURES,755,ADJUSTMENT DISORDERS & NEUROSES EXCEPT DEPRESSIVE DIAGNOSES,19,MENTAL DISEASES AND DISORDERS,2,Moderate,Moderate,Medical,Medicaid,,,,,Y,102949.44,42789.6
New York City,Kings,7002053,001304,NYU Langone Hospital-Brooklyn,30 to 49,112,M,White,Not Span/Hispanic,49,Emergency,Home or Self Care,2020,MBD006,OBSESSIVE-COMPULSIVE AND RELATED DISORDERS,MHT002,PSYCHOTHERAPY FOR MENTAL HEALTH (EXCLUDING SUBSTANCE USE),755,ADJUSTMENT DISORDERS & NEUROSES EXCEPT DEPRESSIVE DIAGNOSES,19,MENTAL DISEASES AND DISORDERS,3,Major,Moderate,Medical,Private Health Insurance,Private Health Insurance,Private Health Insurance,,,Y,397394.39,183489.42
New York City,Kings,7002053,001304,NYU Langone Hospital-Brooklyn,50 to 69,112,M,Black/African American,Not Span/Hispanic,7,Emergency,Short-term Hospital,2020,MBD007,TRAUMA- AND STRESSOR-RELATED DISORDERS,MHT002,PSYCHOTHERAPY FOR MENTAL HEALTH (EXCLUDING SUBSTANCE USE),755,ADJUSTMENT DISORDERS & NEUROSES EXCEPT DEPRESSIVE DIAGNOSES,19,MENTAL DISEASES AND DISORDERS,2,Moderate,Minor,Medical,Medicaid,,,,,N,56451.79,26102.82
New York City,Kings,7002053,001304,NYU Langone Hospital-Brooklyn,18 to 29,112,M,White,Not Span/Hispanic,6,Emergency,Home or Self Care,2020,MBD006,OBSESSIVE-COMPULSIVE AND RELATED DISORDERS,,,755,ADJUSTMENT DISORDERS & NEUROSES EXCEPT DEPRESSIVE DIAGNOSES,19,MENTAL DISEASES AND DISORDERS,2,Moderate,Minor,Medical,Medicaid,,,,,Y,55252.28,23522.1
New York City,Kings,7002053,001304,NYU Langone Hospital-Brooklyn,18 to 29,112,F,Other Race,Not Span/Hispanic,5,Emergency,Home or Self Care,2020,MBD006,OBSESSIVE-COMPULSIVE AND RELATED DISORDERS,MHT002,PSYCHOTHERAPY FOR MENTAL HEALTH (EXCLUDING SUBSTANCE USE),755,ADJUSTMENT DISORDERS & NEUROSES EXCEPT DEPRESSIVE DIAGNOSES,19,MENTAL DISEASES AND DISORDERS,2,Moderate,Minor,Medical,Blue Cross/Blue Shield,,,,,Y,47904,19832.19
New York City,Kings,7002053,001304,NYU Langone Hospital-Brooklyn,50 to 69,112,F,Other Race,Not Span/Hispanic,1,Emergency,Home or Self Care,2020,MBD007,TRAUMA- AND STRESSOR-RELATED DISORDERS,,,755,ADJUSTMENT DISORDERS & NEUROSES EXCEPT DEPRESSIVE DIAGNOSES,19,MENTAL DISEASES AND DISORDERS,2,Moderate,Minor,Medical,Medicaid,,,,,Y,25167.99,5896.28
