Hospital Service Area,Hospital County,Operating Certificate Number,Permanent Facility Id,Facility Name,Age Group,Zip Code - 3 digits,Gender,Race,Ethnicity,Length of Stay,Type of Admission,Patient Disposition,Discharge Year,CCS Diagnosis Code,CCS Diagnosis Description,CCS Procedure Code,CCS Procedure Description,APR DRG Code,APR DRG Description,APR MDC Code,APR MDC Description,APR Severity of Illness Code,APR Severity of Illness Description,APR Risk of Mortality,APR Medical Surgical Description,Payment Typology 1,Payment Typology 2,Payment Typology 3,Birth Weight,Abortion Edit Indicator,Emergency Department Indicator,Total Charges,Total Costs
New York City,Manhattan,7002001,001438,Bellevue Hospital Center,18 to 29,114,F,Other Race,Not Span/Hispanic,2,Emergency,Home or Self Care,2017,651,Anxiety disorders,218,PSYCHO/PSYCHI EVAL/THER,756,Acute anxiety & delirium states,19,Mental Diseases and Disorders,1,Minor,Minor,Medical,Blue Cross/Blue Shield,,,,N,Y,4100.64,2643.88
New York City,Manhattan,7002001,001438,Bellevue Hospital Center,30 to 49,100,M,White,Not Span/Hispanic,1,Emergency,Home or Self Care,2017,259,Residual codes; unclassified,000,NO PROC,756,Acute anxiety & delirium states,19,Mental Diseases and Disorders,2,Moderate,Minor,Medical,Medicaid,Medicaid,,,N,Y,2371.82,1529.23
New York City,Manhattan,7002001,001438,Bellevue Hospital Center,30 to 49,100,M,Other Race,Spanish/Hispanic,2,Emergency,Home or Self Care,2017,651,Anxiety disorders,218,PSYCHO/PSYCHI EVAL/THER,756,Acute anxiety & delirium states,19,Mental Diseases and Disorders,1,Minor,Minor,Medical,Medicaid,Medicaid,,,N,Y,3993.88,2575.05
New York City,Manhattan,7002001,001438,Bellevue Hospital Center,0 to 17,100,F,White,Not Span/Hispanic,1,Emergency,Home or Self Care,2017,651,Anxiety disorders,000,NO PROC,756,Acute anxiety & delirium states,19,Mental Diseases and Disorders,1,Minor,Minor,Medical,Private Health Insurance,,,,N,N,1866.49,1203.42
New York City,Manhattan,7002001,001438,Bellevue Hospital Center,50 to 69,100,F,White,Not Span/Hispanic,1,Emergency,Home w/ Home Health Services,2017,651,Anxiety disorders,000,NO PROC,756,Acute anxiety & delirium states,19,Mental Diseases and Disorders,1,Minor,Minor,Medical,Medicare,Medicare,Medicaid,,N,Y,2442.14,1574.56
New York City,Manhattan,7002001,001438,Bellevue Hospital Center,0 to 17,112,F,White,Not Span/Hispanic,5,Emergency,Another Type Not Listed,2017,651,Anxiety disorders,000,NO PROC,756,Acute anxiety & delirium states,19,Mental Diseases and Disorders,1,Minor,Minor,Medical,Federal/State/Local/VA,,,,N,N,7209.31,4648.19
New York City,Manhattan,7002001,001438,Bellevue Hospital Center,18 to 29,100,M,White,Not Span/Hispanic,2,Emergency,Home or Self Care,2017,662,Suicide and intentional self-inflicted injury,218,PSYCHO/PSYCHI EVAL/THER,756,Acute anxiety & delirium states,19,Mental Diseases and Disorders,3,Major,Minor,Medical,Medicaid,,,,N,Y,4272.19,2754.49
New York City,Manhattan,7002001,001438,Bellevue Hospital Center,30 to 49,100,M,Black/African American,Not Span/Hispanic,1,Emergency,Home or Self Care,2017,662,Suicide and intentional self-inflicted injury,218,PSYCHO/PSYCHI EVAL/THER,756,Acute anxiety & delirium states,19,Mental Diseases and Disorders,3,Major,Minor,Medical,Medicare,,,,N,Y,2483.80,1601.43
New York City,Manhattan,7002001,001438,Bellevue Hospital Center,30 to 49,100,M,Black/African American,Not Span/Hispanic,1,Emergency,Home or Self Care,2017,259,Residual codes; unclassified,000,NO PROC,756,Acute anxiety & delirium states,19,Mental Diseases and Disorders,2,Moderate,Minor,Medical,Self-Pay,,,,N,Y,1862.09,1200.58
New York City,Manhattan,7002001,001438,Bellevue Hospital Center,30 to 49,100,M,Other Race,Not Span/Hispanic,1,Emergency,Home or Self Care,2017,662,Suicide and intentional self-inflicted injury,000,NO PROC,756,Acute anxiety & delirium states,19,Mental Diseases and Disorders,2,Moderate,Minor,Medical,Self-Pay,,,,N,Y,2510.93,1618.92
New York City,Manhattan,7002001,001438,Bellevue Hospital Center,30 to 49,100,M,Black/African American,Not Span/Hispanic,2,Emergency,Home or Self Care,2017,662,Suicide and intentional self-inflicted injury,218,PSYCHO/PSYCHI EVAL/THER,756,Acute anxiety & delirium states,19,Mental Diseases and Disorders,2,Moderate,Minor,Medical,Medicare,Medicaid,,,N,Y,4233.07,2729.26
New York City,Manhattan,7002001,001438,Bellevue Hospital Center,0 to 17,113,F,Other Race,Spanish/Hispanic,1,Emergency,Home or Self Care,2017,651,Anxiety disorders,218,PSYCHO/PSYCHI EVAL/THER,756,Acute anxiety & delirium states,19,Mental Diseases and Disorders,1,Minor,Minor,Medical,Private Health Insurance,,,,N,N,1400.00,902.65
New York City,Manhattan,7002001,001438,Bellevue Hospital Center,0 to 17,100,M,White,Not Span/Hispanic,1,Emergency,Home or Self Care,2017,651,Anxiety disorders,000,NO PROC,756,Acute anxiety & delirium states,19,Mental Diseases and Disorders,1,Minor,Minor,Medical,Private Health Insurance,,,,N,N,1855.36,1196.24
New York City,Manhattan,7002001,001438,Bellevue Hospital Center,50 to 69,112,F,Other Race,Not Span/Hispanic,4,Emergency,Home or Self Care,2017,651,Anxiety disorders,000,NO PROC,756,Acute anxiety & delirium states,19,Mental Diseases and Disorders,1,Minor,Minor,Medical,Medicaid,Medicaid,,,N,Y,8378.75,5402.18
New York City,Manhattan,7002001,001438,Bellevue Hospital Center,0 to 17,100,F,Other Race,Spanish/Hispanic,5,Emergency,Home or Self Care,2017,651,Anxiety disorders,218,PSYCHO/PSYCHI EVAL/THER,756,Acute anxiety & delirium states,19,Mental Diseases and Disorders,2,Moderate,Minor,Medical,Medicaid,Medicaid,,,N,N,8095.05,5219.27
New York City,Manhattan,7002001,001438,Bellevue Hospital Center,50 to 69,104,F,White,Not Span/Hispanic,2,Emergency,Home or Self Care,2017,651,Anxiety disorders,000,NO PROC,756,Acute anxiety & delirium states,19,Mental Diseases and Disorders,1,Minor,Minor,Medical,Private Health Insurance,Medicaid,,,N,Y,4404.33,2839.68
New York City,Manhattan,7002001,001438,Bellevue Hospital Center,30 to 49,104,M,Black/African American,Not Span/Hispanic,1,Emergency,Home or Self Care,2017,259,Residual codes; unclassified,000,NO PROC,756,Acute anxiety & delirium states,19,Mental Diseases and Disorders,2,Moderate,Minor,Medical,Medicare,Private Health Insurance,,,N,Y,2972.15,1916.29
New York City,Manhattan,7002001,001438,Bellevue Hospital Center,0 to 17,112,F,White,Not Span/Hispanic,7,Emergency,Home or Self Care,2017,651,Anxiety disorders,218,PSYCHO/PSYCHI EVAL/THER,756,Acute anxiety & delirium states,19,Mental Diseases and Disorders,1,Minor,Minor,Medical,Private Health Insurance,,,,N,N,10427.78,6723.29
New York City,Manhattan,7002001,001438,Bellevue Hospital Center,0 to 17,100,F,Black/African American,Not Span/Hispanic,27,Emergency,Home or Self Care,2017,651,Anxiety disorders,218,PSYCHO/PSYCHI EVAL/THER,756,Acute anxiety & delirium states,19,Mental Diseases and Disorders,2,Moderate,Minor,Medical,Medicaid,Medicaid,,,N,N,38152.49,24598.74
New York City,Manhattan,7002001,001438,Bellevue Hospital Center,30 to 49,100,M,Black/African American,Not Span/Hispanic,7,Emergency,Home or Self Care,2017,662,Suicide and intentional self-inflicted injury,000,NO PROC,756,Acute anxiety & delirium states,19,Mental Diseases and Disorders,2,Moderate,Minor,Medical,Medicaid,,,,N,Y,11322.59,7300.22
New York City,Manhattan,7002001,001438,Bellevue Hospital Center,30 to 49,100,M,White,Not Span/Hispanic,1,Emergency,Home or Self Care,2017,651,Anxiety disorders,000,NO PROC,756,Acute anxiety & delirium states,19,Mental Diseases and Disorders,1,Minor,Minor,Medical,Medicaid,Medicaid,,,N,Y,1846.93,1190.80
New York City,Manhattan,7002001,001438,Bellevue Hospital Center,30 to 49,100,M,Other Race,Not Span/Hispanic,4,Emergency,Home or Self Care,2017,651,Anxiety disorders,218,PSYCHO/PSYCHI EVAL/THER,756,Acute anxiety & delirium states,19,Mental Diseases and Disorders,1,Minor,Minor,Medical,Medicaid,Medicaid,,,N,N,8408.90,5421.62
New York City,Manhattan,7002001,001438,Bellevue Hospital Center,30 to 49,100,M,White,Not Span/Hispanic,1,Emergency,Home or Self Care,2017,259,Residual codes; unclassified,203,ELECTROGR CARDIAC MONIT,756,Acute anxiety & delirium states,19,Mental Diseases and Disorders,2,Moderate,Minor,Medical,Medicaid,,,,N,Y,2967.83,1913.50
New York City,Manhattan,7002001,001438,Bellevue Hospital Center,18 to 29,100,M,Black/African American,Not Span/Hispanic,1,Emergency,Left Against Medical Advice,2017,670,Miscellaneous disorders,041,OT NON-OR THER PRC RESP,756,Acute anxiety & delirium states,19,Mental Diseases and Disorders,2,Moderate,Minor,Medical,Medicaid,,,,N,N,6232.31,4018.27
New York City,Manhattan,7002001,001438,Bellevue Hospital Center,0 to 17,100,F,Black/African American,Not Span/Hispanic,23,Emergency,Home or Self Care,2017,651,Anxiety disorders,218,PSYCHO/PSYCHI EVAL/THER,756,Acute anxiety & delirium states,19,Mental Diseases and Disorders,2,Moderate,Minor,Medical,Private Health Insurance,,,,N,N,32860.64,21186.83
New York City,Manhattan,7002001,001438,Bellevue Hospital Center,18 to 29,100,M,Black/African American,Not Span/Hispanic,9,Emergency,Home or Self Care,2017,662,Suicide and intentional self-inflicted injury,218,PSYCHO/PSYCHI EVAL/THER,756,Acute anxiety & delirium states,19,Mental Diseases and Disorders,2,Moderate,Minor,Medical,Self-Pay,,,,N,Y,14434.00,9306.29
New York City,Manhattan,7002001,001438,Bellevue Hospital Center,0 to 17,100,F,White,Not Span/Hispanic,2,Emergency,Home or Self Care,2017,651,Anxiety disorders,218,PSYCHO/PSYCHI EVAL/THER,756,Acute anxiety & delirium states,19,Mental Diseases and Disorders,2,Moderate,Minor,Medical,Private Health Insurance,,,,N,N,2944.91,1898.72
New York City,Manhattan,7002001,001438,Bellevue Hospital Center,50 to 69,100,M,Black/African American,Not Span/Hispanic,2,Emergency,Home or Self Care,2017,259,Residual codes; unclassified,218,PSYCHO/PSYCHI EVAL/THER,756,Acute anxiety & delirium states,19,Mental Diseases and Disorders,1,Minor,Minor,Medical,Department of Corrections,,,,N,Y,4286.46,2763.69
New York City,Manhattan,7002001,001438,Bellevue Hospital Center,0 to 17,112,F,Other Race,Not Span/Hispanic,3,Emergency,Home or Self Care,2017,651,Anxiety disorders,218,PSYCHO/PSYCHI EVAL/THER,756,Acute anxiety & delirium states,19,Mental Diseases and Disorders,1,Minor,Minor,Medical,Medicaid,Medicaid,,,N,N,4663.21,3006.60
New York City,Manhattan,7002001,001438,Bellevue Hospital Center,18 to 29,112,M,White,Not Span/Hispanic,1,Emergency,Home or Self Care,2017,662,Suicide and intentional self-inflicted injury,218,PSYCHO/PSYCHI EVAL/THER,756,Acute anxiety & delirium states,19,Mental Diseases and Disorders,2,Moderate,Minor,Medical,Blue Cross/Blue Shield,,,,N,Y,3133.13,2020.08
New York City,Manhattan,7002001,001438,Bellevue Hospital Center,70 or Older,100,M,White,Not Span/Hispanic,1,Emergency,Home or Self Care,2017,651,Anxiety disorders,218,PSYCHO/PSYCHI EVAL/THER,756,Acute anxiety & delirium states,19,Mental Diseases and Disorders,1,Minor,Minor,Medical,Medicare,Medicare,,,N,Y,2605.56,1679.93
New York City,Manhattan,7002001,001438,Bellevue Hospital Center,0 to 17,112,F,Other Race,Spanish/Hispanic,3,Emergency,Home or Self Care,2017,651,Anxiety disorders,000,NO PROC,756,Acute anxiety & delirium states,19,Mental Diseases and Disorders,1,Minor,Minor,Medical,Private Health Insurance,,,,N,N,5023.72,3239.03
New York City,Manhattan,7002001,001438,Bellevue Hospital Center,0 to 17,111,F,White,Not Span/Hispanic,14,Emergency,Home or Self Care,2017,651,Anxiety disorders,218,PSYCHO/PSYCHI EVAL/THER,756,Acute anxiety & delirium states,19,Mental Diseases and Disorders,2,Moderate,Minor,Medical,Blue Cross/Blue Shield,,,,N,N,21017.78,13551.17
New York City,Manhattan,7002001,001438,Bellevue Hospital Center,30 to 49,,M,White,Spanish/Hispanic,1,Emergency,Home or Self Care,2017,651,Anxiety disorders,218,PSYCHO/PSYCHI EVAL/THER,756,Acute anxiety & delirium states,19,Mental Diseases and Disorders,1,Minor,Minor,Medical,Medicare,Medicare,Medicaid,,N,Y,2546.86,1642.08
New York City,Manhattan,7002001,001438,Bellevue Hospital Center,50 to 69,100,M,White,Not Span/Hispanic,2,Emergency,Home or Self Care,2017,259,Residual codes; unclassified,218,PSYCHO/PSYCHI EVAL/THER,756,Acute anxiety & delirium states,19,Mental Diseases and Disorders,2,Moderate,Minor,Medical,Medicaid,Medicaid,,,N,Y,4664.47,3007.41
New York City,Manhattan,7002001,001438,Bellevue Hospital Center,0 to 17,112,F,Other Race,Spanish/Hispanic,15,Emergency,Home or Self Care,2017,651,Anxiety disorders,218,PSYCHO/PSYCHI EVAL/THER,756,Acute anxiety & delirium states,19,Mental Diseases and Disorders,2,Moderate,Minor,Medical,Private Health Insurance,,,,N,N,21026.22,13556.61
New York City,Manhattan,7002001,001438,Bellevue Hospital Center,30 to 49,113,M,White,Not Span/Hispanic,1,Emergency,Home or Self Care,2017,662,Suicide and intentional self-inflicted injury,218,PSYCHO/PSYCHI EVAL/THER,756,Acute anxiety & delirium states,19,Mental Diseases and Disorders,2,Moderate,Minor,Medical,Medicaid,Medicaid,,,N,Y,3087.11,1990.41
New York City,Manhattan,7002001,001438,Bellevue Hospital Center,30 to 49,100,M,Black/African American,Not Span/Hispanic,1,Emergency,Home or Self Care,2017,651,Anxiety disorders,218,PSYCHO/PSYCHI EVAL/THER,756,Acute anxiety & delirium states,19,Mental Diseases and Disorders,1,Minor,Minor,Medical,Private Health Insurance,,,,N,Y,2884.33,1859.67
New York City,Manhattan,7002001,001438,Bellevue Hospital Center,0 to 17,100,F,Other Race,Not Span/Hispanic,1,Emergency,Home or Self Care,2017,651,Anxiety disorders,218,PSYCHO/PSYCHI EVAL/THER,756,Acute anxiety & delirium states,19,Mental Diseases and Disorders,2,Moderate,Minor,Medical,Private Health Insurance,,,,N,N,1400.00,902.65
New York City,Manhattan,7002001,001438,Bellevue Hospital Center,0 to 17,OOS,F,Other Race,Not Span/Hispanic,47,Emergency,Home or Self Care,2017,651,Anxiety disorders,218,PSYCHO/PSYCHI EVAL/THER,756,Acute anxiety & delirium states,19,Mental Diseases and Disorders,1,Minor,Minor,Medical,Private Health Insurance,,,,N,N,68730.34,44313.75
New York City,Manhattan,7002001,001438,Bellevue Hospital Center,70 or Older,100,M,White,Not Span/Hispanic,15,Emergency,Home or Self Care,2017,651,Anxiety disorders,218,PSYCHO/PSYCHI EVAL/THER,756,Acute anxiety & delirium states,19,Mental Diseases and Disorders,2,Moderate,Minor,Medical,Medicare,Medicaid,,,N,Y,29635.57,19107.47
New York City,Manhattan,7002001,001438,Bellevue Hospital Center,50 to 69,113,M,Black/African American,Not Span/Hispanic,7,Emergency,Home or Self Care,2017,651,Anxiety disorders,000,NO PROC,756,Acute anxiety & delirium states,19,Mental Diseases and Disorders,1,Minor,Minor,Medical,Medicaid,,,,N,Y,12060.23,7775.81
New York City,Manhattan,7002001,001438,Bellevue Hospital Center,18 to 29,100,M,Other Race,Not Span/Hispanic,1,Emergency,Home or Self Care,2017,662,Suicide and intentional self-inflicted injury,218,PSYCHO/PSYCHI EVAL/THER,756,Acute anxiety & delirium states,19,Mental Diseases and Disorders,2,Moderate,Minor,Medical,Self-Pay,,,,N,Y,2624.51,1692.15
New York City,Manhattan,7002001,001438,Bellevue Hospital Center,18 to 29,OOS,M,Other Race,Not Span/Hispanic,1,Emergency,Home or Self Care,2017,259,Residual codes; unclassified,218,PSYCHO/PSYCHI EVAL/THER,756,Acute anxiety & delirium states,19,Mental Diseases and Disorders,1,Minor,Minor,Medical,Medicare,Medicare,Medicaid,,N,Y,1854.51,1195.69
New York City,Manhattan,7002001,001438,Bellevue Hospital Center,30 to 49,112,M,White,Not Span/Hispanic,4,Emergency,Home or Self Care,2017,662,Suicide and intentional self-inflicted injury,218,PSYCHO/PSYCHI EVAL/THER,756,Acute anxiety & delirium states,19,Mental Diseases and Disorders,2,Moderate,Minor,Medical,Blue Cross/Blue Shield,,,,N,Y,6703.92,4322.34
New York City,Manhattan,7002001,001438,Bellevue Hospital Center,30 to 49,111,M,Black/African American,Not Span/Hispanic,1,Emergency,Home or Self Care,2017,651,Anxiety disorders,218,PSYCHO/PSYCHI EVAL/THER,756,Acute anxiety & delirium states,19,Mental Diseases and Disorders,2,Moderate,Minor,Medical,Medicaid,Medicaid,,,N,Y,2661.36,1715.91
New York City,Manhattan,7002001,001438,Bellevue Hospital Center,18 to 29,100,M,Other Race,Not Span/Hispanic,2,Emergency,Home or Self Care,2017,651,Anxiety disorders,218,PSYCHO/PSYCHI EVAL/THER,756,Acute anxiety & delirium states,19,Mental Diseases and Disorders,1,Minor,Minor,Medical,Medicaid,,,,N,Y,3931.36,2534.74
New York City,Manhattan,7002001,001438,Bellevue Hospital Center,18 to 29,113,M,White,Not Span/Hispanic,15,Emergency,Home or Self Care,2017,651,Anxiety disorders,218,PSYCHO/PSYCHI EVAL/THER,756,Acute anxiety & delirium states,19,Mental Diseases and Disorders,2,Moderate,Minor,Medical,Private Health Insurance,Medicaid,,,N,Y,22304.00,14380.46
New York City,Manhattan,7002001,001438,Bellevue Hospital Center,30 to 49,100,F,Other Race,Not Span/Hispanic,9,Emergency,Home or Self Care,2017,670,Miscellaneous disorders,218,PSYCHO/PSYCHI EVAL/THER,756,Acute anxiety & delirium states,19,Mental Diseases and Disorders,1,Minor,Minor,Medical,Medicaid,,,,N,Y,14116.18,9101.38
New York City,Manhattan,7002001,001438,Bellevue Hospital Center,0 to 17,OOS,M,White,Not Span/Hispanic,2,Emergency,Home or Self Care,2017,651,Anxiety disorders,032,OT NON-OR THER PRC NOSE,756,Acute anxiety & delirium states,19,Mental Diseases and Disorders,1,Minor,Minor,Medical,Private Health Insurance,,,,N,N,3275.82,2112.08
New York City,Manhattan,7002001,001438,Bellevue Hospital Center,0 to 17,112,F,White,Not Span/Hispanic,1,Emergency,Home or Self Care,2017,651,Anxiety disorders,218,PSYCHO/PSYCHI EVAL/THER,756,Acute anxiety & delirium states,19,Mental Diseases and Disorders,1,Minor,Minor,Medical,Private Health Insurance,Medicaid,,,N,N,1620.68,1044.93
New York City,Manhattan,7002001,001438,Bellevue Hospital Center,50 to 69,104,F,Black/African American,Not Span/Hispanic,12,Emergency,Another Type Not Listed,2017,653,"Delirium, dementia, and amnestic and other cognitive disorders",000,NO PROC,756,Acute anxiety & delirium states,19,Mental Diseases and Disorders,2,Moderate,Moderate,Medical,Medicaid,Medicaid,,,N,N,70211.49,45268.72
New York City,Manhattan,7002001,001438,Bellevue Hospital Center,50 to 69,112,F,Other Race,Spanish/Hispanic,14,Emergency,Home w/ Home Health Services,2017,651,Anxiety disorders,218,PSYCHO/PSYCHI EVAL/THER,756,Acute anxiety & delirium states,19,Mental Diseases and Disorders,1,Minor,Minor,Medical,Medicare,Medicaid,,,N,Y,23308.30,15027.98
New York City,Manhattan,7002001,001438,Bellevue Hospital Center,30 to 49,100,M,White,Not Span/Hispanic,1,Emergency,Home or Self Care,2017,651,Anxiety disorders,218,PSYCHO/PSYCHI EVAL/THER,756,Acute anxiety & delirium states,19,Mental Diseases and Disorders,1,Minor,Minor,Medical,Medicaid,Medicaid,,,N,Y,2476.32,1596.60
New York City,Manhattan,7002001,001438,Bellevue Hospital Center,0 to 17,112,F,Other Race,Spanish/Hispanic,12,Emergency,Home or Self Care,2017,651,Anxiety disorders,218,PSYCHO/PSYCHI EVAL/THER,756,Acute anxiety & delirium states,19,Mental Diseases and Disorders,1,Minor,Minor,Medical,Medicaid,Medicaid,,,N,N,16800.00,10831.77
New York City,Manhattan,7002001,001438,Bellevue Hospital Center,0 to 17,100,M,Other Race,Not Span/Hispanic,22,Emergency,Home or Self Care,2017,651,Anxiety disorders,218,PSYCHO/PSYCHI EVAL/THER,756,Acute anxiety & delirium states,19,Mental Diseases and Disorders,2,Moderate,Minor,Medical,Private Health Insurance,Medicaid,,,N,N,32293.56,20821.21
New York City,Manhattan,7002001,001438,Bellevue Hospital Center,30 to 49,111,M,Other Race,Spanish/Hispanic,1,Emergency,Home or Self Care,2017,651,Anxiety disorders,218,PSYCHO/PSYCHI EVAL/THER,756,Acute anxiety & delirium states,19,Mental Diseases and Disorders,1,Minor,Minor,Medical,Blue Cross/Blue Shield,,,,N,Y,4017.94,2590.56
New York City,Manhattan,7002001,001438,Bellevue Hospital Center,0 to 17,100,M,Other Race,Not Span/Hispanic,1,Emergency,Home or Self Care,2017,662,Suicide and intentional self-inflicted injury,218,PSYCHO/PSYCHI EVAL/THER,756,Acute anxiety & delirium states,19,Mental Diseases and Disorders,3,Major,Minor,Medical,Medicaid,,,,N,N,1752.29,1129.79
New York City,Manhattan,7002001,001438,Bellevue Hospital Center,18 to 29,104,M,Other Race,Not Span/Hispanic,1,Emergency,Home or Self Care,2017,651,Anxiety disorders,218,PSYCHO/PSYCHI EVAL/THER,756,Acute anxiety & delirium states,19,Mental Diseases and Disorders,1,Minor,Minor,Medical,Medicaid,Medicaid,,,N,Y,2607.13,1680.94
New York City,Manhattan,7002001,001438,Bellevue Hospital Center,50 to 69,100,M,Other Race,Not Span/Hispanic,1,Emergency,Home or Self Care,2017,259,Residual codes; unclassified,218,PSYCHO/PSYCHI EVAL/THER,756,Acute anxiety & delirium states,19,Mental Diseases and Disorders,2,Moderate,Minor,Medical,Medicaid,Medicaid,,,N,Y,2497.70,1610.39
New York City,Manhattan,7002001,001438,Bellevue Hospital Center,0 to 17,100,M,Other Race,Not Span/Hispanic,19,Emergency,Home or Self Care,2017,651,Anxiety disorders,218,PSYCHO/PSYCHI EVAL/THER,756,Acute anxiety & delirium states,19,Mental Diseases and Disorders,2,Moderate,Minor,Medical,Private Health Insurance,Medicaid,,,N,N,30661.36,19768.85
New York City,Manhattan,7002001,001438,Bellevue Hospital Center,0 to 17,100,F,Other Race,Spanish/Hispanic,4,Emergency,Home or Self Care,2017,651,Anxiety disorders,218,PSYCHO/PSYCHI EVAL/THER,756,Acute anxiety & delirium states,19,Mental Diseases and Disorders,1,Minor,Minor,Medical,Medicaid,,,,N,N,5600.00,3610.59
New York City,Manhattan,7002001,001438,Bellevue Hospital Center,0 to 17,100,M,White,Not Span/Hispanic,1,Emergency,Home or Self Care,2017,651,Anxiety disorders,218,PSYCHO/PSYCHI EVAL/THER,756,Acute anxiety & delirium states,19,Mental Diseases and Disorders,1,Minor,Minor,Medical,Private Health Insurance,,,,N,N,1607.38,1036.36
New York City,Manhattan,7002001,001438,Bellevue Hospital Center,18 to 29,100,M,White,Not Span/Hispanic,7,Emergency,Home or Self Care,2017,651,Anxiety disorders,218,PSYCHO/PSYCHI EVAL/THER,756,Acute anxiety & delirium states,19,Mental Diseases and Disorders,1,Minor,Minor,Medical,Medicaid,,,,N,Y,11148.50,7187.97
New York City,Manhattan,7002001,001438,Bellevue Hospital Center,50 to 69,112,F,Other Race,Spanish/Hispanic,20,Emergency,Home or Self Care,2017,651,Anxiety disorders,218,PSYCHO/PSYCHI EVAL/THER,756,Acute anxiety & delirium states,19,Mental Diseases and Disorders,1,Minor,Minor,Medical,Medicare,Medicaid,,,N,Y,30487.49,19656.75
New York City,Manhattan,7002001,001438,Bellevue Hospital Center,0 to 17,100,M,White,Not Span/Hispanic,2,Emergency,Home or Self Care,2017,651,Anxiety disorders,218,PSYCHO/PSYCHI EVAL/THER,756,Acute anxiety & delirium states,19,Mental Diseases and Disorders,2,Moderate,Minor,Medical,Private Health Insurance,,,,N,N,3256.29,2099.49
New York City,Manhattan,7002001,001438,Bellevue Hospital Center,0 to 17,113,F,Other Race,Not Span/Hispanic,2,Emergency,Home or Self Care,2017,670,Miscellaneous disorders,218,PSYCHO/PSYCHI EVAL/THER,756,Acute anxiety & delirium states,19,Mental Diseases and Disorders,2,Moderate,Minor,Medical,Private Health Insurance,,,,N,N,2800.00,1805.29
New York City,Manhattan,7002001,001438,Bellevue Hospital Center,30 to 49,100,F,White,Not Span/Hispanic,1,Emergency,Home or Self Care,2017,662,Suicide and intentional self-inflicted injury,219,ALCO/DRUG REHAB/DETOX,756,Acute anxiety & delirium states,19,Mental Diseases and Disorders,2,Moderate,Minor,Medical,Self-Pay,,,,N,Y,2884.00,1859.45
New York City,Manhattan,7002001,001438,Bellevue Hospital Center,0 to 17,112,F,White,Not Span/Hispanic,11,Emergency,Home or Self Care,2017,651,Anxiety disorders,218,PSYCHO/PSYCHI EVAL/THER,756,Acute anxiety & delirium states,19,Mental Diseases and Disorders,1,Minor,Minor,Medical,Blue Cross/Blue Shield,,,,N,N,15778.51,10173.16
New York City,Manhattan,7002001,001438,Bellevue Hospital Center,18 to 29,113,F,Other Race,Not Span/Hispanic,1,Emergency,Home or Self Care,2017,651,Anxiety disorders,218,PSYCHO/PSYCHI EVAL/THER,756,Acute anxiety & delirium states,19,Mental Diseases and Disorders,1,Minor,Minor,Medical,Private Health Insurance,,,,N,Y,2540.18,1637.78