Hospital Service Area,Hospital County,Operating Certificate Number,Permanent Facility Id,Facility Name,Age Group,Zip Code - 3 digits,Gender,Race,Ethnicity,Length of Stay,Type of Admission,Patient Disposition,Discharge Year,CCS Diagnosis Code,CCS Diagnosis Description,CCS Procedure Code,CCS Procedure Description,APR DRG Code,APR DRG Description,APR MDC Code,APR MDC Description,APR Severity of Illness Code,APR Severity of Illness Description,APR Risk of Mortality,APR Medical Surgical Description,Payment Typology 1,Payment Typology 2,Payment Typology 3,Birth Weight,Abortion Edit Indicator,Emergency Department Indicator,Total Charges,Total Costs
Long Island,Nassau,2908000,000511,NYU Langone Hospital-Long Island,30 to 49,115,F,Other Race,Spanish/Hispanic,1,Emergency,Home or Self Care,2019,MBD007,TRAUMA- AND STRESSOR-RELATED DISORDERS,,,756,ACUTE ANXIETY & DELIRIUM STATES,19,MENTAL DISEASES AND DISORDERS,1,Minor,Minor,Medical,Medicaid,,,,,true,50152,5416.15
Long Island,Nassau,2908000,000511,NYU Langone Hospital-Long Island,18 to 29,115,F,Black/African American,Not Span/Hispanic,1,Emergency,Home or Self Care,2019,MBD012,SUICIDAL IDEATION/ATTEMPT/INTENTIONAL SELF-HARM,,,756,ACUTE ANXIETY & DELIRIUM STATES,19,MENTAL DISEASES AND DISORDERS,3,Major,Minor,Medical,Federal/State/Local/VA,,,,,true,16960.03,2732.99
Long Island,Nassau,2908000,000511,NYU Langone Hospital-Long Island,0 to 17,115,M,Other Race,Spanish/Hispanic,1,Emergency,Home or Self Care,2019,MBD012,SUICIDAL IDEATION/ATTEMPT/INTENTIONAL SELF-HARM,,,756,ACUTE ANXIETY & DELIRIUM STATES,19,MENTAL DISEASES AND DISORDERS,3,Major,Minor,Medical,Medicaid,Medicaid,,,,true,15946.1,2662.23
Long Island,Nassau,2908000,000511,NYU Langone Hospital-Long Island,18 to 29,117,F,White,Not Span/Hispanic,3,Emergency,Home or Self Care,2019,MBD007,TRAUMA- AND STRESSOR-RELATED DISORDERS,,,756,ACUTE ANXIETY & DELIRIUM STATES,19,MENTAL DISEASES AND DISORDERS,1,Minor,Minor,Medical,Private Health Insurance,,,,,true,65416.08,7800.54
Long Island,Nassau,2908000,000511,NYU Langone Hospital-Long Island,50 to 69,115,M,White,Not Span/Hispanic,4,Emergency,Home or Self Care,2019,MBD012,SUICIDAL IDEATION/ATTEMPT/INTENTIONAL SELF-HARM,MAM011,ELECTROENCEPHALOGRAM (EEG),756,ACUTE ANXIETY & DELIRIUM STATES,19,MENTAL DISEASES AND DISORDERS,3,Major,Minor,Medical,Blue Cross/Blue Shield,,,,,true,74460.44,10078.6
Long Island,Nassau,2908000,000511,NYU Langone Hospital-Long Island,70 or Older,114,F,Black/African American,Not Span/Hispanic,3,Emergency,Home or Self Care,2019,MBD007,TRAUMA- AND STRESSOR-RELATED DISORDERS,MAM011,ELECTROENCEPHALOGRAM (EEG),756,ACUTE ANXIETY & DELIRIUM STATES,19,MENTAL DISEASES AND DISORDERS,3,Major,Moderate,Medical,Medicare,Medicare,Blue Cross/Blue Shield,,,true,65446.39,8536.24
Long Island,Nassau,2908000,000511,NYU Langone Hospital-Long Island,30 to 49,117,M,White,Not Span/Hispanic,2,Emergency,Home or Self Care,2019,MBD007,TRAUMA- AND STRESSOR-RELATED DISORDERS,,,756,ACUTE ANXIETY & DELIRIUM STATES,19,MENTAL DISEASES AND DISORDERS,2,Moderate,Minor,Medical,Medicaid,Medicaid,,,,true,41676.95,6159.22
Long Island,Nassau,2908000,000511,NYU Langone Hospital-Long Island,70 or Older,110,F,White,Not Span/Hispanic,3,Emergency,Home w/ Home Health Services,2019,MBD005,ANXIETY AND FEAR-RELATED DISORDERS,MAM004,CARDIAC STRESS TESTS,756,ACUTE ANXIETY & DELIRIUM STATES,19,MENTAL DISEASES AND DISORDERS,1,Minor,Minor,Medical,Medicare,Medicare,Private Health Insurance,,,true,44978.7,9187.9
Long Island,Nassau,2908000,000511,NYU Langone Hospital-Long Island,70 or Older,115,F,White,Not Span/Hispanic,3,Emergency,Skilled Nursing Home,2019,MBD005,ANXIETY AND FEAR-RELATED DISORDERS,,,756,ACUTE ANXIETY & DELIRIUM STATES,19,MENTAL DISEASES AND DISORDERS,3,Major,Moderate,Medical,Medicare,Medicare,,,,true,35327.87,7075.04
Long Island,Nassau,2908000,000511,NYU Langone Hospital-Long Island,70 or Older,110,M,White,Not Span/Hispanic,1,Emergency,Home or Self Care,2019,MBD005,ANXIETY AND FEAR-RELATED DISORDERS,,,756,ACUTE ANXIETY & DELIRIUM STATES,19,MENTAL DISEASES AND DISORDERS,1,Minor,Moderate,Medical,Medicare,Medicare,,,,true,14502.2,2561.47
Long Island,Nassau,2908000,000511,NYU Langone Hospital-Long Island,0 to 17,115,M,White,Not Span/Hispanic,1,Emergency,Psychiatric Hospital or Unit of Hosp,2019,MBD012,SUICIDAL IDEATION/ATTEMPT/INTENTIONAL SELF-HARM,,,756,ACUTE ANXIETY & DELIRIUM STATES,19,MENTAL DISEASES AND DISORDERS,3,Major,Minor,Medical,Private Health Insurance,,,,,true,14335.57,2502.93
Long Island,Nassau,2908000,000511,NYU Langone Hospital-Long Island,50 to 69,115,F,White,Spanish/Hispanic,2,Emergency,Home w/ Home Health Services,2019,MBD005,ANXIETY AND FEAR-RELATED DISORDERS,,,756,ACUTE ANXIETY & DELIRIUM STATES,19,MENTAL DISEASES AND DISORDERS,1,Minor,Minor,Medical,Private Health Insurance,,,,,true,42981.85,5733.96
Long Island,Nassau,2908000,000511,NYU Langone Hospital-Long Island,0 to 17,115,M,Black/African American,Not Span/Hispanic,1,Emergency,Home or Self Care,2019,MBD005,ANXIETY AND FEAR-RELATED DISORDERS,,,756,ACUTE ANXIETY & DELIRIUM STATES,19,MENTAL DISEASES AND DISORDERS,1,Minor,Minor,Medical,Medicaid,,,,,true,19047.48,2701.91
Long Island,Nassau,2908000,000511,NYU Langone Hospital-Long Island,0 to 17,115,M,Other Race,Spanish/Hispanic,1,Emergency,Home or Self Care,2019,MBD012,SUICIDAL IDEATION/ATTEMPT/INTENTIONAL SELF-HARM,,,756,ACUTE ANXIETY & DELIRIUM STATES,19,MENTAL DISEASES AND DISORDERS,2,Moderate,Minor,Medical,Medicaid,Medicaid,,,,true,16054.16,2612.93
Long Island,Nassau,2908000,000511,NYU Langone Hospital-Long Island,70 or Older,115,F,White,Spanish/Hispanic,7,Emergency,Skilled Nursing Home,2019,MBD005,ANXIETY AND FEAR-RELATED DISORDERS,,,756,ACUTE ANXIETY & DELIRIUM STATES,19,MENTAL DISEASES AND DISORDERS,2,Moderate,Major,Medical,Medicare,Medicare,Private Health Insurance,,,true,90085.71,15370.09
Long Island,Nassau,2908000,000511,NYU Langone Hospital-Long Island,30 to 49,117,M,White,Not Span/Hispanic,1,Emergency,Home or Self Care,2019,MBD012,SUICIDAL IDEATION/ATTEMPT/INTENTIONAL SELF-HARM,,,756,ACUTE ANXIETY & DELIRIUM STATES,19,MENTAL DISEASES AND DISORDERS,3,Major,Minor,Medical,Medicaid,,,,,true,15002.44,2669.69
Long Island,Nassau,2908000,000511,NYU Langone Hospital-Long Island,30 to 49,115,M,White,Not Span/Hispanic,1,Emergency,Psychiatric Hospital or Unit of Hosp,2019,MBD012,SUICIDAL IDEATION/ATTEMPT/INTENTIONAL SELF-HARM,,,756,ACUTE ANXIETY & DELIRIUM STATES,19,MENTAL DISEASES AND DISORDERS,3,Major,Minor,Medical,Federal/State/Local/VA,,,,,true,15776.29,2637.51
Long Island,Nassau,2908000,000511,NYU Langone Hospital-Long Island,30 to 49,115,F,White,Not Span/Hispanic,1,Emergency,Home or Self Care,2019,MBD005,ANXIETY AND FEAR-RELATED DISORDERS,,,756,ACUTE ANXIETY & DELIRIUM STATES,19,MENTAL DISEASES AND DISORDERS,3,Major,Minor,Medical,Private Health Insurance,,,,,true,28599.27,3611.82
Long Island,Nassau,2908000,000511,NYU Langone Hospital-Long Island,18 to 29,117,F,White,Not Span/Hispanic,4,Emergency,Home or Self Care,2019,MBD007,TRAUMA- AND STRESSOR-RELATED DISORDERS,,,756,ACUTE ANXIETY & DELIRIUM STATES,19,MENTAL DISEASES AND DISORDERS,3,Major,Moderate,Medical,Blue Cross/Blue Shield,,,,,true,78897.93,10211.79
Long Island,Nassau,2908000,000511,NYU Langone Hospital-Long Island,0 to 17,115,F,Other Race,Spanish/Hispanic,1,Emergency,Home or Self Care,2019,MBD005,ANXIETY AND FEAR-RELATED DISORDERS,,,756,ACUTE ANXIETY & DELIRIUM STATES,19,MENTAL DISEASES AND DISORDERS,1,Minor,Minor,Medical,Medicaid,Medicaid,,,,true,16712.02,2824.09
Long Island,Nassau,2908000,000511,NYU Langone Hospital-Long Island,30 to 49,110,M,Other Race,Not Span/Hispanic,1,Urgent,Home or Self Care,2019,MBD005,ANXIETY AND FEAR-RELATED DISORDERS,,,756,ACUTE ANXIETY & DELIRIUM STATES,19,MENTAL DISEASES AND DISORDERS,1,Minor,Minor,Medical,Federal/State/Local/VA,,,,,true,26302.93,3326.4
Long Island,Nassau,2908000,000511,NYU Langone Hospital-Long Island,50 to 69,115,F,Other Race,Spanish/Hispanic,1,Emergency,Home or Self Care,2019,MBD005,ANXIETY AND FEAR-RELATED DISORDERS,,,756,ACUTE ANXIETY & DELIRIUM STATES,19,MENTAL DISEASES AND DISORDERS,3,Major,Moderate,Medical,Medicaid,Medicaid,,,,true,19193.53,3106.55
Long Island,Nassau,2908000,000511,NYU Langone Hospital-Long Island,50 to 69,110,F,White,Not Span/Hispanic,1,Emergency,Home or Self Care,2019,MBD005,ANXIETY AND FEAR-RELATED DISORDERS,,,756,ACUTE ANXIETY & DELIRIUM STATES,19,MENTAL DISEASES AND DISORDERS,1,Minor,Minor,Medical,Blue Cross/Blue Shield,,,,,true,28515.38,3199.68
Long Island,Nassau,2908000,000511,NYU Langone Hospital-Long Island,18 to 29,115,F,White,Not Span/Hispanic,1,Emergency,Home or Self Care,2019,MBD005,ANXIETY AND FEAR-RELATED DISORDERS,,,756,ACUTE ANXIETY & DELIRIUM STATES,19,MENTAL DISEASES AND DISORDERS,1,Minor,Minor,Medical,Blue Cross/Blue Shield,,,,,true,23170.26,3141.25
Long Island,Nassau,2908000,000511,NYU Langone Hospital-Long Island,0 to 17,115,F,Other Race,Spanish/Hispanic,4,Urgent,Home w/ Home Health Services,2019,MBD005,ANXIETY AND FEAR-RELATED DISORDERS,MAM011,ELECTROENCEPHALOGRAM (EEG),756,ACUTE ANXIETY & DELIRIUM STATES,19,MENTAL DISEASES AND DISORDERS,1,Minor,Minor,Medical,Medicaid,,,,,false,37656.49,4846.17
Long Island,Nassau,2908000,000511,NYU Langone Hospital-Long Island,18 to 29,115,M,White,Not Span/Hispanic,1,Emergency,Psychiatric Hospital or Unit of Hosp,2019,MBD005,ANXIETY AND FEAR-RELATED DISORDERS,,,756,ACUTE ANXIETY & DELIRIUM STATES,19,MENTAL DISEASES AND DISORDERS,1,Minor,Minor,Medical,Blue Cross/Blue Shield,,,,,true,14710.4,2576
Long Island,Nassau,2908000,000511,NYU Langone Hospital-Long Island,50 to 69,117,M,White,Not Span/Hispanic,1,Emergency,Home or Self Care,2019,MBD005,ANXIETY AND FEAR-RELATED DISORDERS,,,756,ACUTE ANXIETY & DELIRIUM STATES,19,MENTAL DISEASES AND DISORDERS,1,Minor,Minor,Medical,Private Health Insurance,,,,,true,26293.17,3561.14
Long Island,Nassau,2908000,000511,NYU Langone Hospital-Long Island,50 to 69,115,M,Black/African American,Not Span/Hispanic,2,Emergency,Home or Self Care,2019,MBD005,ANXIETY AND FEAR-RELATED DISORDERS,,,756,ACUTE ANXIETY & DELIRIUM STATES,19,MENTAL DISEASES AND DISORDERS,3,Major,Moderate,Medical,Medicare,,,,,true,54849.74,7808.55
Long Island,Nassau,2908000,000511,NYU Langone Hospital-Long Island,18 to 29,115,F,Black/African American,Not Span/Hispanic,13,Emergency,Home w/ Home Health Services,2019,MBD007,TRAUMA- AND STRESSOR-RELATED DISORDERS,,,756,ACUTE ANXIETY & DELIRIUM STATES,19,MENTAL DISEASES AND DISORDERS,2,Moderate,Minor,Medical,Medicare,,,,,true,134933.59,26044.96
Long Island,Nassau,2908000,000511,NYU Langone Hospital-Long Island,18 to 29,115,M,Black/African American,Not Span/Hispanic,1,Emergency,Another Type Not Listed,2019,MBD007,TRAUMA- AND STRESSOR-RELATED DISORDERS,,,756,ACUTE ANXIETY & DELIRIUM STATES,19,MENTAL DISEASES AND DISORDERS,1,Minor,Minor,Medical,Private Health Insurance,,,,,true,20685.36,2824.14
Long Island,Nassau,2908000,000511,NYU Langone Hospital-Long Island,50 to 69,117,M,White,Not Span/Hispanic,1,Emergency,Home or Self Care,2019,MBD005,ANXIETY AND FEAR-RELATED DISORDERS,,,756,ACUTE ANXIETY & DELIRIUM STATES,19,MENTAL DISEASES AND DISORDERS,2,Moderate,Minor,Medical,Blue Cross/Blue Shield,,,,,true,18155.69,2670.95
Long Island,Nassau,2908000,000511,NYU Langone Hospital-Long Island,18 to 29,115,F,White,Not Span/Hispanic,1,Emergency,Home or Self Care,2019,MBD005,ANXIETY AND FEAR-RELATED DISORDERS,,,756,ACUTE ANXIETY & DELIRIUM STATES,19,MENTAL DISEASES AND DISORDERS,1,Minor,Minor,Medical,Private Health Insurance,,,,,true,21829.39,3125.45
Long Island,Nassau,2908000,000511,NYU Langone Hospital-Long Island,0 to 17,117,F,White,Not Span/Hispanic,3,Emergency,Psychiatric Hospital or Unit of Hosp,2019,MBD012,SUICIDAL IDEATION/ATTEMPT/INTENTIONAL SELF-HARM,,,756,ACUTE ANXIETY & DELIRIUM STATES,19,MENTAL DISEASES AND DISORDERS,3,Major,Minor,Medical,Private Health Insurance,,,,,true,26293.29,3284.43
