Hospital Service Area,Hospital County,Operating Certificate Number,Permanent Facility Id,Facility Name,Age Group,Zip Code - 3 digits,Gender,Race,Ethnicity,Length of Stay,Type of Admission,Patient Disposition,Discharge Year,CCS Diagnosis Code,CCS Diagnosis Description,CCS Procedure Code,CCS Procedure Description,APR DRG Code,APR DRG Description,APR MDC Code,APR MDC Description,APR Severity of Illness Code,APR Severity of Illness Description,APR Risk of Mortality,APR Medical Surgical Description,Payment Typology 1,Payment Typology 2,Payment Typology 3,Birth Weight,Abortion Edit Indicator,Emergency Department Indicator,Total Charges,Total Costs
Long Island,Suffolk,5123000,000885,Long Island Community Hospital,30 to 49,117,F,White,Not Span/Hispanic,10,Emergency,Home or Self Care,2019,SYM015,GENERAL SENSATION/PERCEPTION SIGNS AND SYMPTOMS,MHT001,PHARMACOTHERAPY FOR MENTAL HEALTH (EXCLUDING SUBSTANCE USE),756,ACUTE ANXIETY & DELIRIUM STATES,19,MENTAL DISEASES AND DISORDERS,2,Moderate,Minor,Medical,Medicare,Medicare,Medicaid,,,true,53785.45,12790.8
Long Island,Suffolk,5123000,000885,Long Island Community Hospital,30 to 49,117,M,Other Race,Not Span/Hispanic,9,Emergency,Home or Self Care,2019,MBD005,ANXIETY AND FEAR-RELATED DISORDERS,,,756,ACUTE ANXIETY & DELIRIUM STATES,19,MENTAL DISEASES AND DISORDERS,2,Moderate,Minor,Medical,Private Health Insurance,,,,,true,37340.79,8241.65
Long Island,Suffolk,5123000,000885,Long Island Community Hospital,30 to 49,117,M,Black/African American,Not Span/Hispanic,1,Emergency,Left Against Medical Advice,2019,MBD007,TRAUMA- AND STRESSOR-RELATED DISORDERS,,,756,ACUTE ANXIETY & DELIRIUM STATES,19,MENTAL DISEASES AND DISORDERS,3,Major,Minor,Medical,Medicaid,,,,,true,79206.28,6690.19
Long Island,Suffolk,5123000,000885,Long Island Community Hospital,18 to 29,117,F,White,Not Span/Hispanic,2,Emergency,Home or Self Care,2019,MBD007,TRAUMA- AND STRESSOR-RELATED DISORDERS,,,756,ACUTE ANXIETY & DELIRIUM STATES,19,MENTAL DISEASES AND DISORDERS,1,Minor,Minor,Medical,Medicaid,,,,,true,35518.99,6201.21
Long Island,Suffolk,5123000,000885,Long Island Community Hospital,18 to 29,119,F,White,Not Span/Hispanic,2,Emergency,Short-term Hospital,2019,MBD005,ANXIETY AND FEAR-RELATED DISORDERS,,,756,ACUTE ANXIETY & DELIRIUM STATES,19,MENTAL DISEASES AND DISORDERS,1,Minor,Minor,Medical,Private Health Insurance,,,,,true,12320.24,2218.54
Long Island,Suffolk,5123000,000885,Long Island Community Hospital,30 to 49,119,M,Black/African American,Not Span/Hispanic,4,Emergency,Court/Law Enforcement,2019,MBD007,TRAUMA- AND STRESSOR-RELATED DISORDERS,,,756,ACUTE ANXIETY & DELIRIUM STATES,19,MENTAL DISEASES AND DISORDERS,2,Moderate,Minor,Medical,Medicaid,Medicaid,,,,true,47199.76,8855.66
Long Island,Suffolk,5123000,000885,Long Island Community Hospital,18 to 29,119,F,White,Not Span/Hispanic,10,Emergency,Home or Self Care,2019,MBD005,ANXIETY AND FEAR-RELATED DISORDERS,,,756,ACUTE ANXIETY & DELIRIUM STATES,19,MENTAL DISEASES AND DISORDERS,1,Minor,Minor,Medical,Private Health Insurance,,,,,true,40347.49,9051.17
Long Island,Suffolk,5123000,000885,Long Island Community Hospital,18 to 29,119,M,White,Not Span/Hispanic,10,Emergency,Home or Self Care,2019,MBD005,ANXIETY AND FEAR-RELATED DISORDERS,,,756,ACUTE ANXIETY & DELIRIUM STATES,19,MENTAL DISEASES AND DISORDERS,1,Minor,Minor,Medical,Private Health Insurance,,,,,true,46190.99,9883.24
Long Island,Suffolk,5123000,000885,Long Island Community Hospital,50 to 69,119,F,White,Not Span/Hispanic,10,Emergency,Home or Self Care,2019,MBD005,ANXIETY AND FEAR-RELATED DISORDERS,SUD002,PHARMACOTHERAPY FOR SUBSTANCE USE,756,ACUTE ANXIETY & DELIRIUM STATES,19,MENTAL DISEASES AND DISORDERS,1,Minor,Minor,Medical,Medicare,Medicare,Medicaid,,,false,34715.34,8407.84
