Hospital Service Area,Hospital County,Operating Certificate Number,Permanent Facility Id,Facility Name,Age Group,Zip Code - 3 digits,Gender,Race,Ethnicity,Length of Stay,Type of Admission,Patient Disposition,Discharge Year,CCS Diagnosis Code,CCS Diagnosis Description,CCS Procedure Code,CCS Procedure Description,APR DRG Code,APR DRG Description,APR MDC Code,APR MDC Description,APR Severity of Illness Code,APR Severity of Illness Description,APR Risk of Mortality,APR Medical Surgical Description,Payment Typology 1,Payment Typology 2,Payment Typology 3,Birth Weight,Abortion Edit Indicator,Emergency Department Indicator,Total Charges,Total Costs
New York City,Kings,7002053,001304,NYU Langone Hospital-Brooklyn,30 to 49,103,M,White,Not Span/Hispanic,6,Emergency,Home or Self Care,2020,MBD005,ANXIETY AND FEAR-RELATED DISORDERS,MHT002,PSYCHOTHERAPY FOR MENTAL HEALTH (EXCLUDING SUBSTANCE USE),756,ACUTE ANXIETY & DELIRIUM STATES,19,MENTAL DISEASES AND DISORDERS,2,Moderate,Minor,Medical,Medicaid,,,,,Y,43147.09,16473.39
New York City,Kings,7002053,001304,NYU Langone Hospital-Brooklyn,50 to 69,112,M,White,Not Span/Hispanic,1,Emergency,Psychiatric Hospital or Unit of Hosp,2020,MBD007,TRAUMA- AND STRESSOR-RELATED DISORDERS,,,756,ACUTE ANXIETY & DELIRIUM STATES,19,MENTAL DISEASES AND DISORDERS,2,Moderate,Minor,Medical,Medicaid,,,,,Y,43353.94,6862.36
New York City,Kings,7002053,001304,NYU Langone Hospital-Brooklyn,18 to 29,113,F,White,Not Span/Hispanic,2,Emergency,Home or Self Care,2020,MBD007,TRAUMA- AND STRESSOR-RELATED DISORDERS,MAM011,ELECTROENCEPHALOGRAM (EEG),756,ACUTE ANXIETY & DELIRIUM STATES,19,MENTAL DISEASES AND DISORDERS,1,Minor,Minor,Medical,Private Health Insurance,,,,,Y,100016.88,20821.02
New York City,Kings,7002053,001304,NYU Langone Hospital-Brooklyn,30 to 49,,F,White,Not Span/Hispanic,2,Urgent,Home or Self Care,2020,MBD007,TRAUMA- AND STRESSOR-RELATED DISORDERS,MAM011,ELECTROENCEPHALOGRAM (EEG),756,ACUTE ANXIETY & DELIRIUM STATES,19,MENTAL DISEASES AND DISORDERS,2,Moderate,Minor,Medical,Medicaid,,,,,N,64081.05,13372.33
New York City,Kings,7002053,001304,NYU Langone Hospital-Brooklyn,30 to 49,112,M,White,Unknown,2,Emergency,Home or Self Care,2020,MBD007,TRAUMA- AND STRESSOR-RELATED DISORDERS,MAM011,ELECTROENCEPHALOGRAM (EEG),756,ACUTE ANXIETY & DELIRIUM STATES,19,MENTAL DISEASES AND DISORDERS,2,Moderate,Minor,Medical,Private Health Insurance,,,,,Y,107285.13,18572.51
New York City,Kings,7002053,001304,NYU Langone Hospital-Brooklyn,30 to 49,112,M,Other Race,Spanish/Hispanic,7,Emergency,Home or Self Care,2020,MBD005,ANXIETY AND FEAR-RELATED DISORDERS,,,756,ACUTE ANXIETY & DELIRIUM STATES,19,MENTAL DISEASES AND DISORDERS,2,Moderate,Minor,Medical,Medicaid,,,,,Y,44251.24,18786.39
New York City,Kings,7002053,001304,NYU Langone Hospital-Brooklyn,18 to 29,112,F,White,Not Span/Hispanic,1,Emergency,Home or Self Care,2020,MBD005,ANXIETY AND FEAR-RELATED DISORDERS,,,756,ACUTE ANXIETY & DELIRIUM STATES,19,MENTAL DISEASES AND DISORDERS,1,Minor,Minor,Medical,Blue Cross/Blue Shield,,,,,Y,13461.01,3665.05
New York City,Kings,7002053,001304,NYU Langone Hospital-Brooklyn,30 to 49,112,M,Other Race,Not Span/Hispanic,2,Emergency,Home or Self Care,2020,MBD007,TRAUMA- AND STRESSOR-RELATED DISORDERS,MAM011,ELECTROENCEPHALOGRAM (EEG),756,ACUTE ANXIETY & DELIRIUM STATES,19,MENTAL DISEASES AND DISORDERS,2,Moderate,Minor,Medical,Private Health Insurance,,,,,Y,61241.07,14117.41
New York City,Kings,7002053,001304,NYU Langone Hospital-Brooklyn,30 to 49,103,M,Other Race,Spanish/Hispanic,1,Emergency,Home or Self Care,2020,MBD005,ANXIETY AND FEAR-RELATED DISORDERS,OTR004,ISOLATION PROCEDURES,756,ACUTE ANXIETY & DELIRIUM STATES,19,MENTAL DISEASES AND DISORDERS,1,Minor,Minor,Medical,Medicaid,,,,,Y,14300.66,4173.66
New York City,Kings,7002053,001304,NYU Langone Hospital-Brooklyn,30 to 49,100,F,Black/African American,Not Span/Hispanic,1,Emergency,Home or Self Care,2020,MBD005,ANXIETY AND FEAR-RELATED DISORDERS,NCM001,PLANAR NUCLEAR MEDICINE IMAGING,756,ACUTE ANXIETY & DELIRIUM STATES,19,MENTAL DISEASES AND DISORDERS,1,Minor,Minor,Medical,Private Health Insurance,,,,,Y,21688.74,5069.64
New York City,Kings,7002053,001304,NYU Langone Hospital-Brooklyn,30 to 49,OOS,F,Other Race,Not Span/Hispanic,1,Emergency,Home or Self Care,2020,MBD005,ANXIETY AND FEAR-RELATED DISORDERS,IMG005,MAGNETIC RESONANCE IMAGING (MRI),756,ACUTE ANXIETY & DELIRIUM STATES,19,MENTAL DISEASES AND DISORDERS,1,Minor,Minor,Medical,Blue Cross/Blue Shield,,,,,Y,45893.21,10605.53
New York City,Kings,7002053,001304,NYU Langone Hospital-Brooklyn,50 to 69,112,F,White,Not Span/Hispanic,9,Elective,Home or Self Care,2020,MBD007,TRAUMA- AND STRESSOR-RELATED DISORDERS,MAM011,ELECTROENCEPHALOGRAM (EEG),756,ACUTE ANXIETY & DELIRIUM STATES,19,MENTAL DISEASES AND DISORDERS,2,Moderate,Moderate,Medical,Medicare,Medicaid,,,,N,291834.29,62532.82
New York City,Kings,7002053,001304,NYU Langone Hospital-Brooklyn,18 to 29,112,F,White,Not Span/Hispanic,1,Emergency,Home or Self Care,2020,MBD007,TRAUMA- AND STRESSOR-RELATED DISORDERS,ADM005,ADMINISTRATION OF THROMBOLYTICS AND PLATELET INHIBITORS,756,ACUTE ANXIETY & DELIRIUM STATES,19,MENTAL DISEASES AND DISORDERS,2,Moderate,Minor,Medical,Private Health Insurance,,,,,Y,96640.34,10622.52
New York City,Kings,7002053,001304,NYU Langone Hospital-Brooklyn,18 to 29,103,M,Other Race,Spanish/Hispanic,3,Elective,Home or Self Care,2020,MBD007,TRAUMA- AND STRESSOR-RELATED DISORDERS,MAM011,ELECTROENCEPHALOGRAM (EEG),756,ACUTE ANXIETY & DELIRIUM STATES,19,MENTAL DISEASES AND DISORDERS,1,Minor,Minor,Medical,Medicaid,,,,,N,102005.73,21084.89
New York City,Kings,7002053,001304,NYU Langone Hospital-Brooklyn,30 to 49,112,F,White,Not Span/Hispanic,2,Emergency,Home or Self Care,2020,MBD007,TRAUMA- AND STRESSOR-RELATED DISORDERS,MAM011,ELECTROENCEPHALOGRAM (EEG),756,ACUTE ANXIETY & DELIRIUM STATES,19,MENTAL DISEASES AND DISORDERS,2,Moderate,Moderate,Medical,Medicaid,,,,,Y,80278.33,15349.68
New York City,Kings,7002053,001304,NYU Langone Hospital-Brooklyn,70 or Older,112,M,White,Spanish/Hispanic,4,Emergency,Skilled Nursing Home,2020,MBD007,TRAUMA- AND STRESSOR-RELATED DISORDERS,MAM011,ELECTROENCEPHALOGRAM (EEG),756,ACUTE ANXIETY & DELIRIUM STATES,19,MENTAL DISEASES AND DISORDERS,2,Moderate,Moderate,Medical,Medicare,Medicaid,,,,Y,153936.82,33579.56
New York City,Kings,7002053,001304,NYU Langone Hospital-Brooklyn,50 to 69,112,F,Other Race,Not Span/Hispanic,1,Emergency,Left Against Medical Advice,2020,MBD005,ANXIETY AND FEAR-RELATED DISORDERS,OTR004,ISOLATION PROCEDURES,756,ACUTE ANXIETY & DELIRIUM STATES,19,MENTAL DISEASES AND DISORDERS,1,Minor,Minor,Medical,Private Health Insurance,Medicare,Blue Cross/Blue Shield,,,Y,24109.92,6630.69
New York City,Kings,7002053,001304,NYU Langone Hospital-Brooklyn,50 to 69,112,F,White,Spanish/Hispanic,2,Emergency,Home w/ Home Health Services,2020,MBD007,TRAUMA- AND STRESSOR-RELATED DISORDERS,ADM005,ADMINISTRATION OF THROMBOLYTICS AND PLATELET INHIBITORS,756,ACUTE ANXIETY & DELIRIUM STATES,19,MENTAL DISEASES AND DISORDERS,1,Minor,Minor,Medical,Medicaid,,,,,Y,154692.8,19316.2
New York City,Kings,7002053,001304,NYU Langone Hospital-Brooklyn,50 to 69,112,M,Other Race,Not Span/Hispanic,6,Emergency,Home or Self Care,2020,NVS011,NEUROCOGNITIVE DISORDERS,ADM021,"ADMINISTRATION OF THERAPEUTIC SUBSTANCES, NEC",756,ACUTE ANXIETY & DELIRIUM STATES,19,MENTAL DISEASES AND DISORDERS,2,Moderate,Moderate,Medical,Private Health Insurance,,,,,Y,140083.94,31940.69
New York City,Kings,7002053,001304,NYU Langone Hospital-Brooklyn,70 or Older,112,F,Other Race,Spanish/Hispanic,3,Emergency,Home or Self Care,2020,MBD005,ANXIETY AND FEAR-RELATED DISORDERS,ADM021,"ADMINISTRATION OF THERAPEUTIC SUBSTANCES, NEC",756,ACUTE ANXIETY & DELIRIUM STATES,19,MENTAL DISEASES AND DISORDERS,1,Minor,Minor,Medical,Medicare,Medicaid,,,,Y,38077.1,14546.79
New York City,Kings,7002053,001304,NYU Langone Hospital-Brooklyn,50 to 69,112,F,White,Spanish/Hispanic,1,Emergency,Home or Self Care,2020,MBD005,ANXIETY AND FEAR-RELATED DISORDERS,OTR004,ISOLATION PROCEDURES,756,ACUTE ANXIETY & DELIRIUM STATES,19,MENTAL DISEASES AND DISORDERS,1,Minor,Minor,Medical,Medicaid,,,,,Y,22086.54,6186.46
New York City,Kings,7002053,001304,NYU Langone Hospital-Brooklyn,50 to 69,112,F,Multi-racial,Not Span/Hispanic,3,Emergency,Home or Self Care,2020,MBD005,ANXIETY AND FEAR-RELATED DISORDERS,MHT002,PSYCHOTHERAPY FOR MENTAL HEALTH (EXCLUDING SUBSTANCE USE),756,ACUTE ANXIETY & DELIRIUM STATES,19,MENTAL DISEASES AND DISORDERS,1,Minor,Minor,Medical,Private Health Insurance,,,,,Y,32653.08,12461.25
New York City,Kings,7002053,001304,NYU Langone Hospital-Brooklyn,30 to 49,103,F,Other Race,Unknown,2,Elective,Home or Self Care,2020,MBD007,TRAUMA- AND STRESSOR-RELATED DISORDERS,MAM011,ELECTROENCEPHALOGRAM (EEG),756,ACUTE ANXIETY & DELIRIUM STATES,19,MENTAL DISEASES AND DISORDERS,1,Minor,Minor,Medical,Private Health Insurance,,,,,N,67499.73,14033.47
New York City,Kings,7002053,001304,NYU Langone Hospital-Brooklyn,70 or Older,112,M,White,Not Span/Hispanic,1,Emergency,Home or Self Care,2020,MBD005,ANXIETY AND FEAR-RELATED DISORDERS,,,756,ACUTE ANXIETY & DELIRIUM STATES,19,MENTAL DISEASES AND DISORDERS,1,Minor,Minor,Medical,Medicare,,,,,Y,20117.04,5801.53
New York City,Kings,7002053,001304,NYU Langone Hospital-Brooklyn,50 to 69,112,F,Other Race,Not Span/Hispanic,3,Emergency,Home or Self Care,2020,MBD005,ANXIETY AND FEAR-RELATED DISORDERS,IMG005,MAGNETIC RESONANCE IMAGING (MRI),756,ACUTE ANXIETY & DELIRIUM STATES,19,MENTAL DISEASES AND DISORDERS,1,Minor,Major,Medical,Medicaid,,,,,Y,57166.32,18369.38
New York City,Kings,7002053,001304,NYU Langone Hospital-Brooklyn,30 to 49,112,F,Black/African American,Not Span/Hispanic,2,Emergency,Home or Self Care,2020,MBD007,TRAUMA- AND STRESSOR-RELATED DISORDERS,IMG008,ULTRASONOGRAPHY,756,ACUTE ANXIETY & DELIRIUM STATES,19,MENTAL DISEASES AND DISORDERS,1,Minor,Minor,Medical,Private Health Insurance,,,,,Y,46621.73,12185.39
New York City,Kings,7002053,001304,NYU Langone Hospital-Brooklyn,30 to 49,112,M,White,Not Span/Hispanic,2,Emergency,Psychiatric Hospital or Unit of Hosp,2020,MBD005,ANXIETY AND FEAR-RELATED DISORDERS,ADM021,"ADMINISTRATION OF THERAPEUTIC SUBSTANCES, NEC",756,ACUTE ANXIETY & DELIRIUM STATES,19,MENTAL DISEASES AND DISORDERS,1,Minor,Minor,Medical,Medicaid,,,,,Y,30535.07,10307.49
New York City,Kings,7002053,001304,NYU Langone Hospital-Brooklyn,18 to 29,112,M,Multi-racial,Not Span/Hispanic,3,Elective,Home or Self Care,2020,MBD007,TRAUMA- AND STRESSOR-RELATED DISORDERS,MAM011,ELECTROENCEPHALOGRAM (EEG),756,ACUTE ANXIETY & DELIRIUM STATES,19,MENTAL DISEASES AND DISORDERS,2,Moderate,Minor,Medical,Medicaid,,,,,N,121196.23,21590.1
New York City,Kings,7002053,001304,NYU Langone Hospital-Brooklyn,50 to 69,112,F,White,Spanish/Hispanic,2,Emergency,Home or Self Care,2020,MBD005,ANXIETY AND FEAR-RELATED DISORDERS,ADM021,"ADMINISTRATION OF THERAPEUTIC SUBSTANCES, NEC",756,ACUTE ANXIETY & DELIRIUM STATES,19,MENTAL DISEASES AND DISORDERS,1,Minor,Moderate,Medical,Medicare,,,,,Y,51027.31,12446.95
New York City,Kings,7002053,001304,NYU Langone Hospital-Brooklyn,30 to 49,112,F,Black/African American,Not Span/Hispanic,3,Elective,Home or Self Care,2020,MBD007,TRAUMA- AND STRESSOR-RELATED DISORDERS,MAM011,ELECTROENCEPHALOGRAM (EEG),756,ACUTE ANXIETY & DELIRIUM STATES,19,MENTAL DISEASES AND DISORDERS,2,Moderate,Minor,Medical,Medicaid,,,,,N,117578.09,21445.71
New York City,Kings,7002053,001304,NYU Langone Hospital-Brooklyn,30 to 49,112,F,Black/African American,Not Span/Hispanic,1,Emergency,Home or Self Care,2020,MBD005,ANXIETY AND FEAR-RELATED DISORDERS,IMG005,MAGNETIC RESONANCE IMAGING (MRI),756,ACUTE ANXIETY & DELIRIUM STATES,19,MENTAL DISEASES AND DISORDERS,1,Minor,Minor,Medical,Medicaid,,,,,Y,61223.85,9299.93
New York City,Kings,7002053,001304,NYU Langone Hospital-Brooklyn,50 to 69,112,F,Other Race,Not Span/Hispanic,2,Emergency,Home or Self Care,2020,MBD005,ANXIETY AND FEAR-RELATED DISORDERS,ADM021,"ADMINISTRATION OF THERAPEUTIC SUBSTANCES, NEC",756,ACUTE ANXIETY & DELIRIUM STATES,19,MENTAL DISEASES AND DISORDERS,1,Minor,Minor,Medical,Medicaid,,,,,Y,33437.2,10783.5
New York City,Kings,7002053,001304,NYU Langone Hospital-Brooklyn,70 or Older,112,M,White,Not Span/Hispanic,17,Emergency,Skilled Nursing Home,2020,MBD005,ANXIETY AND FEAR-RELATED DISORDERS,MAM011,ELECTROENCEPHALOGRAM (EEG),756,ACUTE ANXIETY & DELIRIUM STATES,19,MENTAL DISEASES AND DISORDERS,3,Major,Major,Medical,Medicare,Medicare,,,,Y,250281.99,81577.01
New York City,Kings,7002053,001304,NYU Langone Hospital-Brooklyn,18 to 29,112,M,Black/African American,Not Span/Hispanic,1,Emergency,Court/Law Enforcement,2020,MBD007,TRAUMA- AND STRESSOR-RELATED DISORDERS,ADM021,"ADMINISTRATION OF THERAPEUTIC SUBSTANCES, NEC",756,ACUTE ANXIETY & DELIRIUM STATES,19,MENTAL DISEASES AND DISORDERS,2,Moderate,Moderate,Medical,Private Health Insurance,Medicaid,,,,Y,25205.88,7980.81
New York City,Kings,7002053,001304,NYU Langone Hospital-Brooklyn,50 to 69,112,F,White,Unknown,2,Elective,Home w/ Home Health Services,2020,MBD007,TRAUMA- AND STRESSOR-RELATED DISORDERS,MAM011,ELECTROENCEPHALOGRAM (EEG),756,ACUTE ANXIETY & DELIRIUM STATES,19,MENTAL DISEASES AND DISORDERS,2,Moderate,Minor,Medical,Medicaid,,,,,N,80985.23,14644.45
