Hospital Service Area,Hospital County,Operating Certificate Number,Permanent Facility Id,Facility Name,Age Group,Zip Code - 3 digits,Gender,Race,Ethnicity,Length of Stay,Type of Admission,Patient Disposition,Discharge Year,CCS Diagnosis Code,CCS Diagnosis Description,CCS Procedure Code,CCS Procedure Description,APR DRG Code,APR DRG Description,APR MDC Code,APR MDC Description,APR Severity of Illness Code,APR Severity of Illness Description,APR Risk of Mortality,APR Medical Surgical Description,Payment Typology 1,Payment Typology 2,Payment Typology 3,Birth Weight,Abortion Edit Indicator,Emergency Department Indicator,Total Charges,Total Costs
Long Island,Suffolk,5123000,000885,Brookhaven Memorial Hospital Medical Center Inc,70 or Older,117,M,White,Not Span/Hispanic,120 +,Emergency,Skilled Nursing Home,2017,653,"Delirium, dementia, and amnestic and other cognitive disorders",048,CARDIAC PACEMAKER/DEFIB,757,Organic mental health disturbances,19,Mental Diseases and Disorders,3,Major,Extreme,Medical,Medicare,Medicare,Medicaid,,N,Y,978217.65,222148.91
Long Island,Suffolk,5123000,000885,Brookhaven Memorial Hospital Medical Center Inc,70 or Older,119,M,White,Not Span/Hispanic,16,Emergency,Home or Self Care,2017,653,"Delirium, dementia, and amnestic and other cognitive disorders",000,NO PROC,757,Organic mental health disturbances,19,Mental Diseases and Disorders,2,Moderate,Moderate,Medical,Medicare,Medicare,Private Health Insurance,,N,Y,99524.02,19672.66
Long Island,Suffolk,5123000,000885,Brookhaven Memorial Hospital Medical Center Inc,70 or Older,119,F,White,Not Span/Hispanic,5,Emergency,Skilled Nursing Home,2017,653,"Delirium, dementia, and amnestic and other cognitive disorders",000,NO PROC,757,Organic mental health disturbances,19,Mental Diseases and Disorders,1,Minor,Moderate,Medical,Medicare,Medicare,Private Health Insurance,,N,Y,38240.01,6932.67
Long Island,Suffolk,5123000,000885,Brookhaven Memorial Hospital Medical Center Inc,70 or Older,117,F,White,Not Span/Hispanic,3,Emergency,Skilled Nursing Home,2017,653,"Delirium, dementia, and amnestic and other cognitive disorders",000,NO PROC,757,Organic mental health disturbances,19,Mental Diseases and Disorders,1,Minor,Moderate,Medical,Medicare,Medicare,Private Health Insurance,,N,Y,21613.88,4077.60
Long Island,Suffolk,5123000,000885,Brookhaven Memorial Hospital Medical Center Inc,50 to 69,119,M,White,Not Span/Hispanic,1,Emergency,Left Against Medical Advice,2017,653,"Delirium, dementia, and amnestic and other cognitive disorders",000,NO PROC,757,Organic mental health disturbances,19,Mental Diseases and Disorders,1,Minor,Minor,Medical,Medicare,,,,N,Y,12486.50,2020.19
Long Island,Suffolk,5123000,000885,Brookhaven Memorial Hospital Medical Center Inc,70 or Older,117,F,White,Not Span/Hispanic,4,Emergency,Home or Self Care,2017,653,"Delirium, dementia, and amnestic and other cognitive disorders",000,NO PROC,757,Organic mental health disturbances,19,Mental Diseases and Disorders,2,Moderate,Moderate,Medical,Medicare,Medicare,Blue Cross/Blue Shield,,N,Y,35801.61,5779.31
Long Island,Suffolk,5123000,000885,Brookhaven Memorial Hospital Medical Center Inc,70 or Older,119,F,White,Not Span/Hispanic,5,Emergency,Skilled Nursing Home,2017,653,"Delirium, dementia, and amnestic and other cognitive disorders",199,ELECTROENCEPHALOGRAM,757,Organic mental health disturbances,19,Mental Diseases and Disorders,1,Minor,Minor,Medical,Medicare,Medicare,Private Health Insurance,,N,Y,36952.89,7071.31
Long Island,Suffolk,5123000,000885,Brookhaven Memorial Hospital Medical Center Inc,50 to 69,117,F,White,Not Span/Hispanic,3,Emergency,Home w/ Home Health Services,2017,653,"Delirium, dementia, and amnestic and other cognitive disorders",000,NO PROC,757,Organic mental health disturbances,19,Mental Diseases and Disorders,1,Minor,Moderate,Medical,Medicare,,,,N,Y,45525.32,5997.12
Long Island,Suffolk,5123000,000885,Brookhaven Memorial Hospital Medical Center Inc,50 to 69,117,F,Black/African American,Not Span/Hispanic,7,Emergency,Home w/ Home Health Services,2017,653,"Delirium, dementia, and amnestic and other cognitive disorders",219,ALCO/DRUG REHAB/DETOX,757,Organic mental health disturbances,19,Mental Diseases and Disorders,2,Moderate,Minor,Medical,Medicare,Medicaid,,,N,Y,70267.77,11182.99
Long Island,Suffolk,5123000,000885,Brookhaven Memorial Hospital Medical Center Inc,70 or Older,117,M,White,Not Span/Hispanic,9,Emergency,Skilled Nursing Home,2017,653,"Delirium, dementia, and amnestic and other cognitive disorders",000,NO PROC,757,Organic mental health disturbances,19,Mental Diseases and Disorders,1,Minor,Moderate,Medical,Medicare,Private Health Insurance,,,N,Y,55017.27,11185.68
Long Island,Suffolk,5123000,000885,Brookhaven Memorial Hospital Medical Center Inc,70 or Older,117,M,White,Not Span/Hispanic,6,Emergency,Home w/ Home Health Services,2017,653,"Delirium, dementia, and amnestic and other cognitive disorders",000,NO PROC,757,Organic mental health disturbances,19,Mental Diseases and Disorders,2,Moderate,Moderate,Medical,Medicare,,,,N,Y,37187.59,7675.32
Long Island,Suffolk,5123000,000885,Brookhaven Memorial Hospital Medical Center Inc,50 to 69,119,F,Other Race,Not Span/Hispanic,4,Emergency,Home w/ Home Health Services,2017,653,"Delirium, dementia, and amnestic and other cognitive disorders",000,NO PROC,757,Organic mental health disturbances,19,Mental Diseases and Disorders,1,Minor,Minor,Medical,Private Health Insurance,,,,N,Y,26059.42,5097.21
Long Island,Suffolk,5123000,000885,Brookhaven Memorial Hospital Medical Center Inc,70 or Older,119,F,White,Not Span/Hispanic,2,Emergency,Home w/ Home Health Services,2017,653,"Delirium, dementia, and amnestic and other cognitive disorders",000,NO PROC,757,Organic mental health disturbances,19,Mental Diseases and Disorders,3,Major,Major,Medical,Medicare,Medicare,Medicaid,,N,Y,37024.92,4496.53
Long Island,Suffolk,5123000,000885,Brookhaven Memorial Hospital Medical Center Inc,70 or Older,119,M,Black/African American,Not Span/Hispanic,4,Emergency,Skilled Nursing Home,2017,653,"Delirium, dementia, and amnestic and other cognitive disorders",000,NO PROC,757,Organic mental health disturbances,19,Mental Diseases and Disorders,2,Moderate,Moderate,Medical,Medicare,Medicare,,,N,Y,36390.68,5782.68
Long Island,Suffolk,5123000,000885,Brookhaven Memorial Hospital Medical Center Inc,50 to 69,119,F,Other Race,Not Span/Hispanic,19,Emergency,Home w/ Home Health Services,2017,653,"Delirium, dementia, and amnestic and other cognitive disorders",000,NO PROC,757,Organic mental health disturbances,19,Mental Diseases and Disorders,1,Minor,Minor,Medical,Private Health Insurance,,,,N,Y,102381.80,22550.75
Long Island,Suffolk,5123000,000885,Brookhaven Memorial Hospital Medical Center Inc,70 or Older,117,F,White,Not Span/Hispanic,15,Emergency,Skilled Nursing Home,2017,653,"Delirium, dementia, and amnestic and other cognitive disorders",000,NO PROC,757,Organic mental health disturbances,19,Mental Diseases and Disorders,2,Moderate,Minor,Medical,Medicare,Medicare,,,N,Y,84977.65,18190.72
Long Island,Suffolk,5123000,000885,Brookhaven Memorial Hospital Medical Center Inc,30 to 49,117,M,White,Not Span/Hispanic,4,Emergency,Home or Self Care,2017,655,"Disorders usually diagnosed in infancy, childhood, or adolescence",070,UP GASTRO ENDOSC/BIOPSY,757,Organic mental health disturbances,19,Mental Diseases and Disorders,2,Moderate,Minor,Medical,Medicaid,,,,N,Y,45938.20,7769.76
Long Island,Suffolk,5123000,000885,Brookhaven Memorial Hospital Medical Center Inc,70 or Older,117,M,White,Not Span/Hispanic,6,Emergency,Home w/ Home Health Services,2017,653,"Delirium, dementia, and amnestic and other cognitive disorders",000,NO PROC,757,Organic mental health disturbances,19,Mental Diseases and Disorders,2,Moderate,Moderate,Medical,Medicare,Private Health Insurance,,,N,Y,52582.64,8889.98
Long Island,Suffolk,5123000,000885,Brookhaven Memorial Hospital Medical Center Inc,50 to 69,119,M,White,Not Span/Hispanic,5,Emergency,Skilled Nursing Home,2017,653,"Delirium, dementia, and amnestic and other cognitive disorders",108,INDWELLING CATHETER,757,Organic mental health disturbances,19,Mental Diseases and Disorders,2,Moderate,Minor,Medical,Medicare,Medicare,Medicaid,,N,Y,38952.62,7333.23
Long Island,Suffolk,5123000,000885,Brookhaven Memorial Hospital Medical Center Inc,70 or Older,119,F,White,Not Span/Hispanic,5,Elective,Hospice - Home,2017,653,"Delirium, dementia, and amnestic and other cognitive disorders",000,NO PROC,757,Organic mental health disturbances,19,Mental Diseases and Disorders,1,Minor,Minor,Medical,Self-Pay,,,,N,N,20702.44,5321.04
Long Island,Suffolk,5123000,000885,Brookhaven Memorial Hospital Medical Center Inc,50 to 69,117,M,White,Not Span/Hispanic,4,Emergency,Skilled Nursing Home,2017,653,"Delirium, dementia, and amnestic and other cognitive disorders",198,MAG RESONANCE IMAGING,757,Organic mental health disturbances,19,Mental Diseases and Disorders,1,Minor,Minor,Medical,Medicare,Medicare,Blue Cross/Blue Shield,,N,Y,34670.48,5924.66
Long Island,Suffolk,5123000,000885,Brookhaven Memorial Hospital Medical Center Inc,70 or Older,119,F,White,Not Span/Hispanic,5,Emergency,Skilled Nursing Home,2017,653,"Delirium, dementia, and amnestic and other cognitive disorders",000,NO PROC,757,Organic mental health disturbances,19,Mental Diseases and Disorders,2,Moderate,Major,Medical,Medicare,Medicare,Medicaid,,N,Y,58540.23,8040.62
Long Island,Suffolk,5123000,000885,Brookhaven Memorial Hospital Medical Center Inc,70 or Older,117,M,White,Not Span/Hispanic,3,Emergency,Skilled Nursing Home,2017,653,"Delirium, dementia, and amnestic and other cognitive disorders",000,NO PROC,757,Organic mental health disturbances,19,Mental Diseases and Disorders,2,Moderate,Moderate,Medical,Medicare,Medicare,Medicaid,,N,Y,30341.65,4635.24
Long Island,Suffolk,5123000,000885,Brookhaven Memorial Hospital Medical Center Inc,70 or Older,119,F,White,Not Span/Hispanic,5,Elective,Hospice - Medical Facility,2017,653,"Delirium, dementia, and amnestic and other cognitive disorders",000,NO PROC,757,Organic mental health disturbances,19,Mental Diseases and Disorders,1,Minor,Minor,Medical,Self-Pay,,,,N,N,21787.13,5398.25
Long Island,Suffolk,5123000,000885,Brookhaven Memorial Hospital Medical Center Inc,50 to 69,119,F,Other Race,Not Span/Hispanic,4,Emergency,Home or Self Care,2017,653,"Delirium, dementia, and amnestic and other cognitive disorders",000,NO PROC,757,Organic mental health disturbances,19,Mental Diseases and Disorders,2,Moderate,Moderate,Medical,Private Health Insurance,,,,N,Y,35133.20,5921.83
Long Island,Suffolk,5123000,000885,Brookhaven Memorial Hospital Medical Center Inc,70 or Older,119,M,White,Not Span/Hispanic,3,Emergency,Skilled Nursing Home,2017,653,"Delirium, dementia, and amnestic and other cognitive disorders",000,NO PROC,757,Organic mental health disturbances,19,Mental Diseases and Disorders,2,Moderate,Moderate,Medical,Medicare,Medicare,Private Health Insurance,,N,Y,26732.97,4193.32
Long Island,Suffolk,5123000,000885,Brookhaven Memorial Hospital Medical Center Inc,70 or Older,119,M,White,Not Span/Hispanic,4,Emergency,Skilled Nursing Home,2017,653,"Delirium, dementia, and amnestic and other cognitive disorders",000,NO PROC,757,Organic mental health disturbances,19,Mental Diseases and Disorders,1,Minor,Moderate,Medical,Medicare,Medicare,Blue Cross/Blue Shield,,N,Y,22676.09,5052.53
Long Island,Suffolk,5123000,000885,Brookhaven Memorial Hospital Medical Center Inc,18 to 29,119,F,Black/African American,Not Span/Hispanic,4,Urgent,Short-term Hospital,2017,657,Mood disorders,000,NO PROC,757,Organic mental health disturbances,19,Mental Diseases and Disorders,3,Major,Moderate,Medical,Medicaid,,,,N,N,15324.32,3411.89
Long Island,Suffolk,5123000,000885,Brookhaven Memorial Hospital Medical Center Inc,50 to 69,117,F,White,Not Span/Hispanic,120 +,Emergency,Expired,2017,653,"Delirium, dementia, and amnestic and other cognitive disorders",004,DIAGNOSTIC SPINAL TAP,757,Organic mental health disturbances,19,Mental Diseases and Disorders,4,Extreme,Extreme,Medical,Medicare,Medicare,,,N,Y,1343696.18,308618.09
Long Island,Suffolk,5123000,000885,Brookhaven Memorial Hospital Medical Center Inc,70 or Older,117,F,White,Not Span/Hispanic,4,Emergency,Skilled Nursing Home,2017,653,"Delirium, dementia, and amnestic and other cognitive disorders",000,NO PROC,757,Organic mental health disturbances,19,Mental Diseases and Disorders,1,Minor,Minor,Medical,Medicare,Medicare,Medicaid,,N,Y,29359.70,5325.94
Long Island,Suffolk,5123000,000885,Brookhaven Memorial Hospital Medical Center Inc,50 to 69,117,M,White,Not Span/Hispanic,8,Emergency,Skilled Nursing Home,2017,653,"Delirium, dementia, and amnestic and other cognitive disorders",000,NO PROC,757,Organic mental health disturbances,19,Mental Diseases and Disorders,3,Major,Moderate,Medical,Medicare,Medicare,Medicaid,,N,Y,80410.55,13021.62
Long Island,Suffolk,5123000,000885,Brookhaven Memorial Hospital Medical Center Inc,70 or Older,117,F,White,Not Span/Hispanic,3,Emergency,Expired,2017,653,"Delirium, dementia, and amnestic and other cognitive disorders",000,NO PROC,757,Organic mental health disturbances,19,Mental Diseases and Disorders,3,Major,Major,Medical,Medicare,Medicare,Private Health Insurance,,N,Y,24992.21,4258.84
Long Island,Suffolk,5123000,000885,Brookhaven Memorial Hospital Medical Center Inc,50 to 69,117,F,White,Not Span/Hispanic,3,Emergency,Home or Self Care,2017,653,"Delirium, dementia, and amnestic and other cognitive disorders",000,NO PROC,757,Organic mental health disturbances,19,Mental Diseases and Disorders,2,Moderate,Moderate,Medical,Private Health Insurance,Medicare,Medicare,,N,Y,26476.88,4116.68
Long Island,Suffolk,5123000,000885,Brookhaven Memorial Hospital Medical Center Inc,70 or Older,117,F,White,Not Span/Hispanic,4,Emergency,Skilled Nursing Home,2017,653,"Delirium, dementia, and amnestic and other cognitive disorders",000,NO PROC,757,Organic mental health disturbances,19,Mental Diseases and Disorders,3,Major,Major,Medical,Medicare,Medicare,,,N,Y,27006.76,5601.74
Long Island,Suffolk,5123000,000885,Brookhaven Memorial Hospital Medical Center Inc,70 or Older,117,F,White,Not Span/Hispanic,4,Emergency,Skilled Nursing Home,2017,653,"Delirium, dementia, and amnestic and other cognitive disorders",000,NO PROC,757,Organic mental health disturbances,19,Mental Diseases and Disorders,1,Minor,Major,Medical,Medicare,Medicare,,,N,Y,28556.01,5433.34
Long Island,Suffolk,5123000,000885,Brookhaven Memorial Hospital Medical Center Inc,70 or Older,117,M,Other Race,Not Span/Hispanic,8,Emergency,Home w/ Home Health Services,2017,653,"Delirium, dementia, and amnestic and other cognitive disorders",000,NO PROC,757,Organic mental health disturbances,19,Mental Diseases and Disorders,3,Major,Major,Medical,Private Health Insurance,Medicaid,,,N,Y,60861.87,11369.97
Long Island,Suffolk,5123000,000885,Brookhaven Memorial Hospital Medical Center Inc,70 or Older,117,M,White,Not Span/Hispanic,28,Emergency,Skilled Nursing Home,2017,653,"Delirium, dementia, and amnestic and other cognitive disorders",000,NO PROC,757,Organic mental health disturbances,19,Mental Diseases and Disorders,1,Minor,Moderate,Medical,Medicare,Medicare,Medicaid,,N,Y,124955.00,31171.41
Long Island,Suffolk,5123000,000885,Brookhaven Memorial Hospital Medical Center Inc,18 to 29,119,M,White,Not Span/Hispanic,1,Emergency,Short-term Hospital,2017,657,Mood disorders,219,ALCO/DRUG REHAB/DETOX,757,Organic mental health disturbances,19,Mental Diseases and Disorders,3,Major,Minor,Medical,Medicaid,,,,N,Y,10590.28,1637.04
Long Island,Suffolk,5123000,000885,Brookhaven Memorial Hospital Medical Center Inc,50 to 69,117,F,White,Not Span/Hispanic,9,Emergency,Home or Self Care,2017,657,Mood disorders,219,ALCO/DRUG REHAB/DETOX,757,Organic mental health disturbances,19,Mental Diseases and Disorders,1,Minor,Minor,Medical,Private Health Insurance,,,,N,Y,36100.10,8232.94
