Hospital Service Area,Hospital County,Operating Certificate Number,Permanent Facility Id,Facility Name,Age Group,Zip Code - 3 digits,Gender,Race,Ethnicity,Length of Stay,Type of Admission,Patient Disposition,Discharge Year,CCS Diagnosis Code,CCS Diagnosis Description,CCS Procedure Code,CCS Procedure Description,APR DRG Code,APR DRG Description,APR MDC Code,APR MDC Description,APR Severity of Illness Code,APR Severity of Illness Description,APR Risk of Mortality,APR Medical Surgical Description,Payment Typology 1,Payment Typology 2,Payment Typology 3,Birth Weight,Abortion Edit Indicator,Emergency Department Indicator,Total Charges,Total Costs
Hudson Valley,Westchester,5907001,001099,SJRH - Park Care Pavilion,50 to 69,100,M,Other Race,Not Span/Hispanic,2,Emergency,Left Against Medical Advice,2018,MBD017,ALCOHOL-RELATED DISORDERS,SUD001,SUBSTANCE USE DETOXIFICATION,770,"DRUG & ALCOHOL ABUSE OR DEPENDENCE, LEFT AGAINST MEDICAL ADVICE",20,ALCOHOL/DRUG USE AND ALCOHOL/DRUG INDUCED ORGANIC MENTAL DISORDERS,1,Minor,Minor,Medical,Medicaid,,,,,false,4885.5,1555.26
Hudson Valley,Westchester,5907001,001099,SJRH - Park Care Pavilion,50 to 69,100,M,Other Race,Not Span/Hispanic,2,Emergency,Left Against Medical Advice,2018,MBD017,ALCOHOL-RELATED DISORDERS,SUD004,COUNSELING FOR SUBSTANCE USE,770,"DRUG & ALCOHOL ABUSE OR DEPENDENCE, LEFT AGAINST MEDICAL ADVICE",20,ALCOHOL/DRUG USE AND ALCOHOL/DRUG INDUCED ORGANIC MENTAL DISORDERS,2,Moderate,Minor,Medical,Medicaid,,,,,false,4602.27,1212.9
Hudson Valley,Westchester,5907001,001099,SJRH - Park Care Pavilion,50 to 69,100,M,Black/African American,Not Span/Hispanic,2,Emergency,Left Against Medical Advice,2018,MBD017,ALCOHOL-RELATED DISORDERS,SUD001,SUBSTANCE USE DETOXIFICATION,770,"DRUG & ALCOHOL ABUSE OR DEPENDENCE, LEFT AGAINST MEDICAL ADVICE",20,ALCOHOL/DRUG USE AND ALCOHOL/DRUG INDUCED ORGANIC MENTAL DISORDERS,2,Moderate,Minor,Medical,Medicaid,,,,,false,4279.51,1393.08
Hudson Valley,Westchester,5907001,001099,SJRH - Park Care Pavilion,30 to 49,104,F,Black/African American,Not Span/Hispanic,13,Emergency,Left Against Medical Advice,2018,MBD021,STIMULANT-RELATED DISORDERS,SUD004,COUNSELING FOR SUBSTANCE USE,770,"DRUG & ALCOHOL ABUSE OR DEPENDENCE, LEFT AGAINST MEDICAL ADVICE",20,ALCOHOL/DRUG USE AND ALCOHOL/DRUG INDUCED ORGANIC MENTAL DISORDERS,1,Minor,Minor,Medical,Medicaid,,,,,false,25009.76,6998.91
Hudson Valley,Dutchess,5957001,000180,Mid-Hudson Valley Division of Westchester Medical Center,18 to 29,125,F,White,Not Span/Hispanic,2,Emergency,Left Against Medical Advice,2018,MBD018,OPIOID-RELATED DISORDERS,SUD001,SUBSTANCE USE DETOXIFICATION,770,"DRUG & ALCOHOL ABUSE OR DEPENDENCE, LEFT AGAINST MEDICAL ADVICE",20,ALCOHOL/DRUG USE AND ALCOHOL/DRUG INDUCED ORGANIC MENTAL DISORDERS,1,Minor,Minor,Medical,Medicaid,,,,,true,16306.39,2643.38
Long Island,Nassau,2950002,000528,Nassau University Medical Center,30 to 49,117,M,White,Not Span/Hispanic,1,Emergency,Left Against Medical Advice,2018,MBD018,OPIOID-RELATED DISORDERS,SUD001,SUBSTANCE USE DETOXIFICATION,770,"DRUG & ALCOHOL ABUSE OR DEPENDENCE, LEFT AGAINST MEDICAL ADVICE",20,ALCOHOL/DRUG USE AND ALCOHOL/DRUG INDUCED ORGANIC MENTAL DISORDERS,1,Minor,Minor,Medical,Medicaid,Self-Pay,,,,false,6036.69,1330.03
Long Island,Nassau,2950002,000528,Nassau University Medical Center,18 to 29,117,F,White,Not Span/Hispanic,4,Emergency,Left Against Medical Advice,2018,MBD018,OPIOID-RELATED DISORDERS,SUD001,SUBSTANCE USE DETOXIFICATION,770,"DRUG & ALCOHOL ABUSE OR DEPENDENCE, LEFT AGAINST MEDICAL ADVICE",20,ALCOHOL/DRUG USE AND ALCOHOL/DRUG INDUCED ORGANIC MENTAL DISORDERS,1,Minor,Minor,Medical,Medicaid,Self-Pay,,,,false,17575.67,4314.54
New York City,Queens,7003001,001628,Flushing Hospital Medical Center,18 to 29,113,F,White,Not Span/Hispanic,4,Emergency,Left Against Medical Advice,2018,MBD017,ALCOHOL-RELATED DISORDERS,SUD001,SUBSTANCE USE DETOXIFICATION,770,"DRUG & ALCOHOL ABUSE OR DEPENDENCE, LEFT AGAINST MEDICAL ADVICE",20,ALCOHOL/DRUG USE AND ALCOHOL/DRUG INDUCED ORGANIC MENTAL DISORDERS,1,Minor,Minor,Medical,Medicaid,,,,,true,10830,3126.71
New York City,Bronx,7000001,001164,BronxCare Hospital Center,30 to 49,104,M,Other Race,Spanish/Hispanic,3,Elective,Left Against Medical Advice,2018,MBD017,ALCOHOL-RELATED DISORDERS,SUD001,SUBSTANCE USE DETOXIFICATION,770,"DRUG & ALCOHOL ABUSE OR DEPENDENCE, LEFT AGAINST MEDICAL ADVICE",20,ALCOHOL/DRUG USE AND ALCOHOL/DRUG INDUCED ORGANIC MENTAL DISORDERS,2,Moderate,Minor,Medical,Medicaid,,,,,false,6079.63,4728.47
Hudson Valley,Westchester,5907001,001099,SJRH - Park Care Pavilion,30 to 49,104,M,White,Spanish/Hispanic,4,Emergency,Left Against Medical Advice,2018,MBD018,OPIOID-RELATED DISORDERS,SUD001,SUBSTANCE USE DETOXIFICATION,770,"DRUG & ALCOHOL ABUSE OR DEPENDENCE, LEFT AGAINST MEDICAL ADVICE",20,ALCOHOL/DRUG USE AND ALCOHOL/DRUG INDUCED ORGANIC MENTAL DISORDERS,3,Major,Moderate,Medical,Medicaid,,,,,false,8414.78,2792.44
Hudson Valley,Westchester,5907001,001099,SJRH - Park Care Pavilion,18 to 29,100,M,Black/African American,Not Span/Hispanic,6,Emergency,Left Against Medical Advice,2018,MBD017,ALCOHOL-RELATED DISORDERS,SUD004,COUNSELING FOR SUBSTANCE USE,770,"DRUG & ALCOHOL ABUSE OR DEPENDENCE, LEFT AGAINST MEDICAL ADVICE",20,ALCOHOL/DRUG USE AND ALCOHOL/DRUG INDUCED ORGANIC MENTAL DISORDERS,1,Minor,Minor,Medical,Medicaid,,,,,false,11863.52,3215.16
Hudson Valley,Westchester,5907001,001099,SJRH - Park Care Pavilion,50 to 69,107,M,White,Spanish/Hispanic,1,Emergency,Left Against Medical Advice,2018,MBD017,ALCOHOL-RELATED DISORDERS,SUD001,SUBSTANCE USE DETOXIFICATION,770,"DRUG & ALCOHOL ABUSE OR DEPENDENCE, LEFT AGAINST MEDICAL ADVICE",20,ALCOHOL/DRUG USE AND ALCOHOL/DRUG INDUCED ORGANIC MENTAL DISORDERS,2,Moderate,Minor,Medical,Medicaid,,,,,false,3209.57,829.22
Hudson Valley,Westchester,5907001,001099,SJRH - Park Care Pavilion,18 to 29,104,M,Other Race,Not Span/Hispanic,3,Emergency,Left Against Medical Advice,2018,MBD018,OPIOID-RELATED DISORDERS,SUD001,SUBSTANCE USE DETOXIFICATION,770,"DRUG & ALCOHOL ABUSE OR DEPENDENCE, LEFT AGAINST MEDICAL ADVICE",20,ALCOHOL/DRUG USE AND ALCOHOL/DRUG INDUCED ORGANIC MENTAL DISORDERS,2,Moderate,Minor,Medical,Medicaid,,,,,false,6496.07,2084.54
New York City,Richmond,7004003,001737,Staten Island University Hospital Prince's Bay,50 to 69,103,M,White,Not Span/Hispanic,1,Emergency,Left Against Medical Advice,2018,MBD017,ALCOHOL-RELATED DISORDERS,,,770,"DRUG & ALCOHOL ABUSE OR DEPENDENCE, LEFT AGAINST MEDICAL ADVICE",20,ALCOHOL/DRUG USE AND ALCOHOL/DRUG INDUCED ORGANIC MENTAL DISORDERS,2,Moderate,Minor,Medical,Medicare,Medicare,,,,true,14183.1,3340.5
Hudson Valley,Westchester,5907001,001099,SJRH - Park Care Pavilion,30 to 49,100,M,White,Spanish/Hispanic,3,Emergency,Left Against Medical Advice,2018,MBD018,OPIOID-RELATED DISORDERS,SUD001,SUBSTANCE USE DETOXIFICATION,770,"DRUG & ALCOHOL ABUSE OR DEPENDENCE, LEFT AGAINST MEDICAL ADVICE",20,ALCOHOL/DRUG USE AND ALCOHOL/DRUG INDUCED ORGANIC MENTAL DISORDERS,2,Moderate,Minor,Medical,Medicaid,,,,,false,6576.84,2093.1
Hudson Valley,Westchester,5907001,001099,SJRH - Park Care Pavilion,50 to 69,104,M,Black/African American,Not Span/Hispanic,4,Emergency,Left Against Medical Advice,2018,MBD018,OPIOID-RELATED DISORDERS,SUD001,SUBSTANCE USE DETOXIFICATION,770,"DRUG & ALCOHOL ABUSE OR DEPENDENCE, LEFT AGAINST MEDICAL ADVICE",20,ALCOHOL/DRUG USE AND ALCOHOL/DRUG INDUCED ORGANIC MENTAL DISORDERS,1,Minor,Minor,Medical,Medicaid,,,,,false,8568.27,2811.08
Western NY,Erie,1401005,000210,Erie County Medical Center,50 to 69,142,M,Black/African American,Not Span/Hispanic,6,Emergency,Left Against Medical Advice,2018,MBD017,ALCOHOL-RELATED DISORDERS,SUD001,SUBSTANCE USE DETOXIFICATION,770,"DRUG & ALCOHOL ABUSE OR DEPENDENCE, LEFT AGAINST MEDICAL ADVICE",20,ALCOHOL/DRUG USE AND ALCOHOL/DRUG INDUCED ORGANIC MENTAL DISORDERS,1,Minor,Minor,Medical,Federal/State/Local/VA,,,,,true,11019.31,7580.35
Western NY,Erie,1401005,000210,Erie County Medical Center,30 to 49,141,M,White,Not Span/Hispanic,1,Emergency,Left Against Medical Advice,2018,MBD018,OPIOID-RELATED DISORDERS,,,770,"DRUG & ALCOHOL ABUSE OR DEPENDENCE, LEFT AGAINST MEDICAL ADVICE",20,ALCOHOL/DRUG USE AND ALCOHOL/DRUG INDUCED ORGANIC MENTAL DISORDERS,1,Minor,Minor,Medical,Medicaid,Medicaid,,,,true,6173.33,2497.83
New York City,Kings,7001045,001692,Woodhull Medical & Mental Health Center,30 to 49,112,M,Other Race,Spanish/Hispanic,3,Emergency,Left Against Medical Advice,2018,MBD018,OPIOID-RELATED DISORDERS,SUD001,SUBSTANCE USE DETOXIFICATION,770,"DRUG & ALCOHOL ABUSE OR DEPENDENCE, LEFT AGAINST MEDICAL ADVICE",20,ALCOHOL/DRUG USE AND ALCOHOL/DRUG INDUCED ORGANIC MENTAL DISORDERS,1,Minor,Minor,Medical,Medicaid,,,,,false,5223.91,4078.74
New York City,Queens,7003001,001628,Flushing Hospital Medical Center,50 to 69,114,M,White,Not Span/Hispanic,3,Emergency,Left Against Medical Advice,2018,MBD017,ALCOHOL-RELATED DISORDERS,SUD001,SUBSTANCE USE DETOXIFICATION,770,"DRUG & ALCOHOL ABUSE OR DEPENDENCE, LEFT AGAINST MEDICAL ADVICE",20,ALCOHOL/DRUG USE AND ALCOHOL/DRUG INDUCED ORGANIC MENTAL DISORDERS,1,Minor,Minor,Medical,Blue Cross/Blue Shield,,,,,true,8392,2451.56
Capital/Adirond,Albany,0101004,000005,St. Peter's Hospital,30 to 49,120,F,White,Not Span/Hispanic,6,Emergency,Left Against Medical Advice,2018,MBD017,ALCOHOL-RELATED DISORDERS,SUD001,SUBSTANCE USE DETOXIFICATION,770,"DRUG & ALCOHOL ABUSE OR DEPENDENCE, LEFT AGAINST MEDICAL ADVICE",20,ALCOHOL/DRUG USE AND ALCOHOL/DRUG INDUCED ORGANIC MENTAL DISORDERS,4,Extreme,Moderate,Medical,Medicaid,Medicaid,,,,true,47515.6,17226.87
Western NY,Erie,1401005,000210,Erie County Medical Center,18 to 29,142,M,White,Not Span/Hispanic,4,Emergency,Left Against Medical Advice,2018,MBD018,OPIOID-RELATED DISORDERS,SUD001,SUBSTANCE USE DETOXIFICATION,770,"DRUG & ALCOHOL ABUSE OR DEPENDENCE, LEFT AGAINST MEDICAL ADVICE",20,ALCOHOL/DRUG USE AND ALCOHOL/DRUG INDUCED ORGANIC MENTAL DISORDERS,1,Minor,Minor,Medical,Federal/State/Local/VA,,,,,true,8633.68,5197.72
New York City,Bronx,7000014,001176,SBH Health System,50 to 69,104,M,Multi-racial,Not Span/Hispanic,2,Emergency,Left Against Medical Advice,2018,MBD018,OPIOID-RELATED DISORDERS,SUD001,SUBSTANCE USE DETOXIFICATION,770,"DRUG & ALCOHOL ABUSE OR DEPENDENCE, LEFT AGAINST MEDICAL ADVICE",20,ALCOHOL/DRUG USE AND ALCOHOL/DRUG INDUCED ORGANIC MENTAL DISORDERS,1,Minor,Minor,Medical,Medicaid,,,,,true,9278.03,3055.1
New York City,Richmond,7004003,001737,Staten Island University Hospital Prince's Bay,50 to 69,103,M,Black/African American,Not Span/Hispanic,4,Urgent,Left Against Medical Advice,2018,MBD025,OTHER SPECIFIED SUBSTANCE-RELATED DISORDERS,SUD001,SUBSTANCE USE DETOXIFICATION,770,"DRUG & ALCOHOL ABUSE OR DEPENDENCE, LEFT AGAINST MEDICAL ADVICE",20,ALCOHOL/DRUG USE AND ALCOHOL/DRUG INDUCED ORGANIC MENTAL DISORDERS,2,Moderate,Minor,Medical,Medicaid,,,,,false,13139.01,2711.66
Western NY,Erie,1401005,000210,Erie County Medical Center,30 to 49,142,F,White,Not Span/Hispanic,3,Emergency,Left Against Medical Advice,2018,MBD020,SEDATIVE-RELATED DISORDERS,,,770,"DRUG & ALCOHOL ABUSE OR DEPENDENCE, LEFT AGAINST MEDICAL ADVICE",20,ALCOHOL/DRUG USE AND ALCOHOL/DRUG INDUCED ORGANIC MENTAL DISORDERS,1,Minor,Minor,Medical,Medicaid,Medicaid,Medicaid,,,true,16657.02,6485.15
Long Island,Nassau,2908000,000511,NYU Langone Hospital-Long Island,50 to 69,115,M,White,Not Span/Hispanic,2,Emergency,Left Against Medical Advice,2018,MBD017,ALCOHOL-RELATED DISORDERS,,,770,"DRUG & ALCOHOL ABUSE OR DEPENDENCE, LEFT AGAINST MEDICAL ADVICE",20,ALCOHOL/DRUG USE AND ALCOHOL/DRUG INDUCED ORGANIC MENTAL DISORDERS,2,Moderate,Moderate,Medical,Medicaid,Medicaid,,,,true,44467.73,8398.76
New York City,Bronx,7000014,001176,SBH Health System,50 to 69,104,M,Black/African American,Spanish/Hispanic,3,Emergency,Left Against Medical Advice,2018,MBD018,OPIOID-RELATED DISORDERS,SUD001,SUBSTANCE USE DETOXIFICATION,770,"DRUG & ALCOHOL ABUSE OR DEPENDENCE, LEFT AGAINST MEDICAL ADVICE",20,ALCOHOL/DRUG USE AND ALCOHOL/DRUG INDUCED ORGANIC MENTAL DISORDERS,1,Minor,Minor,Medical,Medicaid,,,,,true,13252.23,4241.03
Western NY,Erie,1401005,000210,Erie County Medical Center,30 to 49,142,F,Black/African American,Not Span/Hispanic,12,Elective,Left Against Medical Advice,2018,MBD021,STIMULANT-RELATED DISORDERS,,,770,"DRUG & ALCOHOL ABUSE OR DEPENDENCE, LEFT AGAINST MEDICAL ADVICE",20,ALCOHOL/DRUG USE AND ALCOHOL/DRUG INDUCED ORGANIC MENTAL DISORDERS,2,Moderate,Minor,Medical,Medicare,Medicaid,,,,false,12052.32,10140.89
New York City,Kings,7001046,001309,Interfaith Medical Center,30 to 49,114,M,Other Race,Spanish/Hispanic,1,Urgent,Left Against Medical Advice,2018,MBD017,ALCOHOL-RELATED DISORDERS,SUD004,COUNSELING FOR SUBSTANCE USE,770,"DRUG & ALCOHOL ABUSE OR DEPENDENCE, LEFT AGAINST MEDICAL ADVICE",20,ALCOHOL/DRUG USE AND ALCOHOL/DRUG INDUCED ORGANIC MENTAL DISORDERS,2,Moderate,Minor,Medical,Medicaid,,,,,false,3692.64,1469.4
New York City,Kings,7001046,001309,Interfaith Medical Center,30 to 49,112,M,White,Not Span/Hispanic,3,Emergency,Left Against Medical Advice,2018,MBD018,OPIOID-RELATED DISORDERS,SUD001,SUBSTANCE USE DETOXIFICATION,770,"DRUG & ALCOHOL ABUSE OR DEPENDENCE, LEFT AGAINST MEDICAL ADVICE",20,ALCOHOL/DRUG USE AND ALCOHOL/DRUG INDUCED ORGANIC MENTAL DISORDERS,1,Minor,Minor,Medical,Medicaid,Medicaid,,,,false,12972.75,4708.97
New York City,Bronx,7000006,003058,Montefiore Med Center - Jack D Weiler Hosp of A Einstein College Div,50 to 69,104,M,White,Spanish/Hispanic,1,Emergency,Left Against Medical Advice,2018,MBD017,ALCOHOL-RELATED DISORDERS,ADM021,"ADMINISTRATION OF THERAPEUTIC SUBSTANCES, NEC",770,"DRUG & ALCOHOL ABUSE OR DEPENDENCE, LEFT AGAINST MEDICAL ADVICE",20,ALCOHOL/DRUG USE AND ALCOHOL/DRUG INDUCED ORGANIC MENTAL DISORDERS,1,Minor,Minor,Medical,Medicare,,,,,true,18159.72,2575.27
Hudson Valley,Dutchess,5957001,000180,Mid-Hudson Valley Division of Westchester Medical Center,18 to 29,124,F,White,Not Span/Hispanic,2,Emergency,Left Against Medical Advice,2018,MBD018,OPIOID-RELATED DISORDERS,SUD001,SUBSTANCE USE DETOXIFICATION,770,"DRUG & ALCOHOL ABUSE OR DEPENDENCE, LEFT AGAINST MEDICAL ADVICE",20,ALCOHOL/DRUG USE AND ALCOHOL/DRUG INDUCED ORGANIC MENTAL DISORDERS,1,Minor,Minor,Medical,Medicaid,,,,,true,17728.48,2881.21
Hudson Valley,Dutchess,5957001,000180,Mid-Hudson Valley Division of Westchester Medical Center,18 to 29,125,F,White,Not Span/Hispanic,1,Emergency,Left Against Medical Advice,2018,MBD018,OPIOID-RELATED DISORDERS,SUD001,SUBSTANCE USE DETOXIFICATION,770,"DRUG & ALCOHOL ABUSE OR DEPENDENCE, LEFT AGAINST MEDICAL ADVICE",20,ALCOHOL/DRUG USE AND ALCOHOL/DRUG INDUCED ORGANIC MENTAL DISORDERS,1,Minor,Minor,Medical,Blue Cross/Blue Shield,,,,,true,17988.33,2468.26
Hudson Valley,Dutchess,5957001,000180,Mid-Hudson Valley Division of Westchester Medical Center,30 to 49,124,M,White,Not Span/Hispanic,2,Emergency,Left Against Medical Advice,2018,MBD018,OPIOID-RELATED DISORDERS,SUD001,SUBSTANCE USE DETOXIFICATION,770,"DRUG & ALCOHOL ABUSE OR DEPENDENCE, LEFT AGAINST MEDICAL ADVICE",20,ALCOHOL/DRUG USE AND ALCOHOL/DRUG INDUCED ORGANIC MENTAL DISORDERS,2,Moderate,Minor,Medical,Medicaid,,,,,true,18068.18,2930.41
New York City,Kings,7001009,001294,Coney Island Hospital,30 to 49,112,M,White,Not Span/Hispanic,1,Emergency,Left Against Medical Advice,2018,MBD017,ALCOHOL-RELATED DISORDERS,SUD001,SUBSTANCE USE DETOXIFICATION,770,"DRUG & ALCOHOL ABUSE OR DEPENDENCE, LEFT AGAINST MEDICAL ADVICE",20,ALCOHOL/DRUG USE AND ALCOHOL/DRUG INDUCED ORGANIC MENTAL DISORDERS,1,Minor,Minor,Medical,Medicaid,Medicaid,,,,false,1548.39,866.68
Western NY,Erie,1401005,000210,Erie County Medical Center,18 to 29,142,F,White,Not Span/Hispanic,5,Emergency,Left Against Medical Advice,2018,MBD018,OPIOID-RELATED DISORDERS,IMG008,ULTRASONOGRAPHY,770,"DRUG & ALCOHOL ABUSE OR DEPENDENCE, LEFT AGAINST MEDICAL ADVICE",20,ALCOHOL/DRUG USE AND ALCOHOL/DRUG INDUCED ORGANIC MENTAL DISORDERS,2,Moderate,Minor,Medical,Medicaid,Medicaid,,,,true,14201.48,7684.72
Western NY,Erie,1401005,000210,Erie County Medical Center,30 to 49,142,F,Black/African American,Not Span/Hispanic,1,Emergency,Left Against Medical Advice,2018,MBD017,ALCOHOL-RELATED DISORDERS,SUD001,SUBSTANCE USE DETOXIFICATION,770,"DRUG & ALCOHOL ABUSE OR DEPENDENCE, LEFT AGAINST MEDICAL ADVICE",20,ALCOHOL/DRUG USE AND ALCOHOL/DRUG INDUCED ORGANIC MENTAL DISORDERS,2,Moderate,Minor,Medical,Medicaid,,,,,true,5729.7,2248.65
Capital/Adirond,Rensselaer,4102003,000755,Samaritan Hospital - St. Mary's Campus,30 to 49,122,M,Black/African American,Not Span/Hispanic,2,Urgent,Left Against Medical Advice,2018,MBD021,STIMULANT-RELATED DISORDERS,SUD004,COUNSELING FOR SUBSTANCE USE,770,"DRUG & ALCOHOL ABUSE OR DEPENDENCE, LEFT AGAINST MEDICAL ADVICE",20,ALCOHOL/DRUG USE AND ALCOHOL/DRUG INDUCED ORGANIC MENTAL DISORDERS,2,Moderate,Minor,Medical,Medicare,Medicaid,,,,false,3431.5,1271.25
Southern Tier,Broome,0303001,000058,United Health Services Hospitals Inc. - Wilson Medical Center,50 to 69,139,M,White,Not Span/Hispanic,1,Emergency,Left Against Medical Advice,2018,MBD017,ALCOHOL-RELATED DISORDERS,SUD001,SUBSTANCE USE DETOXIFICATION,770,"DRUG & ALCOHOL ABUSE OR DEPENDENCE, LEFT AGAINST MEDICAL ADVICE",20,ALCOHOL/DRUG USE AND ALCOHOL/DRUG INDUCED ORGANIC MENTAL DISORDERS,2,Moderate,Moderate,Medical,Medicaid,,,,,true,5242.2,2106.39
New York City,Queens,7003001,001628,Flushing Hospital Medical Center,18 to 29,113,M,White,Spanish/Hispanic,2,Emergency,Left Against Medical Advice,2018,MBD018,OPIOID-RELATED DISORDERS,SUD001,SUBSTANCE USE DETOXIFICATION,770,"DRUG & ALCOHOL ABUSE OR DEPENDENCE, LEFT AGAINST MEDICAL ADVICE",20,ALCOHOL/DRUG USE AND ALCOHOL/DRUG INDUCED ORGANIC MENTAL DISORDERS,1,Minor,Minor,Medical,Medicaid,,,,,true,5982,1747.85
New York City,Queens,7003001,001628,Flushing Hospital Medical Center,18 to 29,111,M,White,Not Span/Hispanic,2,Emergency,Left Against Medical Advice,2018,MBD018,OPIOID-RELATED DISORDERS,SUD001,SUBSTANCE USE DETOXIFICATION,770,"DRUG & ALCOHOL ABUSE OR DEPENDENCE, LEFT AGAINST MEDICAL ADVICE",20,ALCOHOL/DRUG USE AND ALCOHOL/DRUG INDUCED ORGANIC MENTAL DISORDERS,1,Minor,Minor,Medical,Medicaid,,,,,true,6083,1777.33
Western NY,Erie,1401005,000210,Erie County Medical Center,50 to 69,143,M,White,Not Span/Hispanic,1,Emergency,Left Against Medical Advice,2018,MBD017,ALCOHOL-RELATED DISORDERS,,,770,"DRUG & ALCOHOL ABUSE OR DEPENDENCE, LEFT AGAINST MEDICAL ADVICE",20,ALCOHOL/DRUG USE AND ALCOHOL/DRUG INDUCED ORGANIC MENTAL DISORDERS,1,Minor,Minor,Medical,Blue Cross/Blue Shield,,,,,true,4667.34,1861.9
Capital/Adirond,Albany,0101004,000005,St. Peter's Hospital,50 to 69,123,M,Black/African American,Not Span/Hispanic,3,Emergency,Left Against Medical Advice,2018,MBD017,ALCOHOL-RELATED DISORDERS,,,770,"DRUG & ALCOHOL ABUSE OR DEPENDENCE, LEFT AGAINST MEDICAL ADVICE",20,ALCOHOL/DRUG USE AND ALCOHOL/DRUG INDUCED ORGANIC MENTAL DISORDERS,2,Moderate,Minor,Medical,Medicare,Medicaid,,,,true,28002.1,6842.37
Capital/Adirond,Albany,0101004,000005,St. Peter's Hospital,30 to 49,122,M,Black/African American,Not Span/Hispanic,3,Emergency,Left Against Medical Advice,2018,MBD017,ALCOHOL-RELATED DISORDERS,SUD001,SUBSTANCE USE DETOXIFICATION,770,"DRUG & ALCOHOL ABUSE OR DEPENDENCE, LEFT AGAINST MEDICAL ADVICE",20,ALCOHOL/DRUG USE AND ALCOHOL/DRUG INDUCED ORGANIC MENTAL DISORDERS,2,Moderate,Moderate,Medical,Blue Cross/Blue Shield,,,,,true,9089.8,4363.07
Western NY,Erie,1401005,000210,Erie County Medical Center,18 to 29,142,M,White,Not Span/Hispanic,6,Elective,Left Against Medical Advice,2018,MBD026,MENTAL AND SUBSTANCE USE DISORDERS IN REMISSION,SUD004,COUNSELING FOR SUBSTANCE USE,770,"DRUG & ALCOHOL ABUSE OR DEPENDENCE, LEFT AGAINST MEDICAL ADVICE",20,ALCOHOL/DRUG USE AND ALCOHOL/DRUG INDUCED ORGANIC MENTAL DISORDERS,1,Minor,Minor,Medical,Medicaid,Medicaid,,,,false,6014.45,4929.96
Western NY,Erie,1401005,000210,Erie County Medical Center,30 to 49,142,F,White,Not Span/Hispanic,3,Emergency,Left Against Medical Advice,2018,MBD017,ALCOHOL-RELATED DISORDERS,SUD001,SUBSTANCE USE DETOXIFICATION,770,"DRUG & ALCOHOL ABUSE OR DEPENDENCE, LEFT AGAINST MEDICAL ADVICE",20,ALCOHOL/DRUG USE AND ALCOHOL/DRUG INDUCED ORGANIC MENTAL DISORDERS,2,Moderate,Minor,Medical,Medicaid,,,,,false,6863.43,5457.7
Western NY,Erie,1401005,000210,Erie County Medical Center,18 to 29,140,F,White,Not Span/Hispanic,1,Emergency,Left Against Medical Advice,2018,MBD020,SEDATIVE-RELATED DISORDERS,,,770,"DRUG & ALCOHOL ABUSE OR DEPENDENCE, LEFT AGAINST MEDICAL ADVICE",20,ALCOHOL/DRUG USE AND ALCOHOL/DRUG INDUCED ORGANIC MENTAL DISORDERS,1,Minor,Minor,Medical,Medicaid,Medicaid,,,,true,6682.93,2394.53
New York City,Manhattan,7002021,001454,Metropolitan Hospital Center,30 to 49,100,M,Other Race,Not Span/Hispanic,1,Emergency,Left Against Medical Advice,2018,MBD018,OPIOID-RELATED DISORDERS,SUD001,SUBSTANCE USE DETOXIFICATION,770,"DRUG & ALCOHOL ABUSE OR DEPENDENCE, LEFT AGAINST MEDICAL ADVICE",20,ALCOHOL/DRUG USE AND ALCOHOL/DRUG INDUCED ORGANIC MENTAL DISORDERS,1,Minor,Minor,Medical,Medicaid,,,,,true,2605.27,2104.93
New York City,Kings,7001021,001306,New York - Presbyterian Brooklyn Methodist Hospital,18 to 29,112,F,Black/African American,Not Span/Hispanic,1,Emergency,Left Against Medical Advice,2018,MBD019,CANNABIS-RELATED DISORDERS,,,770,"DRUG & ALCOHOL ABUSE OR DEPENDENCE, LEFT AGAINST MEDICAL ADVICE",20,ALCOHOL/DRUG USE AND ALCOHOL/DRUG INDUCED ORGANIC MENTAL DISORDERS,1,Minor,Minor,Medical,Private Health Insurance,,,,,true,7444.2,1854.48
New York City,Richmond,7004003,001737,Staten Island University Hospital Prince's Bay,30 to 49,103,M,Black/African American,Not Span/Hispanic,2,Elective,Left Against Medical Advice,2018,MBD021,STIMULANT-RELATED DISORDERS,SUD004,COUNSELING FOR SUBSTANCE USE,770,"DRUG & ALCOHOL ABUSE OR DEPENDENCE, LEFT AGAINST MEDICAL ADVICE",20,ALCOHOL/DRUG USE AND ALCOHOL/DRUG INDUCED ORGANIC MENTAL DISORDERS,1,Minor,Minor,Medical,Medicaid,Medicaid,,,,false,12078,2477.52
Capital/Adirond,Albany,0101004,000005,St. Peter's Hospital,30 to 49,123,M,Other Race,Not Span/Hispanic,1,Emergency,Left Against Medical Advice,2018,MBD017,ALCOHOL-RELATED DISORDERS,SUD001,SUBSTANCE USE DETOXIFICATION,770,"DRUG & ALCOHOL ABUSE OR DEPENDENCE, LEFT AGAINST MEDICAL ADVICE",20,ALCOHOL/DRUG USE AND ALCOHOL/DRUG INDUCED ORGANIC MENTAL DISORDERS,2,Moderate,Minor,Medical,Private Health Insurance,,,,,true,3941,1293.84
Long Island,Suffolk,5149001,000896,St. Charles Hospital,50 to 69,119,M,White,Not Span/Hispanic,1,Emergency,Left Against Medical Advice,2018,MBD018,OPIOID-RELATED DISORDERS,SUD001,SUBSTANCE USE DETOXIFICATION,770,"DRUG & ALCOHOL ABUSE OR DEPENDENCE, LEFT AGAINST MEDICAL ADVICE",20,ALCOHOL/DRUG USE AND ALCOHOL/DRUG INDUCED ORGANIC MENTAL DISORDERS,2,Moderate,Minor,Medical,Medicare,Medicaid,Medicaid,,,true,7788,1235.72
New York City,Bronx,7000006,001169,Montefiore Medical Center - Henry & Lucy Moses Div,50 to 69,104,M,Black/African American,Not Span/Hispanic,2,Emergency,Left Against Medical Advice,2018,MBD017,ALCOHOL-RELATED DISORDERS,IMG008,ULTRASONOGRAPHY,770,"DRUG & ALCOHOL ABUSE OR DEPENDENCE, LEFT AGAINST MEDICAL ADVICE",20,ALCOHOL/DRUG USE AND ALCOHOL/DRUG INDUCED ORGANIC MENTAL DISORDERS,2,Moderate,Minor,Medical,Medicaid,,,,,true,21292.13,3709.69
New York City,Manhattan,7002009,001445,Harlem Hospital Center,18 to 29,104,F,Other Race,Not Span/Hispanic,1,Emergency,Left Against Medical Advice,2018,MBD018,OPIOID-RELATED DISORDERS,SUD001,SUBSTANCE USE DETOXIFICATION,770,"DRUG & ALCOHOL ABUSE OR DEPENDENCE, LEFT AGAINST MEDICAL ADVICE",20,ALCOHOL/DRUG USE AND ALCOHOL/DRUG INDUCED ORGANIC MENTAL DISORDERS,1,Minor,Minor,Medical,Self-Pay,,,,,true,3181.67,2364.4