Hospital Service Area,Hospital County,Operating Certificate Number,Permanent Facility Id,Facility Name,Age Group,Zip Code - 3 digits,Gender,Race,Ethnicity,Length of Stay,Type of Admission,Patient Disposition,Discharge Year,CCS Diagnosis Code,CCS Diagnosis Description,CCS Procedure Code,CCS Procedure Description,APR DRG Code,APR DRG Description,APR MDC Code,APR MDC Description,APR Severity of Illness Code,APR Severity of Illness Description,APR Risk of Mortality,APR Medical Surgical Description,Payment Typology 1,Payment Typology 2,Payment Typology 3,Birth Weight,Abortion Edit Indicator,Emergency Department Indicator,Total Charges,Total Costs
New York City,Manhattan,7002053,001463,NYU Langone Hospitals,30 to 49,117,M,White,Not Span/Hispanic,1,Emergency,Left Against Medical Advice,2019,MBD017,ALCOHOL-RELATED DISORDERS,,,770,"DRUG & ALCOHOL ABUSE OR DEPENDENCE, LEFT AGAINST MEDICAL ADVICE",20,ALCOHOL/DRUG USE AND ALCOHOL/DRUG INDUCED ORGANIC MENTAL DISORDERS,2,Moderate,Minor,Medical,Medicaid,,,,,true,23607.34,5651.91
New York City,Manhattan,7002053,001463,NYU Langone Hospitals,50 to 69,100,M,Black/African American,Not Span/Hispanic,3,Emergency,Left Against Medical Advice,2019,MBD017,ALCOHOL-RELATED DISORDERS,,,770,"DRUG & ALCOHOL ABUSE OR DEPENDENCE, LEFT AGAINST MEDICAL ADVICE",20,ALCOHOL/DRUG USE AND ALCOHOL/DRUG INDUCED ORGANIC MENTAL DISORDERS,2,Moderate,Minor,Medical,Medicaid,,,,,true,44922.11,12359.33
New York City,Manhattan,7002053,001463,NYU Langone Hospitals,50 to 69,100,M,Black/African American,Not Span/Hispanic,2,Emergency,Left Against Medical Advice,2019,MBD017,ALCOHOL-RELATED DISORDERS,ADM017,ADMINISTRATION OF NUTRITIONAL AND ELECTROLYTIC SUBSTANCES,770,"DRUG & ALCOHOL ABUSE OR DEPENDENCE, LEFT AGAINST MEDICAL ADVICE",20,ALCOHOL/DRUG USE AND ALCOHOL/DRUG INDUCED ORGANIC MENTAL DISORDERS,3,Major,Moderate,Medical,Medicare,Medicaid,,,,true,32081.04,9167.06
New York City,Manhattan,7002053,001463,NYU Langone Hospitals,50 to 69,114,M,Black/African American,Not Span/Hispanic,2,Emergency,Left Against Medical Advice,2019,MBD017,ALCOHOL-RELATED DISORDERS,ADM001,TRANSFUSION OF BLOOD AND BLOOD PRODUCTS,770,"DRUG & ALCOHOL ABUSE OR DEPENDENCE, LEFT AGAINST MEDICAL ADVICE",20,ALCOHOL/DRUG USE AND ALCOHOL/DRUG INDUCED ORGANIC MENTAL DISORDERS,3,Major,Major,Medical,Private Health Insurance,,,,,true,47216.38,11649.03
New York City,Manhattan,7002053,001463,NYU Langone Hospitals,30 to 49,112,M,Black/African American,Not Span/Hispanic,2,Emergency,Left Against Medical Advice,2019,MBD017,ALCOHOL-RELATED DISORDERS,,,770,"DRUG & ALCOHOL ABUSE OR DEPENDENCE, LEFT AGAINST MEDICAL ADVICE",20,ALCOHOL/DRUG USE AND ALCOHOL/DRUG INDUCED ORGANIC MENTAL DISORDERS,3,Major,Moderate,Medical,Medicare,,,,,true,24136.05,7784.93
New York City,Manhattan,7002053,001463,NYU Langone Hospitals,50 to 69,100,F,White,Not Span/Hispanic,1,Emergency,Left Against Medical Advice,2019,MBD017,ALCOHOL-RELATED DISORDERS,,,770,"DRUG & ALCOHOL ABUSE OR DEPENDENCE, LEFT AGAINST MEDICAL ADVICE",20,ALCOHOL/DRUG USE AND ALCOHOL/DRUG INDUCED ORGANIC MENTAL DISORDERS,2,Moderate,Moderate,Medical,Private Health Insurance,,,,,true,12632.93,4160.21
New York City,Manhattan,7002053,001463,NYU Langone Hospitals,30 to 49,100,M,White,Not Span/Hispanic,7,Emergency,Left Against Medical Advice,2019,MBD020,SEDATIVE-RELATED DISORDERS,MHT001,PHARMACOTHERAPY FOR MENTAL HEALTH (EXCLUDING SUBSTANCE USE),770,"DRUG & ALCOHOL ABUSE OR DEPENDENCE, LEFT AGAINST MEDICAL ADVICE",20,ALCOHOL/DRUG USE AND ALCOHOL/DRUG INDUCED ORGANIC MENTAL DISORDERS,2,Moderate,Minor,Medical,Medicaid,,,,,true,74831.09,24259.03
New York City,Manhattan,7002053,001463,NYU Langone Hospitals,30 to 49,OOS,M,White,Not Span/Hispanic,2,Emergency,Left Against Medical Advice,2019,MBD017,ALCOHOL-RELATED DISORDERS,,,770,"DRUG & ALCOHOL ABUSE OR DEPENDENCE, LEFT AGAINST MEDICAL ADVICE",20,ALCOHOL/DRUG USE AND ALCOHOL/DRUG INDUCED ORGANIC MENTAL DISORDERS,2,Moderate,Moderate,Medical,Medicare,,,,,true,52742.74,17035.38
New York City,Manhattan,7002053,001463,NYU Langone Hospitals,18 to 29,100,F,Other Race,Unknown,5,Emergency,Left Against Medical Advice,2019,MBD025,OTHER SPECIFIED SUBSTANCE-RELATED DISORDERS,,,770,"DRUG & ALCOHOL ABUSE OR DEPENDENCE, LEFT AGAINST MEDICAL ADVICE",20,ALCOHOL/DRUG USE AND ALCOHOL/DRUG INDUCED ORGANIC MENTAL DISORDERS,2,Moderate,Minor,Medical,Medicaid,,,,,true,34707.14,13752.37
New York City,Manhattan,7002053,001463,NYU Langone Hospitals,50 to 69,100,F,White,Spanish/Hispanic,3,Emergency,Left Against Medical Advice,2019,MBD020,SEDATIVE-RELATED DISORDERS,ESA004,NON-INVASIVE VENTILATION,770,"DRUG & ALCOHOL ABUSE OR DEPENDENCE, LEFT AGAINST MEDICAL ADVICE",20,ALCOHOL/DRUG USE AND ALCOHOL/DRUG INDUCED ORGANIC MENTAL DISORDERS,4,Extreme,Extreme,Medical,Medicaid,,,,,true,49589.06,13686.24
New York City,Manhattan,7002053,001463,NYU Langone Hospitals,50 to 69,112,M,Black/African American,Not Span/Hispanic,2,Emergency,Left Against Medical Advice,2019,MBD017,ALCOHOL-RELATED DISORDERS,,,770,"DRUG & ALCOHOL ABUSE OR DEPENDENCE, LEFT AGAINST MEDICAL ADVICE",20,ALCOHOL/DRUG USE AND ALCOHOL/DRUG INDUCED ORGANIC MENTAL DISORDERS,3,Major,Major,Medical,Medicaid,,,,,true,29527.91,8321.5
New York City,Manhattan,7002053,001463,NYU Langone Hospitals,30 to 49,100,M,Other Race,Unknown,1,Emergency,Left Against Medical Advice,2019,MBD017,ALCOHOL-RELATED DISORDERS,ESA003,MECHANICAL VENTILATION,770,"DRUG & ALCOHOL ABUSE OR DEPENDENCE, LEFT AGAINST MEDICAL ADVICE",20,ALCOHOL/DRUG USE AND ALCOHOL/DRUG INDUCED ORGANIC MENTAL DISORDERS,4,Extreme,Major,Medical,Medicaid,,,,,true,46031.4,11845.21
New York City,Manhattan,7002053,001463,NYU Langone Hospitals,18 to 29,OOS,M,White,Not Span/Hispanic,2,Emergency,Left Against Medical Advice,2019,MBD017,ALCOHOL-RELATED DISORDERS,,,770,"DRUG & ALCOHOL ABUSE OR DEPENDENCE, LEFT AGAINST MEDICAL ADVICE",20,ALCOHOL/DRUG USE AND ALCOHOL/DRUG INDUCED ORGANIC MENTAL DISORDERS,2,Moderate,Minor,Medical,Private Health Insurance,,,,,true,19664.04,6659.3
New York City,Manhattan,7002053,001463,NYU Langone Hospitals,30 to 49,111,M,Other Race,Unknown,1,Emergency,Left Against Medical Advice,2019,MBD017,ALCOHOL-RELATED DISORDERS,,,770,"DRUG & ALCOHOL ABUSE OR DEPENDENCE, LEFT AGAINST MEDICAL ADVICE",20,ALCOHOL/DRUG USE AND ALCOHOL/DRUG INDUCED ORGANIC MENTAL DISORDERS,1,Minor,Minor,Medical,Private Health Insurance,,,,,true,29157.16,8888.85
New York City,Manhattan,7002053,001463,NYU Langone Hospitals,30 to 49,115,M,Other Race,Unknown,5,Emergency,Left Against Medical Advice,2019,MBD017,ALCOHOL-RELATED DISORDERS,,,770,"DRUG & ALCOHOL ABUSE OR DEPENDENCE, LEFT AGAINST MEDICAL ADVICE",20,ALCOHOL/DRUG USE AND ALCOHOL/DRUG INDUCED ORGANIC MENTAL DISORDERS,2,Moderate,Moderate,Medical,Medicaid,,,,,true,44455.54,17428.68
New York City,Manhattan,7002053,001463,NYU Langone Hospitals,30 to 49,114,F,Black/African American,Unknown,1,Emergency,Left Against Medical Advice,2019,MBD017,ALCOHOL-RELATED DISORDERS,ADM017,ADMINISTRATION OF NUTRITIONAL AND ELECTROLYTIC SUBSTANCES,770,"DRUG & ALCOHOL ABUSE OR DEPENDENCE, LEFT AGAINST MEDICAL ADVICE",20,ALCOHOL/DRUG USE AND ALCOHOL/DRUG INDUCED ORGANIC MENTAL DISORDERS,3,Major,Major,Medical,Medicaid,,,,,true,19951.5,4870.22
New York City,Manhattan,7002053,001463,NYU Langone Hospitals,50 to 69,100,M,White,Not Span/Hispanic,1,Emergency,Left Against Medical Advice,2019,MBD017,ALCOHOL-RELATED DISORDERS,,,770,"DRUG & ALCOHOL ABUSE OR DEPENDENCE, LEFT AGAINST MEDICAL ADVICE",20,ALCOHOL/DRUG USE AND ALCOHOL/DRUG INDUCED ORGANIC MENTAL DISORDERS,3,Major,Major,Medical,Medicaid,,,,,true,21458.58,5199.53
New York City,Manhattan,7002053,001463,NYU Langone Hospitals,50 to 69,100,M,White,Not Span/Hispanic,1,Emergency,Left Against Medical Advice,2019,MBD017,ALCOHOL-RELATED DISORDERS,,,770,"DRUG & ALCOHOL ABUSE OR DEPENDENCE, LEFT AGAINST MEDICAL ADVICE",20,ALCOHOL/DRUG USE AND ALCOHOL/DRUG INDUCED ORGANIC MENTAL DISORDERS,3,Major,Moderate,Medical,Medicaid,,,,,true,27963.23,6203.52
New York City,Manhattan,7002053,001463,NYU Langone Hospitals,50 to 69,OOS,M,White,Not Span/Hispanic,2,Emergency,Left Against Medical Advice,2019,MBD017,ALCOHOL-RELATED DISORDERS,,,770,"DRUG & ALCOHOL ABUSE OR DEPENDENCE, LEFT AGAINST MEDICAL ADVICE",20,ALCOHOL/DRUG USE AND ALCOHOL/DRUG INDUCED ORGANIC MENTAL DISORDERS,2,Moderate,Minor,Medical,Medicaid,,,,,true,22924.46,7574.78
New York City,Manhattan,7002053,001463,NYU Langone Hospitals,18 to 29,100,F,Other Race,Not Span/Hispanic,1,Emergency,Left Against Medical Advice,2019,MBD017,ALCOHOL-RELATED DISORDERS,,,770,"DRUG & ALCOHOL ABUSE OR DEPENDENCE, LEFT AGAINST MEDICAL ADVICE",20,ALCOHOL/DRUG USE AND ALCOHOL/DRUG INDUCED ORGANIC MENTAL DISORDERS,1,Minor,Minor,Medical,Medicaid,,,,,true,14079.49,4394.38
New York City,Manhattan,7002053,001463,NYU Langone Hospitals,30 to 49,112,F,White,Not Span/Hispanic,13,Emergency,Left Against Medical Advice,2019,MBD017,ALCOHOL-RELATED DISORDERS,,,770,"DRUG & ALCOHOL ABUSE OR DEPENDENCE, LEFT AGAINST MEDICAL ADVICE",20,ALCOHOL/DRUG USE AND ALCOHOL/DRUG INDUCED ORGANIC MENTAL DISORDERS,3,Major,Moderate,Medical,Medicaid,,,,,true,172477.64,68117.32
