Hospital Service Area,Hospital County,Operating Certificate Number,Permanent Facility Id,Facility Name,Age Group,Zip Code - 3 digits,Gender,Race,Ethnicity,Length of Stay,Type of Admission,Patient Disposition,Discharge Year,CCS Diagnosis Code,CCS Diagnosis Description,CCS Procedure Code,CCS Procedure Description,APR DRG Code,APR DRG Description,APR MDC Code,APR MDC Description,APR Severity of Illness Code,APR Severity of Illness Description,APR Risk of Mortality,APR Medical Surgical Description,Payment Typology 1,Payment Typology 2,Payment Typology 3,Birth Weight,Abortion Edit Indicator,Emergency Department Indicator,Total Charges,Total Costs
Long Island,Nassau,2908000,000511,NYU Langone Hospital-Long Island,30 to 49,115,M,Black/African American,Not Span/Hispanic,2,Emergency,Left Against Medical Advice,2019,MBD017,ALCOHOL-RELATED DISORDERS,ESA003,MECHANICAL VENTILATION,770,"DRUG & ALCOHOL ABUSE OR DEPENDENCE, LEFT AGAINST MEDICAL ADVICE",20,ALCOHOL/DRUG USE AND ALCOHOL/DRUG INDUCED ORGANIC MENTAL DISORDERS,3,Major,Extreme,Medical,Medicaid,Medicaid,,,,true,90988.84,11448.8
Long Island,Nassau,2908000,000511,NYU Langone Hospital-Long Island,30 to 49,115,M,White,Not Span/Hispanic,1,Emergency,Left Against Medical Advice,2019,MBD017,ALCOHOL-RELATED DISORDERS,SUD001,SUBSTANCE USE DETOXIFICATION,770,"DRUG & ALCOHOL ABUSE OR DEPENDENCE, LEFT AGAINST MEDICAL ADVICE",20,ALCOHOL/DRUG USE AND ALCOHOL/DRUG INDUCED ORGANIC MENTAL DISORDERS,1,Minor,Minor,Medical,Private Health Insurance,,,,,true,28018.77,3558.73
Long Island,Nassau,2908000,000511,NYU Langone Hospital-Long Island,70 or Older,115,F,White,Not Span/Hispanic,2,Emergency,Left Against Medical Advice,2019,MBD017,ALCOHOL-RELATED DISORDERS,SUD001,SUBSTANCE USE DETOXIFICATION,770,"DRUG & ALCOHOL ABUSE OR DEPENDENCE, LEFT AGAINST MEDICAL ADVICE",20,ALCOHOL/DRUG USE AND ALCOHOL/DRUG INDUCED ORGANIC MENTAL DISORDERS,2,Moderate,Minor,Medical,Medicare,Medicare,Blue Cross/Blue Shield,,,true,27517.27,4885.81
Long Island,Nassau,2908000,000511,NYU Langone Hospital-Long Island,30 to 49,115,M,Other Race,Unknown,1,Emergency,Left Against Medical Advice,2019,MBD017,ALCOHOL-RELATED DISORDERS,,,770,"DRUG & ALCOHOL ABUSE OR DEPENDENCE, LEFT AGAINST MEDICAL ADVICE",20,ALCOHOL/DRUG USE AND ALCOHOL/DRUG INDUCED ORGANIC MENTAL DISORDERS,2,Moderate,Minor,Medical,Self-Pay,,,,,true,28911.76,3606.58
Long Island,Nassau,2908000,000511,NYU Langone Hospital-Long Island,50 to 69,110,F,Black/African American,Not Span/Hispanic,2,Emergency,Left Against Medical Advice,2019,MBD017,ALCOHOL-RELATED DISORDERS,,,770,"DRUG & ALCOHOL ABUSE OR DEPENDENCE, LEFT AGAINST MEDICAL ADVICE",20,ALCOHOL/DRUG USE AND ALCOHOL/DRUG INDUCED ORGANIC MENTAL DISORDERS,2,Moderate,Minor,Medical,Federal/State/Local/VA,,,,,true,61811.45,6134.85
Long Island,Nassau,2908000,000511,NYU Langone Hospital-Long Island,30 to 49,115,M,Black/African American,Not Span/Hispanic,2,Emergency,Left Against Medical Advice,2019,MBD017,ALCOHOL-RELATED DISORDERS,SUD001,SUBSTANCE USE DETOXIFICATION,770,"DRUG & ALCOHOL ABUSE OR DEPENDENCE, LEFT AGAINST MEDICAL ADVICE",20,ALCOHOL/DRUG USE AND ALCOHOL/DRUG INDUCED ORGANIC MENTAL DISORDERS,1,Minor,Minor,Medical,Medicaid,Medicaid,,,,true,36990.6,5687.79
Long Island,Nassau,2908000,000511,NYU Langone Hospital-Long Island,30 to 49,115,M,Black/African American,Not Span/Hispanic,1,Emergency,Left Against Medical Advice,2019,MBD017,ALCOHOL-RELATED DISORDERS,,,770,"DRUG & ALCOHOL ABUSE OR DEPENDENCE, LEFT AGAINST MEDICAL ADVICE",20,ALCOHOL/DRUG USE AND ALCOHOL/DRUG INDUCED ORGANIC MENTAL DISORDERS,2,Moderate,Moderate,Medical,Medicaid,Medicaid,,,,true,34538.65,4822.62
Long Island,Nassau,2908000,000511,NYU Langone Hospital-Long Island,70 or Older,115,M,Other Race,Unknown,1,Trauma,Left Against Medical Advice,2019,MBD017,ALCOHOL-RELATED DISORDERS,SUD001,SUBSTANCE USE DETOXIFICATION,770,"DRUG & ALCOHOL ABUSE OR DEPENDENCE, LEFT AGAINST MEDICAL ADVICE",20,ALCOHOL/DRUG USE AND ALCOHOL/DRUG INDUCED ORGANIC MENTAL DISORDERS,2,Moderate,Moderate,Medical,Self-Pay,,,,,true,90529.71,8152.6
Long Island,Nassau,2908000,000511,NYU Langone Hospital-Long Island,70 or Older,115,M,Other Race,Unknown,1,Emergency,Left Against Medical Advice,2019,MBD017,ALCOHOL-RELATED DISORDERS,ADM001,TRANSFUSION OF BLOOD AND BLOOD PRODUCTS,770,"DRUG & ALCOHOL ABUSE OR DEPENDENCE, LEFT AGAINST MEDICAL ADVICE",20,ALCOHOL/DRUG USE AND ALCOHOL/DRUG INDUCED ORGANIC MENTAL DISORDERS,2,Moderate,Moderate,Medical,Medicaid,Medicaid,,,,true,62061.64,6246.86
Long Island,Nassau,2908000,000511,NYU Langone Hospital-Long Island,30 to 49,110,M,Other Race,Not Span/Hispanic,2,Emergency,Left Against Medical Advice,2019,MBD017,ALCOHOL-RELATED DISORDERS,SUD001,SUBSTANCE USE DETOXIFICATION,770,"DRUG & ALCOHOL ABUSE OR DEPENDENCE, LEFT AGAINST MEDICAL ADVICE",20,ALCOHOL/DRUG USE AND ALCOHOL/DRUG INDUCED ORGANIC MENTAL DISORDERS,2,Moderate,Moderate,Medical,Medicaid,Medicaid,,,,true,49419.78,7382.32
Long Island,Nassau,2908000,000511,NYU Langone Hospital-Long Island,30 to 49,115,M,White,Not Span/Hispanic,1,Emergency,Left Against Medical Advice,2019,MBD017,ALCOHOL-RELATED DISORDERS,,,770,"DRUG & ALCOHOL ABUSE OR DEPENDENCE, LEFT AGAINST MEDICAL ADVICE",20,ALCOHOL/DRUG USE AND ALCOHOL/DRUG INDUCED ORGANIC MENTAL DISORDERS,2,Moderate,Moderate,Medical,Medicaid,,,,,true,32200.72,3916.11
Long Island,Nassau,2908000,000511,NYU Langone Hospital-Long Island,30 to 49,115,M,White,Not Span/Hispanic,1,Emergency,Left Against Medical Advice,2019,MBD017,ALCOHOL-RELATED DISORDERS,SUD002,PHARMACOTHERAPY FOR SUBSTANCE USE,770,"DRUG & ALCOHOL ABUSE OR DEPENDENCE, LEFT AGAINST MEDICAL ADVICE",20,ALCOHOL/DRUG USE AND ALCOHOL/DRUG INDUCED ORGANIC MENTAL DISORDERS,2,Moderate,Minor,Medical,Medicare,Medicare,Self-Pay,,,true,27691.46,4029.42
Long Island,Nassau,2908000,000511,NYU Langone Hospital-Long Island,50 to 69,115,M,White,Not Span/Hispanic,1,Emergency,Left Against Medical Advice,2019,MBD017,ALCOHOL-RELATED DISORDERS,SUD001,SUBSTANCE USE DETOXIFICATION,770,"DRUG & ALCOHOL ABUSE OR DEPENDENCE, LEFT AGAINST MEDICAL ADVICE",20,ALCOHOL/DRUG USE AND ALCOHOL/DRUG INDUCED ORGANIC MENTAL DISORDERS,1,Minor,Minor,Medical,Medicare,Medicare,,,,true,32897.68,4180.75
Long Island,Nassau,2908000,000511,NYU Langone Hospital-Long Island,30 to 49,115,M,White,Spanish/Hispanic,3,Emergency,Left Against Medical Advice,2019,MBD017,ALCOHOL-RELATED DISORDERS,,,770,"DRUG & ALCOHOL ABUSE OR DEPENDENCE, LEFT AGAINST MEDICAL ADVICE",20,ALCOHOL/DRUG USE AND ALCOHOL/DRUG INDUCED ORGANIC MENTAL DISORDERS,2,Moderate,Minor,Medical,Medicaid,Medicaid,,,,true,39247.9,7047.6
Long Island,Nassau,2908000,000511,NYU Langone Hospital-Long Island,50 to 69,115,M,Other Race,Not Span/Hispanic,2,Emergency,Left Against Medical Advice,2019,MBD017,ALCOHOL-RELATED DISORDERS,SUD001,SUBSTANCE USE DETOXIFICATION,770,"DRUG & ALCOHOL ABUSE OR DEPENDENCE, LEFT AGAINST MEDICAL ADVICE",20,ALCOHOL/DRUG USE AND ALCOHOL/DRUG INDUCED ORGANIC MENTAL DISORDERS,1,Minor,Minor,Medical,Medicaid,Medicaid,,,,true,67576.11,10338.22
Long Island,Nassau,2908000,000511,NYU Langone Hospital-Long Island,30 to 49,115,M,White,Not Span/Hispanic,1,Emergency,Left Against Medical Advice,2019,MBD017,ALCOHOL-RELATED DISORDERS,,,770,"DRUG & ALCOHOL ABUSE OR DEPENDENCE, LEFT AGAINST MEDICAL ADVICE",20,ALCOHOL/DRUG USE AND ALCOHOL/DRUG INDUCED ORGANIC MENTAL DISORDERS,1,Minor,Minor,Medical,Medicaid,Medicaid,,,,true,28575.54,3607.05
Long Island,Nassau,2908000,000511,NYU Langone Hospital-Long Island,30 to 49,115,M,Black/African American,Not Span/Hispanic,1,Emergency,Left Against Medical Advice,2019,MBD017,ALCOHOL-RELATED DISORDERS,,,770,"DRUG & ALCOHOL ABUSE OR DEPENDENCE, LEFT AGAINST MEDICAL ADVICE",20,ALCOHOL/DRUG USE AND ALCOHOL/DRUG INDUCED ORGANIC MENTAL DISORDERS,2,Moderate,Minor,Medical,Medicaid,Medicaid,,,,true,30761.56,4559.18
Long Island,Nassau,2908000,000511,NYU Langone Hospital-Long Island,50 to 69,110,F,White,Not Span/Hispanic,1,Emergency,Left Against Medical Advice,2019,MBD017,ALCOHOL-RELATED DISORDERS,,,770,"DRUG & ALCOHOL ABUSE OR DEPENDENCE, LEFT AGAINST MEDICAL ADVICE",20,ALCOHOL/DRUG USE AND ALCOHOL/DRUG INDUCED ORGANIC MENTAL DISORDERS,2,Moderate,Minor,Medical,Medicaid,,,,,true,34795.83,4412.81
Long Island,Nassau,2908000,000511,NYU Langone Hospital-Long Island,30 to 49,117,M,White,Spanish/Hispanic,2,Emergency,Left Against Medical Advice,2019,MBD017,ALCOHOL-RELATED DISORDERS,,,770,"DRUG & ALCOHOL ABUSE OR DEPENDENCE, LEFT AGAINST MEDICAL ADVICE",20,ALCOHOL/DRUG USE AND ALCOHOL/DRUG INDUCED ORGANIC MENTAL DISORDERS,1,Minor,Minor,Medical,Medicare,Medicare,Medicaid,,,true,23986.19,4494.87
Long Island,Nassau,2908000,000511,NYU Langone Hospital-Long Island,50 to 69,115,M,White,Not Span/Hispanic,1,Emergency,Left Against Medical Advice,2019,MBD017,ALCOHOL-RELATED DISORDERS,SUD001,SUBSTANCE USE DETOXIFICATION,770,"DRUG & ALCOHOL ABUSE OR DEPENDENCE, LEFT AGAINST MEDICAL ADVICE",20,ALCOHOL/DRUG USE AND ALCOHOL/DRUG INDUCED ORGANIC MENTAL DISORDERS,2,Moderate,Minor,Medical,Medicaid,Medicaid,,,,true,19108.42,3053.95
Long Island,Nassau,2908000,000511,NYU Langone Hospital-Long Island,50 to 69,118,M,White,Not Span/Hispanic,2,Emergency,Left Against Medical Advice,2019,MBD017,ALCOHOL-RELATED DISORDERS,SUD001,SUBSTANCE USE DETOXIFICATION,770,"DRUG & ALCOHOL ABUSE OR DEPENDENCE, LEFT AGAINST MEDICAL ADVICE",20,ALCOHOL/DRUG USE AND ALCOHOL/DRUG INDUCED ORGANIC MENTAL DISORDERS,3,Major,Moderate,Medical,Private Health Insurance,,,,,true,50941.35,7762.29
Long Island,Nassau,2908000,000511,NYU Langone Hospital-Long Island,30 to 49,115,M,Black/African American,Not Span/Hispanic,1,Emergency,Left Against Medical Advice,2019,MBD017,ALCOHOL-RELATED DISORDERS,GIS001,ESOPHAGOGASTRODUODENOSCOPY (EGD) WITH BIOPSY,770,"DRUG & ALCOHOL ABUSE OR DEPENDENCE, LEFT AGAINST MEDICAL ADVICE",20,ALCOHOL/DRUG USE AND ALCOHOL/DRUG INDUCED ORGANIC MENTAL DISORDERS,3,Major,Minor,Medical,Medicaid,Medicaid,,,,true,41291.55,4757.76
Long Island,Nassau,2908000,000511,NYU Langone Hospital-Long Island,30 to 49,115,M,White,Not Span/Hispanic,4,Emergency,Left Against Medical Advice,2019,MBD017,ALCOHOL-RELATED DISORDERS,SUD001,SUBSTANCE USE DETOXIFICATION,770,"DRUG & ALCOHOL ABUSE OR DEPENDENCE, LEFT AGAINST MEDICAL ADVICE",20,ALCOHOL/DRUG USE AND ALCOHOL/DRUG INDUCED ORGANIC MENTAL DISORDERS,3,Major,Moderate,Medical,Self-Pay,,,,,true,78417.84,14247.48
Long Island,Nassau,2908000,000511,NYU Langone Hospital-Long Island,30 to 49,117,M,White,Not Span/Hispanic,1,Emergency,Left Against Medical Advice,2019,MBD017,ALCOHOL-RELATED DISORDERS,SUD001,SUBSTANCE USE DETOXIFICATION,770,"DRUG & ALCOHOL ABUSE OR DEPENDENCE, LEFT AGAINST MEDICAL ADVICE",20,ALCOHOL/DRUG USE AND ALCOHOL/DRUG INDUCED ORGANIC MENTAL DISORDERS,4,Extreme,Extreme,Medical,Medicaid,Medicaid,,,,true,31195.82,4458.8
Long Island,Nassau,2908000,000511,NYU Langone Hospital-Long Island,30 to 49,115,F,White,Not Span/Hispanic,1,Emergency,Left Against Medical Advice,2019,MBD017,ALCOHOL-RELATED DISORDERS,SUD001,SUBSTANCE USE DETOXIFICATION,770,"DRUG & ALCOHOL ABUSE OR DEPENDENCE, LEFT AGAINST MEDICAL ADVICE",20,ALCOHOL/DRUG USE AND ALCOHOL/DRUG INDUCED ORGANIC MENTAL DISORDERS,2,Moderate,Minor,Medical,Self-Pay,,,,,true,27366.54,3760.44
Long Island,Nassau,2908000,000511,NYU Langone Hospital-Long Island,30 to 49,110,M,White,Not Span/Hispanic,1,Emergency,Left Against Medical Advice,2019,MBD017,ALCOHOL-RELATED DISORDERS,SUD001,SUBSTANCE USE DETOXIFICATION,770,"DRUG & ALCOHOL ABUSE OR DEPENDENCE, LEFT AGAINST MEDICAL ADVICE",20,ALCOHOL/DRUG USE AND ALCOHOL/DRUG INDUCED ORGANIC MENTAL DISORDERS,1,Minor,Minor,Medical,Medicaid,Medicaid,,,,true,24509.52,3426.07
Long Island,Nassau,2908000,000511,NYU Langone Hospital-Long Island,30 to 49,110,M,White,Not Span/Hispanic,1,Emergency,Left Against Medical Advice,2019,MBD017,ALCOHOL-RELATED DISORDERS,SUD001,SUBSTANCE USE DETOXIFICATION,770,"DRUG & ALCOHOL ABUSE OR DEPENDENCE, LEFT AGAINST MEDICAL ADVICE",20,ALCOHOL/DRUG USE AND ALCOHOL/DRUG INDUCED ORGANIC MENTAL DISORDERS,3,Major,Moderate,Medical,Medicaid,Medicaid,,,,true,30950.73,3711.49
Long Island,Nassau,2908000,000511,NYU Langone Hospital-Long Island,30 to 49,117,M,Black/African American,Not Span/Hispanic,1,Emergency,Left Against Medical Advice,2019,MBD017,ALCOHOL-RELATED DISORDERS,,,770,"DRUG & ALCOHOL ABUSE OR DEPENDENCE, LEFT AGAINST MEDICAL ADVICE",20,ALCOHOL/DRUG USE AND ALCOHOL/DRUG INDUCED ORGANIC MENTAL DISORDERS,1,Minor,Minor,Medical,Medicaid,,,,,true,16535.53,2830.19
Long Island,Nassau,2908000,000511,NYU Langone Hospital-Long Island,50 to 69,117,M,White,Not Span/Hispanic,2,Emergency,Left Against Medical Advice,2019,MBD017,ALCOHOL-RELATED DISORDERS,MST020,SUBCUTANEOUS TISSUE AND FASCIA EXCISION,770,"DRUG & ALCOHOL ABUSE OR DEPENDENCE, LEFT AGAINST MEDICAL ADVICE",20,ALCOHOL/DRUG USE AND ALCOHOL/DRUG INDUCED ORGANIC MENTAL DISORDERS,3,Major,Moderate,Medical,Medicaid,,,,,true,34414.91,5191.45
Long Island,Nassau,2908000,000511,NYU Langone Hospital-Long Island,70 or Older,115,M,White,Not Span/Hispanic,7,Emergency,Left Against Medical Advice,2019,MBD017,ALCOHOL-RELATED DISORDERS,SUD001,SUBSTANCE USE DETOXIFICATION,770,"DRUG & ALCOHOL ABUSE OR DEPENDENCE, LEFT AGAINST MEDICAL ADVICE",20,ALCOHOL/DRUG USE AND ALCOHOL/DRUG INDUCED ORGANIC MENTAL DISORDERS,1,Minor,Minor,Medical,Medicare,Medicare,,,,true,98204.64,18191.01
Long Island,Nassau,2908000,000511,NYU Langone Hospital-Long Island,30 to 49,115,F,White,Not Span/Hispanic,2,Emergency,Left Against Medical Advice,2019,MBD017,ALCOHOL-RELATED DISORDERS,,,770,"DRUG & ALCOHOL ABUSE OR DEPENDENCE, LEFT AGAINST MEDICAL ADVICE",20,ALCOHOL/DRUG USE AND ALCOHOL/DRUG INDUCED ORGANIC MENTAL DISORDERS,2,Moderate,Minor,Medical,Private Health Insurance,,,,,true,25533.32,4726.67
Long Island,Nassau,2908000,000511,NYU Langone Hospital-Long Island,30 to 49,117,M,Other Race,Not Span/Hispanic,3,Emergency,Left Against Medical Advice,2019,MBD017,ALCOHOL-RELATED DISORDERS,,,770,"DRUG & ALCOHOL ABUSE OR DEPENDENCE, LEFT AGAINST MEDICAL ADVICE",20,ALCOHOL/DRUG USE AND ALCOHOL/DRUG INDUCED ORGANIC MENTAL DISORDERS,3,Major,Minor,Medical,Medicaid,,,,,true,38984.26,6943.42
Long Island,Nassau,2908000,000511,NYU Langone Hospital-Long Island,50 to 69,115,M,White,Not Span/Hispanic,1,Emergency,Left Against Medical Advice,2019,MBD020,SEDATIVE-RELATED DISORDERS,,,770,"DRUG & ALCOHOL ABUSE OR DEPENDENCE, LEFT AGAINST MEDICAL ADVICE",20,ALCOHOL/DRUG USE AND ALCOHOL/DRUG INDUCED ORGANIC MENTAL DISORDERS,2,Moderate,Minor,Medical,Medicare,,,,,true,22340.81,3162.04
Long Island,Nassau,2908000,000511,NYU Langone Hospital-Long Island,30 to 49,115,M,White,Spanish/Hispanic,1,Emergency,Left Against Medical Advice,2019,MBD017,ALCOHOL-RELATED DISORDERS,SUD001,SUBSTANCE USE DETOXIFICATION,770,"DRUG & ALCOHOL ABUSE OR DEPENDENCE, LEFT AGAINST MEDICAL ADVICE",20,ALCOHOL/DRUG USE AND ALCOHOL/DRUG INDUCED ORGANIC MENTAL DISORDERS,2,Moderate,Minor,Medical,Self-Pay,,,,,true,24336.17,3724.49
