Hospital Service Area,Hospital County,Operating Certificate Number,Permanent Facility Id,Facility Name,Age Group,Zip Code - 3 digits,Gender,Race,Ethnicity,Length of Stay,Type of Admission,Patient Disposition,Discharge Year,CCS Diagnosis Code,CCS Diagnosis Description,CCS Procedure Code,CCS Procedure Description,APR DRG Code,APR DRG Description,APR MDC Code,APR MDC Description,APR Severity of Illness Code,APR Severity of Illness Description,APR Risk of Mortality,APR Medical Surgical Description,Payment Typology 1,Payment Typology 2,Payment Typology 3,Birth Weight,Abortion Edit Indicator,Emergency Department Indicator,Total Charges,Total Costs
Long Island,Suffolk,5123000,000885,Brookhaven Memorial Hospital Medical Center Inc,30 to 49,117,M,White,Not Span/Hispanic,3,Emergency,Home or Self Care,2017,660,Alcohol-related disorders,219,ALCO/DRUG REHAB/DETOX,772,Alcohol & drug dependence w rehab or rehab/detox therapy,20,Alcohol/Drug Use and Alcohol/Drug Induced Organic Mental Disorders,2,Moderate,Minor,Medical,Blue Cross/Blue Shield,,,,N,Y,19731.61,4037.12
Long Island,Suffolk,5123000,000885,Brookhaven Memorial Hospital Medical Center Inc,50 to 69,117,F,White,Not Span/Hispanic,3,Emergency,Home w/ Home Health Services,2017,660,Alcohol-related disorders,219,ALCO/DRUG REHAB/DETOX,772,Alcohol & drug dependence w rehab or rehab/detox therapy,20,Alcohol/Drug Use and Alcohol/Drug Induced Organic Mental Disorders,2,Moderate,Moderate,Medical,Private Health Insurance,Medicaid,,,N,Y,25490.29,4573.10
Long Island,Suffolk,5123000,000885,Brookhaven Memorial Hospital Medical Center Inc,18 to 29,119,M,White,Not Span/Hispanic,3,Emergency,Psychiatric Hospital or Unit of Hosp,2017,661,Substance-related disorders,219,ALCO/DRUG REHAB/DETOX,772,Alcohol & drug dependence w rehab or rehab/detox therapy,20,Alcohol/Drug Use and Alcohol/Drug Induced Organic Mental Disorders,2,Moderate,Minor,Medical,Blue Cross/Blue Shield,,,,N,N,31307.09,4147.90
Long Island,Suffolk,5123000,000885,Brookhaven Memorial Hospital Medical Center Inc,50 to 69,117,M,White,Not Span/Hispanic,3,Emergency,Home or Self Care,2017,660,Alcohol-related disorders,219,ALCO/DRUG REHAB/DETOX,772,Alcohol & drug dependence w rehab or rehab/detox therapy,20,Alcohol/Drug Use and Alcohol/Drug Induced Organic Mental Disorders,1,Minor,Minor,Medical,Blue Cross/Blue Shield,,,,N,Y,24874.06,4717.76
Long Island,Suffolk,5123000,000885,Brookhaven Memorial Hospital Medical Center Inc,50 to 69,117,F,White,Not Span/Hispanic,3,Emergency,Home or Self Care,2017,660,Alcohol-related disorders,219,ALCO/DRUG REHAB/DETOX,772,Alcohol & drug dependence w rehab or rehab/detox therapy,20,Alcohol/Drug Use and Alcohol/Drug Induced Organic Mental Disorders,2,Moderate,Major,Medical,Medicare,Medicare,,,N,Y,21519.71,4102.92
Long Island,Suffolk,5123000,000885,Brookhaven Memorial Hospital Medical Center Inc,50 to 69,117,M,White,Not Span/Hispanic,2,Emergency,Home or Self Care,2017,660,Alcohol-related disorders,216,RESP INTUB/MECH VENTIL,772,Alcohol & drug dependence w rehab or rehab/detox therapy,20,Alcohol/Drug Use and Alcohol/Drug Induced Organic Mental Disorders,2,Moderate,Moderate,Medical,Private Health Insurance,,,,N,Y,41978.60,6025.35
Long Island,Suffolk,5123000,000885,Brookhaven Memorial Hospital Medical Center Inc,50 to 69,117,M,White,Not Span/Hispanic,3,Emergency,Home or Self Care,2017,660,Alcohol-related disorders,219,ALCO/DRUG REHAB/DETOX,772,Alcohol & drug dependence w rehab or rehab/detox therapy,20,Alcohol/Drug Use and Alcohol/Drug Induced Organic Mental Disorders,2,Moderate,Minor,Medical,Private Health Insurance,,,,N,Y,17649.29,3792.44
Long Island,Suffolk,5123000,000885,Brookhaven Memorial Hospital Medical Center Inc,50 to 69,117,M,White,Not Span/Hispanic,2,Emergency,Home or Self Care,2017,660,Alcohol-related disorders,219,ALCO/DRUG REHAB/DETOX,772,Alcohol & drug dependence w rehab or rehab/detox therapy,20,Alcohol/Drug Use and Alcohol/Drug Induced Organic Mental Disorders,2,Moderate,Minor,Medical,Private Health Insurance,Medicaid,,,N,Y,20386.76,3590.54
Long Island,Suffolk,5123000,000885,Brookhaven Memorial Hospital Medical Center Inc,30 to 49,117,F,White,Not Span/Hispanic,3,Emergency,Home or Self Care,2017,660,Alcohol-related disorders,219,ALCO/DRUG REHAB/DETOX,772,Alcohol & drug dependence w rehab or rehab/detox therapy,20,Alcohol/Drug Use and Alcohol/Drug Induced Organic Mental Disorders,2,Moderate,Moderate,Medical,Private Health Insurance,Private Health Insurance,Private Health Insurance,,N,Y,44992.61,4750.27
Long Island,Suffolk,5123000,000885,Brookhaven Memorial Hospital Medical Center Inc,50 to 69,117,M,Black/African American,Not Span/Hispanic,2,Emergency,Home or Self Care,2017,660,Alcohol-related disorders,219,ALCO/DRUG REHAB/DETOX,772,Alcohol & drug dependence w rehab or rehab/detox therapy,20,Alcohol/Drug Use and Alcohol/Drug Induced Organic Mental Disorders,3,Major,Moderate,Medical,Medicare,Medicare,,,N,Y,17037.38,3102.41
Long Island,Suffolk,5123000,000885,Brookhaven Memorial Hospital Medical Center Inc,70 or Older,119,M,Black/African American,Not Span/Hispanic,2,Emergency,Home or Self Care,2017,660,Alcohol-related disorders,219,ALCO/DRUG REHAB/DETOX,772,Alcohol & drug dependence w rehab or rehab/detox therapy,20,Alcohol/Drug Use and Alcohol/Drug Induced Organic Mental Disorders,2,Moderate,Minor,Medical,Medicare,Medicare,Medicaid,,N,Y,28135.40,5391.46
Long Island,Suffolk,5123000,000885,Brookhaven Memorial Hospital Medical Center Inc,18 to 29,117,F,White,Not Span/Hispanic,1,Emergency,Home or Self Care,2017,661,Substance-related disorders,219,ALCO/DRUG REHAB/DETOX,772,Alcohol & drug dependence w rehab or rehab/detox therapy,20,Alcohol/Drug Use and Alcohol/Drug Induced Organic Mental Disorders,2,Moderate,Moderate,Medical,Private Health Insurance,,,,N,Y,18291.12,1956.80
Long Island,Suffolk,5123000,000885,Brookhaven Memorial Hospital Medical Center Inc,30 to 49,117,M,White,Not Span/Hispanic,3,Emergency,Home or Self Care,2017,661,Substance-related disorders,219,ALCO/DRUG REHAB/DETOX,772,Alcohol & drug dependence w rehab or rehab/detox therapy,20,Alcohol/Drug Use and Alcohol/Drug Induced Organic Mental Disorders,2,Moderate,Minor,Medical,Private Health Insurance,,,,N,Y,19572.69,4149.49
Long Island,Suffolk,5123000,000885,Brookhaven Memorial Hospital Medical Center Inc,30 to 49,119,F,White,Not Span/Hispanic,2,Emergency,Home or Self Care,2017,661,Substance-related disorders,219,ALCO/DRUG REHAB/DETOX,772,Alcohol & drug dependence w rehab or rehab/detox therapy,20,Alcohol/Drug Use and Alcohol/Drug Induced Organic Mental Disorders,2,Moderate,Minor,Medical,Medicare,Medicare,Medicaid,,N,Y,12730.89,2749.35
Long Island,Suffolk,5123000,000885,Brookhaven Memorial Hospital Medical Center Inc,30 to 49,117,M,White,Not Span/Hispanic,2,Emergency,Home or Self Care,2017,660,Alcohol-related disorders,219,ALCO/DRUG REHAB/DETOX,772,Alcohol & drug dependence w rehab or rehab/detox therapy,20,Alcohol/Drug Use and Alcohol/Drug Induced Organic Mental Disorders,2,Moderate,Minor,Medical,Private Health Insurance,,,,N,Y,14493.30,2853.35
Long Island,Suffolk,5123000,000885,Brookhaven Memorial Hospital Medical Center Inc,30 to 49,117,M,White,Not Span/Hispanic,2,Emergency,Home or Self Care,2017,660,Alcohol-related disorders,219,ALCO/DRUG REHAB/DETOX,772,Alcohol & drug dependence w rehab or rehab/detox therapy,20,Alcohol/Drug Use and Alcohol/Drug Induced Organic Mental Disorders,2,Moderate,Minor,Medical,Private Health Insurance,,,,N,Y,16085.32,3097.00
Long Island,Suffolk,5123000,000885,Brookhaven Memorial Hospital Medical Center Inc,50 to 69,117,M,White,Not Span/Hispanic,3,Emergency,Home or Self Care,2017,660,Alcohol-related disorders,219,ALCO/DRUG REHAB/DETOX,772,Alcohol & drug dependence w rehab or rehab/detox therapy,20,Alcohol/Drug Use and Alcohol/Drug Induced Organic Mental Disorders,3,Major,Moderate,Medical,Medicare,Medicare,Medicaid,,N,Y,21735.11,4192.69
Long Island,Suffolk,5123000,000885,Brookhaven Memorial Hospital Medical Center Inc,50 to 69,117,F,White,Not Span/Hispanic,3,Emergency,Home or Self Care,2017,660,Alcohol-related disorders,219,ALCO/DRUG REHAB/DETOX,772,Alcohol & drug dependence w rehab or rehab/detox therapy,20,Alcohol/Drug Use and Alcohol/Drug Induced Organic Mental Disorders,2,Moderate,Minor,Medical,Self-Pay,,,,N,Y,32287.05,4440.87
Long Island,Suffolk,5123000,000885,Brookhaven Memorial Hospital Medical Center Inc,50 to 69,119,F,White,Not Span/Hispanic,2,Emergency,Home or Self Care,2017,660,Alcohol-related disorders,219,ALCO/DRUG REHAB/DETOX,772,Alcohol & drug dependence w rehab or rehab/detox therapy,20,Alcohol/Drug Use and Alcohol/Drug Induced Organic Mental Disorders,2,Moderate,Minor,Medical,Private Health Insurance,,,,N,Y,44234.80,3897.82
Long Island,Suffolk,5123000,000885,Brookhaven Memorial Hospital Medical Center Inc,30 to 49,117,M,White,Not Span/Hispanic,3,Emergency,Home or Self Care,2017,660,Alcohol-related disorders,219,ALCO/DRUG REHAB/DETOX,772,Alcohol & drug dependence w rehab or rehab/detox therapy,20,Alcohol/Drug Use and Alcohol/Drug Induced Organic Mental Disorders,2,Moderate,Minor,Medical,Blue Cross/Blue Shield,,,,N,Y,20197.04,4141.67
Long Island,Suffolk,5123000,000885,Brookhaven Memorial Hospital Medical Center Inc,50 to 69,117,M,White,Not Span/Hispanic,2,Emergency,Home or Self Care,2017,660,Alcohol-related disorders,219,ALCO/DRUG REHAB/DETOX,772,Alcohol & drug dependence w rehab or rehab/detox therapy,20,Alcohol/Drug Use and Alcohol/Drug Induced Organic Mental Disorders,2,Moderate,Moderate,Medical,Medicare,Medicare,Medicaid,,N,Y,14553.79,2835.69
Long Island,Suffolk,5123000,000885,Brookhaven Memorial Hospital Medical Center Inc,30 to 49,119,F,White,Not Span/Hispanic,3,Emergency,Home or Self Care,2017,660,Alcohol-related disorders,219,ALCO/DRUG REHAB/DETOX,772,Alcohol & drug dependence w rehab or rehab/detox therapy,20,Alcohol/Drug Use and Alcohol/Drug Induced Organic Mental Disorders,2,Moderate,Minor,Medical,Private Health Insurance,,,,N,Y,25663.82,4010.36
Long Island,Suffolk,5123000,000885,Brookhaven Memorial Hospital Medical Center Inc,50 to 69,117,M,White,Not Span/Hispanic,2,Emergency,Home or Self Care,2017,660,Alcohol-related disorders,219,ALCO/DRUG REHAB/DETOX,772,Alcohol & drug dependence w rehab or rehab/detox therapy,20,Alcohol/Drug Use and Alcohol/Drug Induced Organic Mental Disorders,2,Moderate,Minor,Medical,Private Health Insurance,Medicaid,,,N,Y,14048.40,2801.22
Long Island,Suffolk,5123000,000885,Brookhaven Memorial Hospital Medical Center Inc,30 to 49,117,M,White,Not Span/Hispanic,3,Emergency,Home or Self Care,2017,660,Alcohol-related disorders,219,ALCO/DRUG REHAB/DETOX,772,Alcohol & drug dependence w rehab or rehab/detox therapy,20,Alcohol/Drug Use and Alcohol/Drug Induced Organic Mental Disorders,2,Moderate,Moderate,Medical,Medicaid,,,,N,Y,22438.60,4186.10
Long Island,Suffolk,5123000,000885,Brookhaven Memorial Hospital Medical Center Inc,30 to 49,117,M,White,Not Span/Hispanic,2,Emergency,Home or Self Care,2017,660,Alcohol-related disorders,219,ALCO/DRUG REHAB/DETOX,772,Alcohol & drug dependence w rehab or rehab/detox therapy,20,Alcohol/Drug Use and Alcohol/Drug Induced Organic Mental Disorders,1,Minor,Minor,Medical,Private Health Insurance,Medicaid,,,N,Y,13154.29,2690.16
Long Island,Suffolk,5123000,000885,Brookhaven Memorial Hospital Medical Center Inc,50 to 69,119,M,White,Not Span/Hispanic,1,Emergency,Psychiatric Hospital or Unit of Hosp,2017,660,Alcohol-related disorders,219,ALCO/DRUG REHAB/DETOX,772,Alcohol & drug dependence w rehab or rehab/detox therapy,20,Alcohol/Drug Use and Alcohol/Drug Induced Organic Mental Disorders,2,Moderate,Minor,Medical,Private Health Insurance,Medicaid,,,N,Y,9415.78,1631.61
Long Island,Suffolk,5123000,000885,Brookhaven Memorial Hospital Medical Center Inc,30 to 49,119,M,Black/African American,Not Span/Hispanic,3,Emergency,Home or Self Care,2017,660,Alcohol-related disorders,219,ALCO/DRUG REHAB/DETOX,772,Alcohol & drug dependence w rehab or rehab/detox therapy,20,Alcohol/Drug Use and Alcohol/Drug Induced Organic Mental Disorders,2,Moderate,Minor,Medical,Private Health Insurance,Medicaid,,,N,Y,21722.24,4092.96
Long Island,Suffolk,5123000,000885,Brookhaven Memorial Hospital Medical Center Inc,50 to 69,119,F,White,Not Span/Hispanic,6,Emergency,Home w/ Home Health Services,2017,660,Alcohol-related disorders,219,ALCO/DRUG REHAB/DETOX,772,Alcohol & drug dependence w rehab or rehab/detox therapy,20,Alcohol/Drug Use and Alcohol/Drug Induced Organic Mental Disorders,2,Moderate,Minor,Medical,Private Health Insurance,,,,N,Y,35943.18,7500.59
