Hospital Service Area,Hospital County,Operating Certificate Number,Permanent Facility Id,Facility Name,Age Group,Zip Code - 3 digits,Gender,Race,Ethnicity,Length of Stay,Type of Admission,Patient Disposition,Discharge Year,CCS Diagnosis Code,CCS Diagnosis Description,CCS Procedure Code,CCS Procedure Description,APR DRG Code,APR DRG Description,APR MDC Code,APR MDC Description,APR Severity of Illness Code,APR Severity of Illness Description,APR Risk of Mortality,APR Medical Surgical Description,Payment Typology 1,Payment Typology 2,Payment Typology 3,Birth Weight,Abortion Edit Indicator,Emergency Department Indicator,Total Charges,Total Costs
Hudson Valley,Westchester,5907001,001099,SJRH - Park Care Pavilion,50 to 69,107,F,Black/African American,Not Span/Hispanic,14,Emergency,Home or Self Care,2018,MBD017,ALCOHOL-RELATED DISORDERS,SUD004,COUNSELING FOR SUBSTANCE USE,772,ALCOHOL & DRUG DEPENDENCE W REHAB OR REHAB/DETOX THERAPY,20,ALCOHOL/DRUG USE AND ALCOHOL/DRUG INDUCED ORGANIC MENTAL DISORDERS,2,Moderate,Minor,Medical,Medicaid,,,,,false,25365.74,7086.34
Hudson Valley,Westchester,5907001,001099,SJRH - Park Care Pavilion,30 to 49,108,F,Black/African American,Spanish/Hispanic,17,Emergency,Home or Self Care,2018,MBD017,ALCOHOL-RELATED DISORDERS,SUD004,COUNSELING FOR SUBSTANCE USE,772,ALCOHOL & DRUG DEPENDENCE W REHAB OR REHAB/DETOX THERAPY,20,ALCOHOL/DRUG USE AND ALCOHOL/DRUG INDUCED ORGANIC MENTAL DISORDERS,2,Moderate,Minor,Medical,Medicaid,,,,,false,30625.64,8573.99
Hudson Valley,Westchester,5907001,001099,SJRH - Park Care Pavilion,70 or Older,104,F,Black/African American,Not Span/Hispanic,13,Emergency,Home or Self Care,2018,MBD018,OPIOID-RELATED DISORDERS,SUD004,COUNSELING FOR SUBSTANCE USE,772,ALCOHOL & DRUG DEPENDENCE W REHAB OR REHAB/DETOX THERAPY,20,ALCOHOL/DRUG USE AND ALCOHOL/DRUG INDUCED ORGANIC MENTAL DISORDERS,2,Moderate,Minor,Medical,Medicare,,,,,false,24245.43,6725.29
Hudson Valley,Westchester,5907001,001099,SJRH - Park Care Pavilion,30 to 49,104,F,Black/African American,Not Span/Hispanic,14,Emergency,Home or Self Care,2018,MBD017,ALCOHOL-RELATED DISORDERS,SUD004,COUNSELING FOR SUBSTANCE USE,772,ALCOHOL & DRUG DEPENDENCE W REHAB OR REHAB/DETOX THERAPY,20,ALCOHOL/DRUG USE AND ALCOHOL/DRUG INDUCED ORGANIC MENTAL DISORDERS,2,Moderate,Minor,Medical,Medicaid,,,,,false,25591.57,7265.76
Hudson Valley,Westchester,5907001,001099,SJRH - Park Care Pavilion,30 to 49,100,M,Black/African American,Not Span/Hispanic,13,Emergency,Home or Self Care,2018,MBD017,ALCOHOL-RELATED DISORDERS,SUD004,COUNSELING FOR SUBSTANCE USE,772,ALCOHOL & DRUG DEPENDENCE W REHAB OR REHAB/DETOX THERAPY,20,ALCOHOL/DRUG USE AND ALCOHOL/DRUG INDUCED ORGANIC MENTAL DISORDERS,2,Moderate,Minor,Medical,Medicaid,,,,,false,24742.27,6807.88
New York City,Queens,7003001,001628,Flushing Hospital Medical Center,50 to 69,113,M,White,Not Span/Hispanic,3,Emergency,Home or Self Care,2018,MBD017,ALCOHOL-RELATED DISORDERS,SUD004,COUNSELING FOR SUBSTANCE USE,772,ALCOHOL & DRUG DEPENDENCE W REHAB OR REHAB/DETOX THERAPY,20,ALCOHOL/DRUG USE AND ALCOHOL/DRUG INDUCED ORGANIC MENTAL DISORDERS,2,Moderate,Minor,Medical,Medicare,Medicaid,,,,true,8378,2447.45
New York City,Queens,7003001,001628,Flushing Hospital Medical Center,18 to 29,113,M,White,Not Span/Hispanic,4,Emergency,Home or Self Care,2018,MBD018,OPIOID-RELATED DISORDERS,SUD001,SUBSTANCE USE DETOXIFICATION,772,ALCOHOL & DRUG DEPENDENCE W REHAB OR REHAB/DETOX THERAPY,20,ALCOHOL/DRUG USE AND ALCOHOL/DRUG INDUCED ORGANIC MENTAL DISORDERS,1,Minor,Minor,Medical,Medicaid,,,,,true,10123,2884.04
Long Island,Nassau,2950002,000528,Nassau University Medical Center,30 to 49,115,M,Black/African American,Not Span/Hispanic,28,Urgent,Home or Self Care,2018,MBD017,ALCOHOL-RELATED DISORDERS,SUD004,COUNSELING FOR SUBSTANCE USE,772,ALCOHOL & DRUG DEPENDENCE W REHAB OR REHAB/DETOX THERAPY,20,ALCOHOL/DRUG USE AND ALCOHOL/DRUG INDUCED ORGANIC MENTAL DISORDERS,1,Minor,Minor,Medical,Medicaid,Medicaid,Self-Pay,,,false,152955.19,55108.56
New York City,Queens,7003001,001628,Flushing Hospital Medical Center,50 to 69,107,M,White,Not Span/Hispanic,5,Emergency,Home or Self Care,2018,MBD017,ALCOHOL-RELATED DISORDERS,SUD001,SUBSTANCE USE DETOXIFICATION,772,ALCOHOL & DRUG DEPENDENCE W REHAB OR REHAB/DETOX THERAPY,20,ALCOHOL/DRUG USE AND ALCOHOL/DRUG INDUCED ORGANIC MENTAL DISORDERS,2,Moderate,Minor,Medical,Medicaid,,,,,true,14440,3619.13
Hudson Valley,Westchester,5907001,001099,SJRH - Park Care Pavilion,50 to 69,112,M,White,Not Span/Hispanic,20,Emergency,Home or Self Care,2018,MBD020,SEDATIVE-RELATED DISORDERS,SUD004,COUNSELING FOR SUBSTANCE USE,772,ALCOHOL & DRUG DEPENDENCE W REHAB OR REHAB/DETOX THERAPY,20,ALCOHOL/DRUG USE AND ALCOHOL/DRUG INDUCED ORGANIC MENTAL DISORDERS,2,Moderate,Minor,Medical,Medicaid,,,,,false,36385.49,10283.51
Hudson Valley,Westchester,7002054,001047,New York-Presbyterian Westchester Behavioral Health Center,50 to 69,125,M,White,Not Span/Hispanic,20,Elective,Home or Self Care,2018,MBD017,ALCOHOL-RELATED DISORDERS,SUD004,COUNSELING FOR SUBSTANCE USE,772,ALCOHOL & DRUG DEPENDENCE W REHAB OR REHAB/DETOX THERAPY,20,ALCOHOL/DRUG USE AND ALCOHOL/DRUG INDUCED ORGANIC MENTAL DISORDERS,2,Moderate,Minor,Medical,Medicare,Self-Pay,,,,false,109390.12,28288.44
Hudson Valley,Westchester,7002054,001047,New York-Presbyterian Westchester Behavioral Health Center,30 to 49,108,M,White,Not Span/Hispanic,13,Elective,Home or Self Care,2018,MBD018,OPIOID-RELATED DISORDERS,SUD002,PHARMACOTHERAPY FOR SUBSTANCE USE,772,ALCOHOL & DRUG DEPENDENCE W REHAB OR REHAB/DETOX THERAPY,20,ALCOHOL/DRUG USE AND ALCOHOL/DRUG INDUCED ORGANIC MENTAL DISORDERS,3,Major,Moderate,Medical,"Managed Care, Unspecified",Medicaid,Self-Pay,,,false,71858.06,18470.23
,,,,Redacted for Confidentiality,18 to 29,,M,White,Unknown,1,Emergency,Home or Self Care,2018,MBD017,ALCOHOL-RELATED DISORDERS,SUD001,SUBSTANCE USE DETOXIFICATION,772,ALCOHOL & DRUG DEPENDENCE W REHAB OR REHAB/DETOX THERAPY,20,ALCOHOL/DRUG USE AND ALCOHOL/DRUG INDUCED ORGANIC MENTAL DISORDERS,2,Moderate,Minor,Medical,Medicaid,,,,,true,4000,1205.56
Hudson Valley,Westchester,7002054,001047,New York-Presbyterian Westchester Behavioral Health Center,30 to 49,,M,Multi-racial,Not Span/Hispanic,17,Elective,Home or Self Care,2018,MBD021,STIMULANT-RELATED DISORDERS,SUD002,PHARMACOTHERAPY FOR SUBSTANCE USE,772,ALCOHOL & DRUG DEPENDENCE W REHAB OR REHAB/DETOX THERAPY,20,ALCOHOL/DRUG USE AND ALCOHOL/DRUG INDUCED ORGANIC MENTAL DISORDERS,2,Moderate,Minor,Medical,"Managed Care, Unspecified",Medicaid,Self-Pay,,,false,94544.03,24354.93
Hudson Valley,Westchester,5907001,001099,SJRH - Park Care Pavilion,50 to 69,100,M,Black/African American,Not Span/Hispanic,2,Emergency,Home or Self Care,2018,MBD018,OPIOID-RELATED DISORDERS,SUD004,COUNSELING FOR SUBSTANCE USE,772,ALCOHOL & DRUG DEPENDENCE W REHAB OR REHAB/DETOX THERAPY,20,ALCOHOL/DRUG USE AND ALCOHOL/DRUG INDUCED ORGANIC MENTAL DISORDERS,2,Moderate,Minor,Medical,Medicaid,,,,,false,4090.12,1066.09
Hudson Valley,Rockland,4324000,000776,Montefiore Nyack,18 to 29,125,M,White,Not Span/Hispanic,5,Emergency,Home or Self Care,2018,MBD018,OPIOID-RELATED DISORDERS,SUD001,SUBSTANCE USE DETOXIFICATION,772,ALCOHOL & DRUG DEPENDENCE W REHAB OR REHAB/DETOX THERAPY,20,ALCOHOL/DRUG USE AND ALCOHOL/DRUG INDUCED ORGANIC MENTAL DISORDERS,1,Minor,Minor,Medical,Medicaid,,,,,false,17326.82,4485.02
Long Island,Suffolk,5149001,000896,St. Charles Hospital,30 to 49,119,M,White,Not Span/Hispanic,4,Emergency,Home or Self Care,2018,MBD018,OPIOID-RELATED DISORDERS,SUD001,SUBSTANCE USE DETOXIFICATION,772,ALCOHOL & DRUG DEPENDENCE W REHAB OR REHAB/DETOX THERAPY,20,ALCOHOL/DRUG USE AND ALCOHOL/DRUG INDUCED ORGANIC MENTAL DISORDERS,2,Moderate,Minor,Medical,Medicaid,,,,,true,21458,3517.92
Long Island,Suffolk,5149001,000896,St. Charles Hospital,30 to 49,117,F,White,Not Span/Hispanic,4,Emergency,Home or Self Care,2018,MBD020,SEDATIVE-RELATED DISORDERS,SUD001,SUBSTANCE USE DETOXIFICATION,772,ALCOHOL & DRUG DEPENDENCE W REHAB OR REHAB/DETOX THERAPY,20,ALCOHOL/DRUG USE AND ALCOHOL/DRUG INDUCED ORGANIC MENTAL DISORDERS,1,Minor,Minor,Medical,Medicaid,,,,,true,23561,3936.03
Long Island,Suffolk,5149001,000896,St. Charles Hospital,30 to 49,115,F,Black/African American,Not Span/Hispanic,21,Elective,Home or Self Care,2018,MBD017,ALCOHOL-RELATED DISORDERS,SUD004,COUNSELING FOR SUBSTANCE USE,772,ALCOHOL & DRUG DEPENDENCE W REHAB OR REHAB/DETOX THERAPY,20,ALCOHOL/DRUG USE AND ALCOHOL/DRUG INDUCED ORGANIC MENTAL DISORDERS,2,Moderate,Minor,Medical,Medicaid,,,,,false,104817,20743.48
New York City,Richmond,7004003,001737,Staten Island University Hospital Prince's Bay,30 to 49,103,M,White,Not Span/Hispanic,19,Elective,Home or Self Care,2018,MBD018,OPIOID-RELATED DISORDERS,SUD004,COUNSELING FOR SUBSTANCE USE,772,ALCOHOL & DRUG DEPENDENCE W REHAB OR REHAB/DETOX THERAPY,20,ALCOHOL/DRUG USE AND ALCOHOL/DRUG INDUCED ORGANIC MENTAL DISORDERS,1,Minor,Minor,Medical,Medicare,Medicare,Medicaid,,,false,94122.96,20810.24
New York City,Richmond,7004003,001737,Staten Island University Hospital Prince's Bay,30 to 49,103,M,White,Not Span/Hispanic,13,Elective,Home or Self Care,2018,MBD018,OPIOID-RELATED DISORDERS,SUD004,COUNSELING FOR SUBSTANCE USE,772,ALCOHOL & DRUG DEPENDENCE W REHAB OR REHAB/DETOX THERAPY,20,ALCOHOL/DRUG USE AND ALCOHOL/DRUG INDUCED ORGANIC MENTAL DISORDERS,2,Moderate,Minor,Medical,Medicaid,Medicaid,,,,false,64411.92,43900.25
New York City,Richmond,7004003,001737,Staten Island University Hospital Prince's Bay,30 to 49,103,F,White,Not Span/Hispanic,10,Elective,Home or Self Care,2018,MBD017,ALCOHOL-RELATED DISORDERS,SUD004,COUNSELING FOR SUBSTANCE USE,772,ALCOHOL & DRUG DEPENDENCE W REHAB OR REHAB/DETOX THERAPY,20,ALCOHOL/DRUG USE AND ALCOHOL/DRUG INDUCED ORGANIC MENTAL DISORDERS,1,Minor,Minor,Medical,Medicaid,Medicaid,,,,false,47500,10660.44
Southern Tier,Broome,0303001,000042,United Health Services Hospitals Inc. - Binghamton General Hospital,30 to 49,139,M,White,Not Span/Hispanic,13,Elective,Home or Self Care,2018,MBD019,CANNABIS-RELATED DISORDERS,SUD004,COUNSELING FOR SUBSTANCE USE,772,ALCOHOL & DRUG DEPENDENCE W REHAB OR REHAB/DETOX THERAPY,20,ALCOHOL/DRUG USE AND ALCOHOL/DRUG INDUCED ORGANIC MENTAL DISORDERS,2,Moderate,Minor,Medical,Medicaid,Medicaid,,,,false,13280.2,5106.5
New York City,Bronx,7000002,001165,Jacobi Medical Center,30 to 49,112,M,Other Race,Spanish/Hispanic,5,Elective,Home or Self Care,2018,MBD017,ALCOHOL-RELATED DISORDERS,SUD001,SUBSTANCE USE DETOXIFICATION,772,ALCOHOL & DRUG DEPENDENCE W REHAB OR REHAB/DETOX THERAPY,20,ALCOHOL/DRUG USE AND ALCOHOL/DRUG INDUCED ORGANIC MENTAL DISORDERS,1,Minor,Minor,Medical,Medicare,,,,,false,9521.45,5633.37
New York City,Bronx,7000002,001165,Jacobi Medical Center,30 to 49,104,M,White,Not Span/Hispanic,3,Elective,Home or Self Care,2018,MBD017,ALCOHOL-RELATED DISORDERS,SUD001,SUBSTANCE USE DETOXIFICATION,772,ALCOHOL & DRUG DEPENDENCE W REHAB OR REHAB/DETOX THERAPY,20,ALCOHOL/DRUG USE AND ALCOHOL/DRUG INDUCED ORGANIC MENTAL DISORDERS,2,Moderate,Moderate,Medical,Medicaid,,,,,false,5960.47,3526.51
New York City,Richmond,7004003,001737,Staten Island University Hospital Prince's Bay,18 to 29,103,F,White,Not Span/Hispanic,16,Elective,Home or Self Care,2018,MBD020,SEDATIVE-RELATED DISORDERS,SUD004,COUNSELING FOR SUBSTANCE USE,772,ALCOHOL & DRUG DEPENDENCE W REHAB OR REHAB/DETOX THERAPY,20,ALCOHOL/DRUG USE AND ALCOHOL/DRUG INDUCED ORGANIC MENTAL DISORDERS,2,Moderate,Minor,Medical,Medicaid,Medicaid,,,,false,68854.72,15451.67
New York City,Richmond,7004003,001737,Staten Island University Hospital Prince's Bay,50 to 69,103,M,White,Not Span/Hispanic,21,Elective,Home or Self Care,2018,MBD018,OPIOID-RELATED DISORDERS,SUD004,COUNSELING FOR SUBSTANCE USE,772,ALCOHOL & DRUG DEPENDENCE W REHAB OR REHAB/DETOX THERAPY,20,ALCOHOL/DRUG USE AND ALCOHOL/DRUG INDUCED ORGANIC MENTAL DISORDERS,1,Minor,Minor,Medical,Medicaid,Medicaid,,,,false,91345.47,20473.5
Hudson Valley,Dutchess,5957001,000180,Mid-Hudson Valley Division of Westchester Medical Center,30 to 49,125,F,Other Race,Not Span/Hispanic,14,Elective,Home or Self Care,2018,MBD017,ALCOHOL-RELATED DISORDERS,SUD004,COUNSELING FOR SUBSTANCE USE,772,ALCOHOL & DRUG DEPENDENCE W REHAB OR REHAB/DETOX THERAPY,20,ALCOHOL/DRUG USE AND ALCOHOL/DRUG INDUCED ORGANIC MENTAL DISORDERS,2,Moderate,Minor,Medical,Medicaid,,,,,false,73958.59,13505.25
Hudson Valley,Dutchess,5957001,000180,Mid-Hudson Valley Division of Westchester Medical Center,50 to 69,125,F,White,Not Span/Hispanic,11,Emergency,Home or Self Care,2018,MBD017,ALCOHOL-RELATED DISORDERS,SUD001,SUBSTANCE USE DETOXIFICATION,772,ALCOHOL & DRUG DEPENDENCE W REHAB OR REHAB/DETOX THERAPY,20,ALCOHOL/DRUG USE AND ALCOHOL/DRUG INDUCED ORGANIC MENTAL DISORDERS,2,Moderate,Moderate,Medical,Private Health Insurance,,,,,true,67913.96,12196.86
Western NY,Erie,1401005,000210,Erie County Medical Center,30 to 49,141,F,White,Not Span/Hispanic,20,Elective,Home or Self Care,2018,MBD017,ALCOHOL-RELATED DISORDERS,SUD004,COUNSELING FOR SUBSTANCE USE,772,ALCOHOL & DRUG DEPENDENCE W REHAB OR REHAB/DETOX THERAPY,20,ALCOHOL/DRUG USE AND ALCOHOL/DRUG INDUCED ORGANIC MENTAL DISORDERS,2,Moderate,Minor,Medical,Medicaid,Medicaid,,,,false,19567.94,16440.17
Capital/Adirond,Rensselaer,4102003,000755,Samaritan Hospital - St. Mary's Campus,50 to 69,121,M,White,Not Span/Hispanic,14,Urgent,Home or Self Care,2018,MBD017,ALCOHOL-RELATED DISORDERS,SUD004,COUNSELING FOR SUBSTANCE USE,772,ALCOHOL & DRUG DEPENDENCE W REHAB OR REHAB/DETOX THERAPY,20,ALCOHOL/DRUG USE AND ALCOHOL/DRUG INDUCED ORGANIC MENTAL DISORDERS,1,Minor,Minor,Medical,Medicaid,,,,,false,20630.79,8760.99
Capital/Adirond,Rensselaer,4102003,000755,Samaritan Hospital - St. Mary's Campus,18 to 29,121,M,Black/African American,Not Span/Hispanic,13,Urgent,Short-term Hospital,2018,MBD019,CANNABIS-RELATED DISORDERS,SUD004,COUNSELING FOR SUBSTANCE USE,772,ALCOHOL & DRUG DEPENDENCE W REHAB OR REHAB/DETOX THERAPY,20,ALCOHOL/DRUG USE AND ALCOHOL/DRUG INDUCED ORGANIC MENTAL DISORDERS,2,Moderate,Minor,Medical,Private Health Insurance,Private Health Insurance,,,,false,18700.65,8037.83
Hudson Valley,Orange,3535001,000708,Bon Secours Community Hospital,18 to 29,109,M,White,Not Span/Hispanic,14,Elective,Home or Self Care,2018,MBD018,OPIOID-RELATED DISORDERS,SUD004,COUNSELING FOR SUBSTANCE USE,772,ALCOHOL & DRUG DEPENDENCE W REHAB OR REHAB/DETOX THERAPY,20,ALCOHOL/DRUG USE AND ALCOHOL/DRUG INDUCED ORGANIC MENTAL DISORDERS,2,Moderate,Minor,Medical,Medicaid,,,,,false,81504.36,15381.73
Capital/Adirond,Rensselaer,4102003,000755,Samaritan Hospital - St. Mary's Campus,30 to 49,120,M,White,Not Span/Hispanic,2,Urgent,Short-term Hospital,2018,MBD021,STIMULANT-RELATED DISORDERS,SUD004,COUNSELING FOR SUBSTANCE USE,772,ALCOHOL & DRUG DEPENDENCE W REHAB OR REHAB/DETOX THERAPY,20,ALCOHOL/DRUG USE AND ALCOHOL/DRUG INDUCED ORGANIC MENTAL DISORDERS,2,Moderate,Minor,Medical,Medicaid,,,,,false,4316.85,1619.63
Capital/Adirond,Rensselaer,4102003,000755,Samaritan Hospital - St. Mary's Campus,50 to 69,122,M,White,Not Span/Hispanic,11,Urgent,Home or Self Care,2018,MBD017,ALCOHOL-RELATED DISORDERS,SUD004,COUNSELING FOR SUBSTANCE USE,772,ALCOHOL & DRUG DEPENDENCE W REHAB OR REHAB/DETOX THERAPY,20,ALCOHOL/DRUG USE AND ALCOHOL/DRUG INDUCED ORGANIC MENTAL DISORDERS,2,Moderate,Minor,Medical,Medicaid,,,,,false,15949.15,6806.13
Capital/Adirond,Rensselaer,4102003,000755,Samaritan Hospital - St. Mary's Campus,30 to 49,120,M,White,Not Span/Hispanic,1,Elective,Home or Self Care,2018,MBD021,STIMULANT-RELATED DISORDERS,SUD004,COUNSELING FOR SUBSTANCE USE,772,ALCOHOL & DRUG DEPENDENCE W REHAB OR REHAB/DETOX THERAPY,20,ALCOHOL/DRUG USE AND ALCOHOL/DRUG INDUCED ORGANIC MENTAL DISORDERS,1,Minor,Minor,Medical,Medicaid,,,,,false,1807.4,685.72
Capital/Adirond,Rensselaer,4102003,000755,Samaritan Hospital - St. Mary's Campus,30 to 49,120,M,White,Not Span/Hispanic,10,Urgent,Home or Self Care,2018,MBD021,STIMULANT-RELATED DISORDERS,SUD004,COUNSELING FOR SUBSTANCE USE,772,ALCOHOL & DRUG DEPENDENCE W REHAB OR REHAB/DETOX THERAPY,20,ALCOHOL/DRUG USE AND ALCOHOL/DRUG INDUCED ORGANIC MENTAL DISORDERS,1,Minor,Minor,Medical,Medicaid,,,,,false,14204.55,6069.2
New York City,Kings,7001009,001294,Coney Island Hospital,30 to 49,112,M,White,Not Span/Hispanic,4,Emergency,Home or Self Care,2018,MBD018,OPIOID-RELATED DISORDERS,SUD001,SUBSTANCE USE DETOXIFICATION,772,ALCOHOL & DRUG DEPENDENCE W REHAB OR REHAB/DETOX THERAPY,20,ALCOHOL/DRUG USE AND ALCOHOL/DRUG INDUCED ORGANIC MENTAL DISORDERS,1,Minor,Minor,Medical,Medicaid,Medicaid,,,,true,9543.64,5341.85
New York City,Kings,7001016,001301,Kings County Hospital Center,50 to 69,112,M,Black/African American,Not Span/Hispanic,4,Emergency,Home or Self Care,2018,MBD017,ALCOHOL-RELATED DISORDERS,SUD001,SUBSTANCE USE DETOXIFICATION,772,ALCOHOL & DRUG DEPENDENCE W REHAB OR REHAB/DETOX THERAPY,20,ALCOHOL/DRUG USE AND ALCOHOL/DRUG INDUCED ORGANIC MENTAL DISORDERS,1,Minor,Minor,Medical,Medicaid,,,,,false,7040.44,5001.25
Long Island,Suffolk,5149001,000896,St. Charles Hospital,50 to 69,117,F,White,Not Span/Hispanic,4,Emergency,Short-term Hospital,2018,MBD017,ALCOHOL-RELATED DISORDERS,SUD001,SUBSTANCE USE DETOXIFICATION,772,ALCOHOL & DRUG DEPENDENCE W REHAB OR REHAB/DETOX THERAPY,20,ALCOHOL/DRUG USE AND ALCOHOL/DRUG INDUCED ORGANIC MENTAL DISORDERS,2,Moderate,Minor,Medical,Medicare,Medicare,,,,true,19769,3276.6
Long Island,Suffolk,5149001,000896,St. Charles Hospital,50 to 69,117,M,White,Not Span/Hispanic,4,Emergency,Home or Self Care,2018,MBD017,ALCOHOL-RELATED DISORDERS,SUD001,SUBSTANCE USE DETOXIFICATION,772,ALCOHOL & DRUG DEPENDENCE W REHAB OR REHAB/DETOX THERAPY,20,ALCOHOL/DRUG USE AND ALCOHOL/DRUG INDUCED ORGANIC MENTAL DISORDERS,2,Moderate,Moderate,Medical,Medicaid,Medicaid,,,,true,19989,3299.44
Long Island,Suffolk,5149001,000896,St. Charles Hospital,30 to 49,119,M,White,Not Span/Hispanic,20,Elective,Home or Self Care,2018,MBD017,ALCOHOL-RELATED DISORDERS,SUD004,COUNSELING FOR SUBSTANCE USE,772,ALCOHOL & DRUG DEPENDENCE W REHAB OR REHAB/DETOX THERAPY,20,ALCOHOL/DRUG USE AND ALCOHOL/DRUG INDUCED ORGANIC MENTAL DISORDERS,2,Moderate,Minor,Medical,Medicaid,Medicaid,,,,false,86738,16893.02
Long Island,Suffolk,5149001,000896,St. Charles Hospital,30 to 49,117,M,White,Not Span/Hispanic,4,Emergency,Home or Self Care,2018,MBD017,ALCOHOL-RELATED DISORDERS,SUD001,SUBSTANCE USE DETOXIFICATION,772,ALCOHOL & DRUG DEPENDENCE W REHAB OR REHAB/DETOX THERAPY,20,ALCOHOL/DRUG USE AND ALCOHOL/DRUG INDUCED ORGANIC MENTAL DISORDERS,1,Minor,Minor,Medical,Medicaid,,,,,true,20972,3412.99
Western NY,Niagara,3101000,000565,Eastern Niagara Hospital - Lockport Division,18 to 29,140,F,Black/African American,Not Span/Hispanic,28,Elective,Home or Self Care,2018,MBD019,CANNABIS-RELATED DISORDERS,SUD004,COUNSELING FOR SUBSTANCE USE,772,ALCOHOL & DRUG DEPENDENCE W REHAB OR REHAB/DETOX THERAPY,20,ALCOHOL/DRUG USE AND ALCOHOL/DRUG INDUCED ORGANIC MENTAL DISORDERS,1,Minor,Minor,Medical,Medicaid,,,,,false,42609.68,8939.27
Western NY,Niagara,3101000,000565,Eastern Niagara Hospital - Lockport Division,30 to 49,141,M,White,Not Span/Hispanic,28,Elective,Home or Self Care,2018,MBD018,OPIOID-RELATED DISORDERS,SUD004,COUNSELING FOR SUBSTANCE USE,772,ALCOHOL & DRUG DEPENDENCE W REHAB OR REHAB/DETOX THERAPY,20,ALCOHOL/DRUG USE AND ALCOHOL/DRUG INDUCED ORGANIC MENTAL DISORDERS,2,Moderate,Minor,Medical,Medicaid,,,,,false,48053.9,10738.36
New York City,Queens,7003001,001628,Flushing Hospital Medical Center,18 to 29,114,M,Other Race,Not Span/Hispanic,5,Emergency,Home or Self Care,2018,MBD018,OPIOID-RELATED DISORDERS,SUD001,SUBSTANCE USE DETOXIFICATION,772,ALCOHOL & DRUG DEPENDENCE W REHAB OR REHAB/DETOX THERAPY,20,ALCOHOL/DRUG USE AND ALCOHOL/DRUG INDUCED ORGANIC MENTAL DISORDERS,1,Minor,Minor,Medical,Private Health Insurance,Medicaid,,,,true,12440,3560.08
New York City,Bronx,7000001,001164,BronxCare Hospital Center,50 to 69,100,F,Other Race,Unknown,14,Elective,Home or Self Care,2018,MBD018,OPIOID-RELATED DISORDERS,SUD003,PSYCHOTHERAPY FOR SUBSTANCE USE,772,ALCOHOL & DRUG DEPENDENCE W REHAB OR REHAB/DETOX THERAPY,20,ALCOHOL/DRUG USE AND ALCOHOL/DRUG INDUCED ORGANIC MENTAL DISORDERS,2,Moderate,Minor,Medical,Medicaid,Medicaid,,,,false,15822.74,12886.28
New York City,Bronx,7000001,001164,BronxCare Hospital Center,50 to 69,104,M,White,Not Span/Hispanic,1,Elective,Short-term Hospital,2018,MBD017,ALCOHOL-RELATED DISORDERS,SUD001,SUBSTANCE USE DETOXIFICATION,772,ALCOHOL & DRUG DEPENDENCE W REHAB OR REHAB/DETOX THERAPY,20,ALCOHOL/DRUG USE AND ALCOHOL/DRUG INDUCED ORGANIC MENTAL DISORDERS,1,Minor,Minor,Medical,Medicaid,,,,,false,4108.81,3493.02
New York City,Bronx,7000001,001164,BronxCare Hospital Center,50 to 69,104,M,Black/African American,Not Span/Hispanic,14,Elective,Home or Self Care,2018,MBD017,ALCOHOL-RELATED DISORDERS,SUD004,COUNSELING FOR SUBSTANCE USE,772,ALCOHOL & DRUG DEPENDENCE W REHAB OR REHAB/DETOX THERAPY,20,ALCOHOL/DRUG USE AND ALCOHOL/DRUG INDUCED ORGANIC MENTAL DISORDERS,2,Moderate,Minor,Medical,Medicare,Medicare,Medicaid,,,false,14577.15,11801.29
New York City,Kings,7001003,001288,Brooklyn Hospital Center - Downtown Campus,30 to 49,104,M,Other Race,Not Span/Hispanic,3,Elective,Home or Self Care,2018,MBD017,ALCOHOL-RELATED DISORDERS,SUD001,SUBSTANCE USE DETOXIFICATION,772,ALCOHOL & DRUG DEPENDENCE W REHAB OR REHAB/DETOX THERAPY,20,ALCOHOL/DRUG USE AND ALCOHOL/DRUG INDUCED ORGANIC MENTAL DISORDERS,1,Minor,Minor,Medical,Medicaid,Medicaid,Self-Pay,,,true,19685.93,2002.94
Capital/Adirond,Albany,0101004,009431,St. Peter's Addiction Recovery Center,18 to 29,,M,White,Not Span/Hispanic,28,Elective,Home w/ Home Health Services,2018,MBD018,OPIOID-RELATED DISORDERS,SUD004,COUNSELING FOR SUBSTANCE USE,772,ALCOHOL & DRUG DEPENDENCE W REHAB OR REHAB/DETOX THERAPY,20,ALCOHOL/DRUG USE AND ALCOHOL/DRUG INDUCED ORGANIC MENTAL DISORDERS,2,Moderate,Minor,Medical,Private Health Insurance,Medicaid,,,,false,18158.72,10868.97
Capital/Adirond,Albany,0101004,009431,St. Peter's Addiction Recovery Center,30 to 49,123,M,White,Not Span/Hispanic,15,Elective,Short-term Hospital,2018,MBD017,ALCOHOL-RELATED DISORDERS,SUD004,COUNSELING FOR SUBSTANCE USE,772,ALCOHOL & DRUG DEPENDENCE W REHAB OR REHAB/DETOX THERAPY,20,ALCOHOL/DRUG USE AND ALCOHOL/DRUG INDUCED ORGANIC MENTAL DISORDERS,2,Moderate,Minor,Medical,Medicaid,,,,,false,9830.72,5814.65
Capital/Adirond,Albany,0101004,009431,St. Peter's Addiction Recovery Center,30 to 49,123,F,White,Not Span/Hispanic,22,Elective,Home w/ Home Health Services,2018,MBD017,ALCOHOL-RELATED DISORDERS,SUD004,COUNSELING FOR SUBSTANCE USE,772,ALCOHOL & DRUG DEPENDENCE W REHAB OR REHAB/DETOX THERAPY,20,ALCOHOL/DRUG USE AND ALCOHOL/DRUG INDUCED ORGANIC MENTAL DISORDERS,1,Minor,Minor,Medical,Medicaid,Medicaid,,,,false,14320.72,8520.57
Capital/Adirond,Albany,0101004,009431,St. Peter's Addiction Recovery Center,30 to 49,,M,Other Race,Not Span/Hispanic,28,Elective,Home w/ Home Health Services,2018,MBD017,ALCOHOL-RELATED DISORDERS,SUD004,COUNSELING FOR SUBSTANCE USE,772,ALCOHOL & DRUG DEPENDENCE W REHAB OR REHAB/DETOX THERAPY,20,ALCOHOL/DRUG USE AND ALCOHOL/DRUG INDUCED ORGANIC MENTAL DISORDERS,1,Minor,Minor,Medical,Medicaid,,,,,false,17132.72,10759.39
Capital/Adirond,Albany,0101004,009431,St. Peter's Addiction Recovery Center,18 to 29,121,F,White,Not Span/Hispanic,28,Elective,Home w/ Home Health Services,2018,MBD018,OPIOID-RELATED DISORDERS,SUD004,COUNSELING FOR SUBSTANCE USE,772,ALCOHOL & DRUG DEPENDENCE W REHAB OR REHAB/DETOX THERAPY,20,ALCOHOL/DRUG USE AND ALCOHOL/DRUG INDUCED ORGANIC MENTAL DISORDERS,1,Minor,Minor,Medical,Self-Pay,,,,,false,17656.72,10800.1