Hospital Service Area,Hospital County,Operating Certificate Number,Permanent Facility Id,Facility Name,Age Group,Zip Code - 3 digits,Gender,Race,Ethnicity,Length of Stay,Type of Admission,Patient Disposition,Discharge Year,CCS Diagnosis Code,CCS Diagnosis Description,CCS Procedure Code,CCS Procedure Description,APR DRG Code,APR DRG Description,APR MDC Code,APR MDC Description,APR Severity of Illness Code,APR Severity of Illness Description,APR Risk of Mortality,APR Medical Surgical Description,Payment Typology 1,Payment Typology 2,Payment Typology 3,Birth Weight,Abortion Edit Indicator,Emergency Department Indicator,Total Charges,Total Costs
New York City,Bronx,7000006,001169,Montefiore Medical Center - Henry & Lucy Moses Div,50 to 69,104,M,Other Race,Spanish/Hispanic,9,Emergency,Home or Self Care,2020,MBD017,ALCOHOL-RELATED DISORDERS,ADM017,ADMINISTRATION OF NUTRITIONAL AND ELECTROLYTIC SUBSTANCES,773,OPIOID ABUSE & DEPENDENCE,20,ALCOHOL/DRUG USE AND ALCOHOL/DRUG INDUCED ORGANIC MENTAL DISORDERS,3,Major,Moderate,Medical,Medicare,,,,,Y,104003.55,19076.6
New York City,Bronx,7000006,001169,Montefiore Medical Center - Henry & Lucy Moses Div,30 to 49,104,F,Black/African American,Not Span/Hispanic,4,Emergency,Psychiatric Hospital or Unit of Hosp,2020,MBD018,OPIOID-RELATED DISORDERS,,,773,OPIOID ABUSE & DEPENDENCE,20,ALCOHOL/DRUG USE AND ALCOHOL/DRUG INDUCED ORGANIC MENTAL DISORDERS,2,Moderate,Minor,Medical,Medicaid,,,,,Y,58882.57,10170.2
New York City,Manhattan,7002032,001466,Mount Sinai West,50 to 69,104,M,Black/African American,Not Span/Hispanic,4,Urgent,Inpatient Rehabilitation Facility,2020,MBD018,OPIOID-RELATED DISORDERS,SUD001,SUBSTANCE USE DETOXIFICATION,773,OPIOID ABUSE & DEPENDENCE,20,ALCOHOL/DRUG USE AND ALCOHOL/DRUG INDUCED ORGANIC MENTAL DISORDERS,2,Moderate,Minor,Medical,Private Health Insurance,Medicare,Self-Pay,,,N,21147.92,5129.33
New York City,Manhattan,7002032,001466,Mount Sinai West,50 to 69,111,M,White,Not Span/Hispanic,6,Emergency,Inpatient Rehabilitation Facility,2020,MBD017,ALCOHOL-RELATED DISORDERS,SUD001,SUBSTANCE USE DETOXIFICATION,773,OPIOID ABUSE & DEPENDENCE,20,ALCOHOL/DRUG USE AND ALCOHOL/DRUG INDUCED ORGANIC MENTAL DISORDERS,2,Moderate,Minor,Medical,Private Health Insurance,Medicare,Self-Pay,,,Y,39502.28,10081.99
New York City,Manhattan,7002002,001439,Mount Sinai Beth Israel,30 to 49,114,M,White,Spanish/Hispanic,2,Urgent,Home or Self Care,2020,MBD018,OPIOID-RELATED DISORDERS,SUD001,SUBSTANCE USE DETOXIFICATION,773,OPIOID ABUSE & DEPENDENCE,20,ALCOHOL/DRUG USE AND ALCOHOL/DRUG INDUCED ORGANIC MENTAL DISORDERS,1,Minor,Minor,Medical,Medicaid,Self-Pay,,,,N,11942.89,3112.88
New York City,Manhattan,7002002,001439,Mount Sinai Beth Israel,50 to 69,113,M,White,Not Span/Hispanic,4,Urgent,Inpatient Rehabilitation Facility,2020,MBD017,ALCOHOL-RELATED DISORDERS,SUD001,SUBSTANCE USE DETOXIFICATION,773,OPIOID ABUSE & DEPENDENCE,20,ALCOHOL/DRUG USE AND ALCOHOL/DRUG INDUCED ORGANIC MENTAL DISORDERS,2,Moderate,Minor,Medical,Medicaid,Self-Pay,,,,N,25453.41,6964.4
New York City,Manhattan,7002002,001439,Mount Sinai Beth Israel,50 to 69,100,M,Black/African American,Not Span/Hispanic,1,Urgent,Home or Self Care,2020,MBD017,ALCOHOL-RELATED DISORDERS,SUD001,SUBSTANCE USE DETOXIFICATION,773,OPIOID ABUSE & DEPENDENCE,20,ALCOHOL/DRUG USE AND ALCOHOL/DRUG INDUCED ORGANIC MENTAL DISORDERS,2,Moderate,Minor,Medical,Medicaid,Self-Pay,,,,N,6316.5,1614.48
New York City,Manhattan,7002032,001466,Mount Sinai West,30 to 49,112,M,White,Not Span/Hispanic,3,Urgent,Inpatient Rehabilitation Facility,2020,MBD018,OPIOID-RELATED DISORDERS,SUD001,SUBSTANCE USE DETOXIFICATION,773,OPIOID ABUSE & DEPENDENCE,20,ALCOHOL/DRUG USE AND ALCOHOL/DRUG INDUCED ORGANIC MENTAL DISORDERS,1,Minor,Minor,Medical,Medicaid,Self-Pay,,,,N,14802.17,3684.27
New York City,Manhattan,7002032,001466,Mount Sinai West,30 to 49,100,M,White,Not Span/Hispanic,2,Urgent,Home or Self Care,2020,MBD017,ALCOHOL-RELATED DISORDERS,SUD001,SUBSTANCE USE DETOXIFICATION,773,OPIOID ABUSE & DEPENDENCE,20,ALCOHOL/DRUG USE AND ALCOHOL/DRUG INDUCED ORGANIC MENTAL DISORDERS,2,Moderate,Minor,Medical,Medicaid,Self-Pay,,,,N,11856.3,2525.31
New York City,Manhattan,7002002,001439,Mount Sinai Beth Israel,30 to 49,103,M,Other Race,Spanish/Hispanic,2,Urgent,Home or Self Care,2020,MBD017,ALCOHOL-RELATED DISORDERS,SUD001,SUBSTANCE USE DETOXIFICATION,773,OPIOID ABUSE & DEPENDENCE,20,ALCOHOL/DRUG USE AND ALCOHOL/DRUG INDUCED ORGANIC MENTAL DISORDERS,2,Moderate,Minor,Medical,Medicaid,Self-Pay,,,,N,12383.82,3157.63
New York City,Manhattan,7002002,001439,Mount Sinai Beth Israel,18 to 29,100,M,Black/African American,Not Span/Hispanic,2,Urgent,Home or Self Care,2020,MBD017,ALCOHOL-RELATED DISORDERS,SUD001,SUBSTANCE USE DETOXIFICATION,773,OPIOID ABUSE & DEPENDENCE,20,ALCOHOL/DRUG USE AND ALCOHOL/DRUG INDUCED ORGANIC MENTAL DISORDERS,3,Major,Minor,Medical,Medicaid,Self-Pay,,,,N,11583.65,3090.55
New York City,Manhattan,7002002,001439,Mount Sinai Beth Israel,50 to 69,100,M,Other Race,Unknown,3,Urgent,Inpatient Rehabilitation Facility,2020,MBD018,OPIOID-RELATED DISORDERS,SUD001,SUBSTANCE USE DETOXIFICATION,773,OPIOID ABUSE & DEPENDENCE,20,ALCOHOL/DRUG USE AND ALCOHOL/DRUG INDUCED ORGANIC MENTAL DISORDERS,2,Moderate,Moderate,Medical,Medicaid,Self-Pay,,,,N,19178.25,4900.74
New York City,Manhattan,7002002,001439,Mount Sinai Beth Israel,30 to 49,113,M,Other Race,Spanish/Hispanic,3,Urgent,Home or Self Care,2020,MBD018,OPIOID-RELATED DISORDERS,SUD001,SUBSTANCE USE DETOXIFICATION,773,OPIOID ABUSE & DEPENDENCE,20,ALCOHOL/DRUG USE AND ALCOHOL/DRUG INDUCED ORGANIC MENTAL DISORDERS,1,Minor,Minor,Medical,Medicaid,Self-Pay,,,,N,19209.84,4948.76
New York City,Manhattan,7002002,001439,Mount Sinai Beth Israel,30 to 49,104,M,Black/African American,Not Span/Hispanic,3,Urgent,Inpatient Rehabilitation Facility,2020,MBD018,OPIOID-RELATED DISORDERS,SUD001,SUBSTANCE USE DETOXIFICATION,773,OPIOID ABUSE & DEPENDENCE,20,ALCOHOL/DRUG USE AND ALCOHOL/DRUG INDUCED ORGANIC MENTAL DISORDERS,2,Moderate,Minor,Medical,Medicaid,Self-Pay,,,,N,17577.6,4636.57
New York City,Manhattan,7002002,001439,Mount Sinai Beth Israel,30 to 49,100,M,White,Not Span/Hispanic,5,Urgent,Home or Self Care,2020,MBD018,OPIOID-RELATED DISORDERS,SUD001,SUBSTANCE USE DETOXIFICATION,773,OPIOID ABUSE & DEPENDENCE,20,ALCOHOL/DRUG USE AND ALCOHOL/DRUG INDUCED ORGANIC MENTAL DISORDERS,2,Moderate,Minor,Medical,Medicaid,Self-Pay,,,,N,28360.86,7633.56
New York City,Manhattan,7002002,001439,Mount Sinai Beth Israel,30 to 49,114,M,Other Race,Spanish/Hispanic,4,Urgent,Home or Self Care,2020,MBD018,OPIOID-RELATED DISORDERS,SUD001,SUBSTANCE USE DETOXIFICATION,773,OPIOID ABUSE & DEPENDENCE,20,ALCOHOL/DRUG USE AND ALCOHOL/DRUG INDUCED ORGANIC MENTAL DISORDERS,2,Moderate,Minor,Medical,Medicaid,Self-Pay,,,,N,24875.79,6432.87
New York City,Manhattan,7002002,001439,Mount Sinai Beth Israel,30 to 49,100,M,Other Race,Unknown,3,Emergency,Home or Self Care,2020,MBD018,OPIOID-RELATED DISORDERS,SUD001,SUBSTANCE USE DETOXIFICATION,773,OPIOID ABUSE & DEPENDENCE,20,ALCOHOL/DRUG USE AND ALCOHOL/DRUG INDUCED ORGANIC MENTAL DISORDERS,1,Minor,Minor,Medical,Medicaid,Self-Pay,,,,N,17249.15,4351.79
New York City,Manhattan,7002002,001439,Mount Sinai Beth Israel,50 to 69,111,M,Black/African American,Not Span/Hispanic,5,Urgent,Home or Self Care,2020,MBD017,ALCOHOL-RELATED DISORDERS,SUD001,SUBSTANCE USE DETOXIFICATION,773,OPIOID ABUSE & DEPENDENCE,20,ALCOHOL/DRUG USE AND ALCOHOL/DRUG INDUCED ORGANIC MENTAL DISORDERS,2,Moderate,Minor,Medical,Medicare,Medicaid,Self-Pay,,,Y,29554.08,8013.09
New York City,Manhattan,7002002,001439,Mount Sinai Beth Israel,50 to 69,100,F,Black/African American,Unknown,3,Urgent,Home or Self Care,2020,MBD018,OPIOID-RELATED DISORDERS,SUD001,SUBSTANCE USE DETOXIFICATION,773,OPIOID ABUSE & DEPENDENCE,20,ALCOHOL/DRUG USE AND ALCOHOL/DRUG INDUCED ORGANIC MENTAL DISORDERS,1,Minor,Minor,Medical,Medicare,Miscellaneous/Other,Self-Pay,,,N,18202.66,4709.61
New York City,Manhattan,7002002,001439,Mount Sinai Beth Israel,30 to 49,100,F,Other Race,Spanish/Hispanic,3,Emergency,Home or Self Care,2020,MBD018,OPIOID-RELATED DISORDERS,SUD001,SUBSTANCE USE DETOXIFICATION,773,OPIOID ABUSE & DEPENDENCE,20,ALCOHOL/DRUG USE AND ALCOHOL/DRUG INDUCED ORGANIC MENTAL DISORDERS,1,Minor,Minor,Medical,Medicaid,Self-Pay,,,,Y,19719.68,5146.72
New York City,Manhattan,7002002,001439,Mount Sinai Beth Israel,18 to 29,112,M,White,Not Span/Hispanic,2,Urgent,Home or Self Care,2020,MBD020,SEDATIVE-RELATED DISORDERS,SUD001,SUBSTANCE USE DETOXIFICATION,773,OPIOID ABUSE & DEPENDENCE,20,ALCOHOL/DRUG USE AND ALCOHOL/DRUG INDUCED ORGANIC MENTAL DISORDERS,3,Major,Minor,Medical,Medicaid,Self-Pay,,,,N,11518.9,3081.73
New York City,Manhattan,7002002,001439,Mount Sinai Beth Israel,50 to 69,114,M,White,Unknown,3,Emergency,Home or Self Care,2020,MBD017,ALCOHOL-RELATED DISORDERS,SUD001,SUBSTANCE USE DETOXIFICATION,773,OPIOID ABUSE & DEPENDENCE,20,ALCOHOL/DRUG USE AND ALCOHOL/DRUG INDUCED ORGANIC MENTAL DISORDERS,2,Moderate,Minor,Medical,Medicaid,Self-Pay,,,,N,17266.91,4478.87
New York City,Manhattan,7002002,001439,Mount Sinai Beth Israel,50 to 69,113,M,Black/African American,Not Span/Hispanic,6,Urgent,Home or Self Care,2020,MBD017,ALCOHOL-RELATED DISORDERS,SUD001,SUBSTANCE USE DETOXIFICATION,773,OPIOID ABUSE & DEPENDENCE,20,ALCOHOL/DRUG USE AND ALCOHOL/DRUG INDUCED ORGANIC MENTAL DISORDERS,2,Moderate,Minor,Medical,Medicaid,Self-Pay,,,,N,35398.77,9246.44
New York City,Manhattan,7002002,001439,Mount Sinai Beth Israel,30 to 49,104,M,Other Race,Spanish/Hispanic,2,Emergency,Home or Self Care,2020,MBD018,OPIOID-RELATED DISORDERS,SUD001,SUBSTANCE USE DETOXIFICATION,773,OPIOID ABUSE & DEPENDENCE,20,ALCOHOL/DRUG USE AND ALCOHOL/DRUG INDUCED ORGANIC MENTAL DISORDERS,2,Moderate,Minor,Medical,Medicaid,Self-Pay,,,,Y,15878.08,3917.3
New York City,Manhattan,7002002,001439,Mount Sinai Beth Israel,30 to 49,100,M,White,Not Span/Hispanic,2,Emergency,Home or Self Care,2020,MBD018,OPIOID-RELATED DISORDERS,SUD001,SUBSTANCE USE DETOXIFICATION,773,OPIOID ABUSE & DEPENDENCE,20,ALCOHOL/DRUG USE AND ALCOHOL/DRUG INDUCED ORGANIC MENTAL DISORDERS,1,Minor,Minor,Medical,Medicaid,Self-Pay,,,,Y,12529.39,3227.14
New York City,Manhattan,7002002,001439,Mount Sinai Beth Israel,18 to 29,100,M,Other Race,Spanish/Hispanic,4,Urgent,Home or Self Care,2020,MBD018,OPIOID-RELATED DISORDERS,SUD001,SUBSTANCE USE DETOXIFICATION,773,OPIOID ABUSE & DEPENDENCE,20,ALCOHOL/DRUG USE AND ALCOHOL/DRUG INDUCED ORGANIC MENTAL DISORDERS,2,Moderate,Minor,Medical,Private Health Insurance,Self-Pay,,,,Y,25752.5,6694.08
New York City,Manhattan,7002002,001439,Mount Sinai Beth Israel,30 to 49,112,M,Other Race,Unknown,3,Urgent,Home or Self Care,2020,MBD020,SEDATIVE-RELATED DISORDERS,SUD001,SUBSTANCE USE DETOXIFICATION,773,OPIOID ABUSE & DEPENDENCE,20,ALCOHOL/DRUG USE AND ALCOHOL/DRUG INDUCED ORGANIC MENTAL DISORDERS,2,Moderate,Minor,Medical,Medicaid,Self-Pay,,,,N,18043.44,4684.03
New York City,Manhattan,7002002,001439,Mount Sinai Beth Israel,30 to 49,100,M,Black/African American,Not Span/Hispanic,1,Urgent,Home or Self Care,2020,MBD017,ALCOHOL-RELATED DISORDERS,SUD001,SUBSTANCE USE DETOXIFICATION,773,OPIOID ABUSE & DEPENDENCE,20,ALCOHOL/DRUG USE AND ALCOHOL/DRUG INDUCED ORGANIC MENTAL DISORDERS,2,Moderate,Minor,Medical,Medicaid,Self-Pay,,,,N,6381.54,1619.3
New York City,Manhattan,7002002,001439,Mount Sinai Beth Israel,30 to 49,112,M,White,Unknown,4,Elective,Home or Self Care,2020,MBD018,OPIOID-RELATED DISORDERS,SUD001,SUBSTANCE USE DETOXIFICATION,773,OPIOID ABUSE & DEPENDENCE,20,ALCOHOL/DRUG USE AND ALCOHOL/DRUG INDUCED ORGANIC MENTAL DISORDERS,2,Moderate,Minor,Medical,Medicaid,Self-Pay,,,,N,21465.75,5719.86
New York City,Manhattan,7002002,001439,Mount Sinai Beth Israel,50 to 69,116,M,Black/African American,Unknown,3,Urgent,Inpatient Rehabilitation Facility,2020,MBD017,ALCOHOL-RELATED DISORDERS,SUD001,SUBSTANCE USE DETOXIFICATION,773,OPIOID ABUSE & DEPENDENCE,20,ALCOHOL/DRUG USE AND ALCOHOL/DRUG INDUCED ORGANIC MENTAL DISORDERS,2,Moderate,Minor,Medical,Medicaid,Self-Pay,,,,N,18580.61,4897.74
New York City,Manhattan,7002002,001439,Mount Sinai Beth Israel,30 to 49,104,M,White,Unknown,2,Urgent,Home or Self Care,2020,MBD018,OPIOID-RELATED DISORDERS,SUD001,SUBSTANCE USE DETOXIFICATION,773,OPIOID ABUSE & DEPENDENCE,20,ALCOHOL/DRUG USE AND ALCOHOL/DRUG INDUCED ORGANIC MENTAL DISORDERS,2,Moderate,Minor,Medical,Medicaid,Self-Pay,,,,N,11897.25,3132.22
New York City,Manhattan,7002002,001439,Mount Sinai Beth Israel,30 to 49,104,M,Other Race,Spanish/Hispanic,2,Urgent,Inpatient Rehabilitation Facility,2020,MBD018,OPIOID-RELATED DISORDERS,SUD001,SUBSTANCE USE DETOXIFICATION,773,OPIOID ABUSE & DEPENDENCE,20,ALCOHOL/DRUG USE AND ALCOHOL/DRUG INDUCED ORGANIC MENTAL DISORDERS,2,Moderate,Minor,Medical,Medicaid,Self-Pay,,,,N,12748.42,3184.66
New York City,Manhattan,7002002,001439,Mount Sinai Beth Israel,30 to 49,100,M,Black/African American,Unknown,2,Urgent,Home or Self Care,2020,MBD020,SEDATIVE-RELATED DISORDERS,SUD001,SUBSTANCE USE DETOXIFICATION,773,OPIOID ABUSE & DEPENDENCE,20,ALCOHOL/DRUG USE AND ALCOHOL/DRUG INDUCED ORGANIC MENTAL DISORDERS,2,Moderate,Minor,Medical,Medicaid,Self-Pay,,,,N,12039.65,3150.18
New York City,Manhattan,7002002,001439,Mount Sinai Beth Israel,50 to 69,104,M,Black/African American,Not Span/Hispanic,5,Urgent,Home or Self Care,2020,MBD017,ALCOHOL-RELATED DISORDERS,SUD001,SUBSTANCE USE DETOXIFICATION,773,OPIOID ABUSE & DEPENDENCE,20,ALCOHOL/DRUG USE AND ALCOHOL/DRUG INDUCED ORGANIC MENTAL DISORDERS,2,Moderate,Moderate,Medical,Medicaid,Self-Pay,,,,N,28730.84,7669.84
New York City,Manhattan,7002002,001439,Mount Sinai Beth Israel,30 to 49,104,M,White,Not Span/Hispanic,2,Urgent,Home or Self Care,2020,MBD018,OPIOID-RELATED DISORDERS,SUD001,SUBSTANCE USE DETOXIFICATION,773,OPIOID ABUSE & DEPENDENCE,20,ALCOHOL/DRUG USE AND ALCOHOL/DRUG INDUCED ORGANIC MENTAL DISORDERS,2,Moderate,Minor,Medical,Medicaid,Self-Pay,,,,N,12198.91,3166.58
New York City,Manhattan,7002002,001439,Mount Sinai Beth Israel,18 to 29,112,F,White,Not Span/Hispanic,5,Urgent,Home or Self Care,2020,MBD018,OPIOID-RELATED DISORDERS,SUD001,SUBSTANCE USE DETOXIFICATION,773,OPIOID ABUSE & DEPENDENCE,20,ALCOHOL/DRUG USE AND ALCOHOL/DRUG INDUCED ORGANIC MENTAL DISORDERS,1,Minor,Minor,Medical,Medicaid,Self-Pay,,,,N,28444.71,7630.31
New York City,Manhattan,7002002,001439,Mount Sinai Beth Israel,50 to 69,104,M,White,Not Span/Hispanic,4,Urgent,Home or Self Care,2020,MBD020,SEDATIVE-RELATED DISORDERS,SUD001,SUBSTANCE USE DETOXIFICATION,773,OPIOID ABUSE & DEPENDENCE,20,ALCOHOL/DRUG USE AND ALCOHOL/DRUG INDUCED ORGANIC MENTAL DISORDERS,2,Moderate,Minor,Medical,Medicaid,Self-Pay,,,,N,23265.49,6189.46
New York City,Manhattan,7002002,001439,Mount Sinai Beth Israel,30 to 49,100,F,Black/African American,Not Span/Hispanic,2,Urgent,Home or Self Care,2020,MBD018,OPIOID-RELATED DISORDERS,SUD001,SUBSTANCE USE DETOXIFICATION,773,OPIOID ABUSE & DEPENDENCE,20,ALCOHOL/DRUG USE AND ALCOHOL/DRUG INDUCED ORGANIC MENTAL DISORDERS,2,Moderate,Minor,Medical,Medicare,Miscellaneous/Other,Medicaid,,,Y,21306.27,5506.3
New York City,Manhattan,7002002,001439,Mount Sinai Beth Israel,30 to 49,115,M,Other Race,Not Span/Hispanic,4,Urgent,Home or Self Care,2020,MBD018,OPIOID-RELATED DISORDERS,SUD001,SUBSTANCE USE DETOXIFICATION,773,OPIOID ABUSE & DEPENDENCE,20,ALCOHOL/DRUG USE AND ALCOHOL/DRUG INDUCED ORGANIC MENTAL DISORDERS,2,Moderate,Minor,Medical,Medicaid,Self-Pay,,,,N,24127.38,6231.85
New York City,Manhattan,7002002,001439,Mount Sinai Beth Israel,50 to 69,100,M,White,Not Span/Hispanic,4,Urgent,Home or Self Care,2020,MBD017,ALCOHOL-RELATED DISORDERS,SUD001,SUBSTANCE USE DETOXIFICATION,773,OPIOID ABUSE & DEPENDENCE,20,ALCOHOL/DRUG USE AND ALCOHOL/DRUG INDUCED ORGANIC MENTAL DISORDERS,2,Moderate,Minor,Medical,Medicaid,Self-Pay,,,,N,23556.56,6326.38
New York City,Manhattan,7002002,001439,Mount Sinai Beth Israel,30 to 49,100,F,Other Race,Unknown,1,Urgent,Home or Self Care,2020,MBD018,OPIOID-RELATED DISORDERS,SUD001,SUBSTANCE USE DETOXIFICATION,773,OPIOID ABUSE & DEPENDENCE,20,ALCOHOL/DRUG USE AND ALCOHOL/DRUG INDUCED ORGANIC MENTAL DISORDERS,2,Moderate,Minor,Medical,Medicaid,Self-Pay,,,,N,6793.18,1603.49
New York City,Manhattan,7002002,001439,Mount Sinai Beth Israel,50 to 69,100,F,Black/African American,Not Span/Hispanic,2,Elective,Home or Self Care,2020,MBD018,OPIOID-RELATED DISORDERS,SUD001,SUBSTANCE USE DETOXIFICATION,773,OPIOID ABUSE & DEPENDENCE,20,ALCOHOL/DRUG USE AND ALCOHOL/DRUG INDUCED ORGANIC MENTAL DISORDERS,2,Moderate,Minor,Medical,Medicare,Miscellaneous/Other,Self-Pay,,,N,11997.29,3138.15
New York City,Manhattan,7002002,001439,Mount Sinai Beth Israel,18 to 29,100,M,White,Not Span/Hispanic,6,Urgent,Home or Self Care,2020,MBD020,SEDATIVE-RELATED DISORDERS,SUD001,SUBSTANCE USE DETOXIFICATION,773,OPIOID ABUSE & DEPENDENCE,20,ALCOHOL/DRUG USE AND ALCOHOL/DRUG INDUCED ORGANIC MENTAL DISORDERS,2,Moderate,Minor,Medical,Medicaid,Self-Pay,,,,N,34351.32,9331.97
New York City,Manhattan,7002032,001466,Mount Sinai West,50 to 69,104,F,Black/African American,Not Span/Hispanic,3,Emergency,Home or Self Care,2020,MBD018,OPIOID-RELATED DISORDERS,ADM017,ADMINISTRATION OF NUTRITIONAL AND ELECTROLYTIC SUBSTANCES,773,OPIOID ABUSE & DEPENDENCE,20,ALCOHOL/DRUG USE AND ALCOHOL/DRUG INDUCED ORGANIC MENTAL DISORDERS,2,Moderate,Minor,Medical,Medicaid,Medicaid,Self-Pay,,,Y,38247.2,9639.21
New York City,Bronx,7000006,001168,Montefiore Medical Center-Wakefield Hospital,70 or Older,OOS,F,Black/African American,Not Span/Hispanic,5,Emergency,Skilled Nursing Home,2020,MBD018,OPIOID-RELATED DISORDERS,ADM021,"ADMINISTRATION OF THERAPEUTIC SUBSTANCES, NEC",773,OPIOID ABUSE & DEPENDENCE,20,ALCOHOL/DRUG USE AND ALCOHOL/DRUG INDUCED ORGANIC MENTAL DISORDERS,2,Moderate,Minor,Medical,Medicare,Blue Cross/Blue Shield,,,,Y,78746.6,12383.73
New York City,Bronx,7000006,001168,Montefiore Medical Center-Wakefield Hospital,50 to 69,104,M,Other Race,Spanish/Hispanic,1,Emergency,Home or Self Care,2020,MBD017,ALCOHOL-RELATED DISORDERS,IMG007,COMPUTERIZED TOMOGRAPHY (CT) WITHOUT CONTRAST,773,OPIOID ABUSE & DEPENDENCE,20,ALCOHOL/DRUG USE AND ALCOHOL/DRUG INDUCED ORGANIC MENTAL DISORDERS,3,Major,Moderate,Medical,Private Health Insurance,,,,,Y,26038.06,2748.45
New York City,Manhattan,7002054,003975,New York Presbyterian Hospital - Allen Hospital,50 to 69,104,M,Other Race,Not Span/Hispanic,15,Urgent,Home or Self Care,2020,MBD018,OPIOID-RELATED DISORDERS,,,773,OPIOID ABUSE & DEPENDENCE,20,ALCOHOL/DRUG USE AND ALCOHOL/DRUG INDUCED ORGANIC MENTAL DISORDERS,2,Moderate,Minor,Medical,Medicaid,Medicaid,Self-Pay,,,N,143984.92,36583
New York City,Manhattan,7002054,001464,New York-Presbyterian Hospital - Columbia Presbyterian Center,30 to 49,100,M,Other Race,Multi-ethnic,5,Emergency,Home or Self Care,2020,MBD018,OPIOID-RELATED DISORDERS,SUD001,SUBSTANCE USE DETOXIFICATION,773,OPIOID ABUSE & DEPENDENCE,20,ALCOHOL/DRUG USE AND ALCOHOL/DRUG INDUCED ORGANIC MENTAL DISORDERS,1,Minor,Minor,Medical,Medicaid,Medicaid,Self-Pay,,,Y,74433.1,15169.75
New York City,Manhattan,7002054,001464,New York-Presbyterian Hospital - Columbia Presbyterian Center,50 to 69,100,M,Multi-racial,Not Span/Hispanic,19,Emergency,Court/Law Enforcement,2020,MBD017,ALCOHOL-RELATED DISORDERS,SUD001,SUBSTANCE USE DETOXIFICATION,773,OPIOID ABUSE & DEPENDENCE,20,ALCOHOL/DRUG USE AND ALCOHOL/DRUG INDUCED ORGANIC MENTAL DISORDERS,3,Major,Major,Medical,Medicaid,Medicaid,Self-Pay,,,Y,275909.32,72684.97
New York City,Manhattan,7002054,001464,New York-Presbyterian Hospital - Columbia Presbyterian Center,30 to 49,107,M,White,Spanish/Hispanic,2,Emergency,Home or Self Care,2020,MBD023,INHALANT-RELATED DISORDERS,,,773,OPIOID ABUSE & DEPENDENCE,20,ALCOHOL/DRUG USE AND ALCOHOL/DRUG INDUCED ORGANIC MENTAL DISORDERS,1,Minor,Minor,Medical,Private Health Insurance,Self-Pay,,,,Y,19621.96,4910.12
New York City,Kings,7001037,001320,University Hospital of Brooklyn,30 to 49,112,F,White,Not Span/Hispanic,2,Emergency,Home or Self Care,2020,MBD017,ALCOHOL-RELATED DISORDERS,SUD001,SUBSTANCE USE DETOXIFICATION,773,OPIOID ABUSE & DEPENDENCE,20,ALCOHOL/DRUG USE AND ALCOHOL/DRUG INDUCED ORGANIC MENTAL DISORDERS,2,Moderate,Moderate,Medical,Medicaid,Medicaid,Self-Pay,,,Y,10263,7282.6
New York City,Kings,7001021,001306,New York - Presbyterian Brooklyn Methodist Hospital,50 to 69,112,M,Black/African American,Not Span/Hispanic,6,Emergency,Home or Self Care,2020,MBD017,ALCOHOL-RELATED DISORDERS,IMG008,ULTRASONOGRAPHY,773,OPIOID ABUSE & DEPENDENCE,20,ALCOHOL/DRUG USE AND ALCOHOL/DRUG INDUCED ORGANIC MENTAL DISORDERS,2,Moderate,Moderate,Medical,"Managed Care, Unspecified",Medicaid,Self-Pay,,,Y,58322.42,15294.14
New York City,Manhattan,7002054,001458,New York-Presbyterian Hospital - New York Weill Cornell Center,50 to 69,100,M,White,Not Span/Hispanic,5,Emergency,Home or Self Care,2020,MBD017,ALCOHOL-RELATED DISORDERS,ADM010,VACCINATIONS,773,OPIOID ABUSE & DEPENDENCE,20,ALCOHOL/DRUG USE AND ALCOHOL/DRUG INDUCED ORGANIC MENTAL DISORDERS,3,Major,Moderate,Medical,Miscellaneous/Other,Self-Pay,,,,Y,64675.48,13679.15
New York City,Manhattan,7002054,001458,New York-Presbyterian Hospital - New York Weill Cornell Center,50 to 69,100,M,White,Not Span/Hispanic,15,Emergency,Home or Self Care,2020,MBD017,ALCOHOL-RELATED DISORDERS,SKB006,SKIN LACERATION REPAIR (EXCLUDING PERINEUM),773,OPIOID ABUSE & DEPENDENCE,20,ALCOHOL/DRUG USE AND ALCOHOL/DRUG INDUCED ORGANIC MENTAL DISORDERS,3,Major,Moderate,Medical,"Managed Care, Unspecified",Medicaid,Self-Pay,,,Y,196715.14,42965.35
New York City,Kings,7001021,001306,New York - Presbyterian Brooklyn Methodist Hospital,50 to 69,112,M,Other Race,Not Span/Hispanic,3,Emergency,Home or Self Care,2020,MBD018,OPIOID-RELATED DISORDERS,,,773,OPIOID ABUSE & DEPENDENCE,20,ALCOHOL/DRUG USE AND ALCOHOL/DRUG INDUCED ORGANIC MENTAL DISORDERS,1,Minor,Minor,Medical,Miscellaneous/Other,Private Health Insurance,Self-Pay,,,Y,20997.35,5215
Long Island,Nassau,2950002,000528,Nassau University Medical Center,50 to 69,115,M,Black/African American,Not Span/Hispanic,4,Emergency,Medicare Cert Long Term Care Hospital,2020,MBD018,OPIOID-RELATED DISORDERS,SUD001,SUBSTANCE USE DETOXIFICATION,773,OPIOID ABUSE & DEPENDENCE,20,ALCOHOL/DRUG USE AND ALCOHOL/DRUG INDUCED ORGANIC MENTAL DISORDERS,1,Minor,Minor,Medical,Medicaid,Medicaid,Self-Pay,,,N,18745.3,4333.96
Long Island,Nassau,2950002,000528,Nassau University Medical Center,50 to 69,117,M,White,Not Span/Hispanic,5,Emergency,Home or Self Care,2020,MBD017,ALCOHOL-RELATED DISORDERS,SUD001,SUBSTANCE USE DETOXIFICATION,773,OPIOID ABUSE & DEPENDENCE,20,ALCOHOL/DRUG USE AND ALCOHOL/DRUG INDUCED ORGANIC MENTAL DISORDERS,2,Moderate,Moderate,Medical,Medicaid,Medicaid,Self-Pay,,,N,18985.78,4666.78
Long Island,Nassau,2950002,000528,Nassau University Medical Center,30 to 49,117,M,White,Not Span/Hispanic,1,Emergency,Home or Self Care,2020,MBD018,OPIOID-RELATED DISORDERS,,,773,OPIOID ABUSE & DEPENDENCE,20,ALCOHOL/DRUG USE AND ALCOHOL/DRUG INDUCED ORGANIC MENTAL DISORDERS,1,Minor,Minor,Medical,Medicaid,Medicaid,Self-Pay,,,N,3756.99,926.87
Long Island,Nassau,2950002,000528,Nassau University Medical Center,18 to 29,115,F,White,Not Span/Hispanic,5,Emergency,Medicare Cert Long Term Care Hospital,2020,MBD018,OPIOID-RELATED DISORDERS,SUD001,SUBSTANCE USE DETOXIFICATION,773,OPIOID ABUSE & DEPENDENCE,20,ALCOHOL/DRUG USE AND ALCOHOL/DRUG INDUCED ORGANIC MENTAL DISORDERS,2,Moderate,Minor,Medical,Medicaid,Medicaid,Self-Pay,,,N,21701.32,5108.72
Long Island,Nassau,2950002,000528,Nassau University Medical Center,18 to 29,117,M,White,Not Span/Hispanic,4,Emergency,Home or Self Care,2020,MBD018,OPIOID-RELATED DISORDERS,SUD001,SUBSTANCE USE DETOXIFICATION,773,OPIOID ABUSE & DEPENDENCE,20,ALCOHOL/DRUG USE AND ALCOHOL/DRUG INDUCED ORGANIC MENTAL DISORDERS,1,Minor,Minor,Medical,Self-Pay,Self-Pay,,,,N,17439.29,4090.49