Hospital Service Area,Hospital County,Operating Certificate Number,Permanent Facility Id,Facility Name,Age Group,Zip Code - 3 digits,Gender,Race,Ethnicity,Length of Stay,Type of Admission,Patient Disposition,Discharge Year,CCS Diagnosis Code,CCS Diagnosis Description,CCS Procedure Code,CCS Procedure Description,APR DRG Code,APR DRG Description,APR MDC Code,APR MDC Description,APR Severity of Illness Code,APR Severity of Illness Description,APR Risk of Mortality,APR Medical Surgical Description,Payment Typology 1,Payment Typology 2,Payment Typology 3,Birth Weight,Abortion Edit Indicator,Emergency Department Indicator,Total Charges,Total Costs
New York City,Manhattan,7002001,001438,Bellevue Hospital Center,30 to 49,112,M,Other Race,Spanish/Hispanic,1,Emergency,Home or Self Care,2020,MBD021,STIMULANT-RELATED DISORDERS,MHT001,PHARMACOTHERAPY FOR MENTAL HEALTH (EXCLUDING SUBSTANCE USE),773,OPIOID ABUSE & DEPENDENCE,20,ALCOHOL/DRUG USE AND ALCOHOL/DRUG INDUCED ORGANIC MENTAL DISORDERS,1,Minor,Minor,Medical,Medicaid,,,,,Y,2213.37,1272.87
New York City,Manhattan,7002001,001438,Bellevue Hospital Center,50 to 69,112,M,Other Race,Spanish/Hispanic,1,Emergency,Home or Self Care,2020,MBD025,OTHER SPECIFIED SUBSTANCE-RELATED DISORDERS,MHT001,PHARMACOTHERAPY FOR MENTAL HEALTH (EXCLUDING SUBSTANCE USE),773,OPIOID ABUSE & DEPENDENCE,20,ALCOHOL/DRUG USE AND ALCOHOL/DRUG INDUCED ORGANIC MENTAL DISORDERS,2,Moderate,Minor,Medical,Medicare,,,,,Y,2361.61,1358.12
New York City,Manhattan,7002001,001438,Bellevue Hospital Center,30 to 49,100,M,Black/African American,Not Span/Hispanic,1,Emergency,Home or Self Care,2020,MBD025,OTHER SPECIFIED SUBSTANCE-RELATED DISORDERS,MHT001,PHARMACOTHERAPY FOR MENTAL HEALTH (EXCLUDING SUBSTANCE USE),773,OPIOID ABUSE & DEPENDENCE,20,ALCOHOL/DRUG USE AND ALCOHOL/DRUG INDUCED ORGANIC MENTAL DISORDERS,2,Moderate,Minor,Medical,Medicaid,,,,,Y,2693.24,1548.84
New York City,Manhattan,7002001,001438,Bellevue Hospital Center,30 to 49,103,M,Other Race,Not Span/Hispanic,4,Emergency,Home or Self Care,2020,MBD017,ALCOHOL-RELATED DISORDERS,SUD001,SUBSTANCE USE DETOXIFICATION,773,OPIOID ABUSE & DEPENDENCE,20,ALCOHOL/DRUG USE AND ALCOHOL/DRUG INDUCED ORGANIC MENTAL DISORDERS,2,Moderate,Minor,Medical,Medicaid,,,,,Y,29580.99,17011.55
New York City,Manhattan,7002001,001438,Bellevue Hospital Center,50 to 69,100,M,Other Race,Spanish/Hispanic,1,Emergency,Home or Self Care,2020,MBD018,OPIOID-RELATED DISORDERS,SUD001,SUBSTANCE USE DETOXIFICATION,773,OPIOID ABUSE & DEPENDENCE,20,ALCOHOL/DRUG USE AND ALCOHOL/DRUG INDUCED ORGANIC MENTAL DISORDERS,2,Moderate,Minor,Medical,Medicaid,,,,,Y,11126.15,6398.47
New York City,Manhattan,7002001,001438,Bellevue Hospital Center,50 to 69,104,M,Black/African American,Not Span/Hispanic,1,Emergency,Home or Self Care,2020,MBD018,OPIOID-RELATED DISORDERS,ADM021,"ADMINISTRATION OF THERAPEUTIC SUBSTANCES, NEC",773,OPIOID ABUSE & DEPENDENCE,20,ALCOHOL/DRUG USE AND ALCOHOL/DRUG INDUCED ORGANIC MENTAL DISORDERS,1,Minor,Minor,Medical,Self-Pay,,,,,Y,2675.04,1538.37
New York City,Manhattan,7002001,001438,Bellevue Hospital Center,50 to 69,104,M,Black/African American,Not Span/Hispanic,9,Emergency,Home or Self Care,2020,MBD018,OPIOID-RELATED DISORDERS,ADM021,"ADMINISTRATION OF THERAPEUTIC SUBSTANCES, NEC",773,OPIOID ABUSE & DEPENDENCE,20,ALCOHOL/DRUG USE AND ALCOHOL/DRUG INDUCED ORGANIC MENTAL DISORDERS,2,Moderate,Minor,Medical,Medicaid,,,,,Y,60188.2,34613.27
New York City,Manhattan,7002001,001438,Bellevue Hospital Center,30 to 49,100,M,Black/African American,Not Span/Hispanic,7,Emergency,Home or Self Care,2020,MBD018,OPIOID-RELATED DISORDERS,,,773,OPIOID ABUSE & DEPENDENCE,20,ALCOHOL/DRUG USE AND ALCOHOL/DRUG INDUCED ORGANIC MENTAL DISORDERS,1,Minor,Minor,Medical,Medicaid,,,,,Y,48385.5,27825.73
New York City,Manhattan,7002001,001438,Bellevue Hospital Center,50 to 69,112,M,Other Race,Not Span/Hispanic,4,Emergency,Home or Self Care,2020,MBD017,ALCOHOL-RELATED DISORDERS,SUD001,SUBSTANCE USE DETOXIFICATION,773,OPIOID ABUSE & DEPENDENCE,20,ALCOHOL/DRUG USE AND ALCOHOL/DRUG INDUCED ORGANIC MENTAL DISORDERS,2,Moderate,Minor,Medical,Medicaid,,,,,Y,33162.07,19070.98
New York City,Manhattan,7002001,001438,Bellevue Hospital Center,30 to 49,100,M,Other Race,Spanish/Hispanic,3,Emergency,Home or Self Care,2020,MBD018,OPIOID-RELATED DISORDERS,,,773,OPIOID ABUSE & DEPENDENCE,20,ALCOHOL/DRUG USE AND ALCOHOL/DRUG INDUCED ORGANIC MENTAL DISORDERS,1,Minor,Minor,Medical,Medicaid,,,,,Y,21378.83,12294.62
New York City,Manhattan,7002001,001438,Bellevue Hospital Center,30 to 49,100,M,White,Not Span/Hispanic,3,Emergency,Home or Self Care,2020,MBD017,ALCOHOL-RELATED DISORDERS,SUD001,SUBSTANCE USE DETOXIFICATION,773,OPIOID ABUSE & DEPENDENCE,20,ALCOHOL/DRUG USE AND ALCOHOL/DRUG INDUCED ORGANIC MENTAL DISORDERS,2,Moderate,Minor,Medical,Medicaid,,,,,Y,22073.29,12694
New York City,Manhattan,7002001,001438,Bellevue Hospital Center,50 to 69,112,M,Black/African American,Not Span/Hispanic,1,Urgent,Home or Self Care,2020,MBD018,OPIOID-RELATED DISORDERS,ADM020,"ADMINISTRATION OF DIAGNOSTIC SUBSTANCES, NEC",773,OPIOID ABUSE & DEPENDENCE,20,ALCOHOL/DRUG USE AND ALCOHOL/DRUG INDUCED ORGANIC MENTAL DISORDERS,3,Major,Moderate,Medical,Medicaid,,,,,N,16273.68,9358.73
New York City,Manhattan,7002001,001438,Bellevue Hospital Center,30 to 49,104,M,Black/African American,Spanish/Hispanic,1,Emergency,Home or Self Care,2020,MBD017,ALCOHOL-RELATED DISORDERS,SUD001,SUBSTANCE USE DETOXIFICATION,773,OPIOID ABUSE & DEPENDENCE,20,ALCOHOL/DRUG USE AND ALCOHOL/DRUG INDUCED ORGANIC MENTAL DISORDERS,2,Moderate,Moderate,Medical,Medicaid,,,,,Y,2244.86,1290.98
New York City,Manhattan,7002001,001438,Bellevue Hospital Center,30 to 49,100,M,Other Race,Spanish/Hispanic,1,Emergency,Home or Self Care,2020,MBD017,ALCOHOL-RELATED DISORDERS,ADM021,"ADMINISTRATION OF THERAPEUTIC SUBSTANCES, NEC",773,OPIOID ABUSE & DEPENDENCE,20,ALCOHOL/DRUG USE AND ALCOHOL/DRUG INDUCED ORGANIC MENTAL DISORDERS,2,Moderate,Minor,Medical,Medicaid,,,,,Y,2557.9,1471.01
New York City,Manhattan,7002001,001438,Bellevue Hospital Center,30 to 49,100,M,Other Race,Spanish/Hispanic,1,Emergency,Home or Self Care,2020,MBD025,OTHER SPECIFIED SUBSTANCE-RELATED DISORDERS,SUD001,SUBSTANCE USE DETOXIFICATION,773,OPIOID ABUSE & DEPENDENCE,20,ALCOHOL/DRUG USE AND ALCOHOL/DRUG INDUCED ORGANIC MENTAL DISORDERS,2,Moderate,Minor,Medical,Medicaid,,,,,Y,2457.18,1413.08
New York City,Manhattan,7002001,001438,Bellevue Hospital Center,18 to 29,112,M,Other Race,Unknown,1,Emergency,Home or Self Care,2020,MBD025,OTHER SPECIFIED SUBSTANCE-RELATED DISORDERS,MHT001,PHARMACOTHERAPY FOR MENTAL HEALTH (EXCLUDING SUBSTANCE USE),773,OPIOID ABUSE & DEPENDENCE,20,ALCOHOL/DRUG USE AND ALCOHOL/DRUG INDUCED ORGANIC MENTAL DISORDERS,2,Moderate,Minor,Medical,Medicaid,,,,,Y,2339.41,1345.36
New York City,Manhattan,7002001,001438,Bellevue Hospital Center,30 to 49,100,M,Other Race,Spanish/Hispanic,10,Emergency,Home or Self Care,2020,MBD018,OPIOID-RELATED DISORDERS,MHT001,PHARMACOTHERAPY FOR MENTAL HEALTH (EXCLUDING SUBSTANCE USE),773,OPIOID ABUSE & DEPENDENCE,20,ALCOHOL/DRUG USE AND ALCOHOL/DRUG INDUCED ORGANIC MENTAL DISORDERS,2,Moderate,Minor,Medical,Medicaid,,,,,Y,18420.64,10593.42
New York City,Manhattan,7002001,001438,Bellevue Hospital Center,30 to 49,106,M,Other Race,Unknown,1,Emergency,Home or Self Care,2020,MBD017,ALCOHOL-RELATED DISORDERS,SUD001,SUBSTANCE USE DETOXIFICATION,773,OPIOID ABUSE & DEPENDENCE,20,ALCOHOL/DRUG USE AND ALCOHOL/DRUG INDUCED ORGANIC MENTAL DISORDERS,2,Moderate,Minor,Medical,Medicaid,,,,,Y,6348.48,3650.91
New York City,Manhattan,7002001,001438,Bellevue Hospital Center,30 to 49,100,F,White,Not Span/Hispanic,12,Emergency,Psychiatric Hospital or Unit of Hosp,2020,MBD018,OPIOID-RELATED DISORDERS,MAM011,ELECTROENCEPHALOGRAM (EEG),773,OPIOID ABUSE & DEPENDENCE,20,ALCOHOL/DRUG USE AND ALCOHOL/DRUG INDUCED ORGANIC MENTAL DISORDERS,3,Major,Major,Medical,Self-Pay,,,,,Y,89241.88,51321.58
New York City,Manhattan,7002001,001438,Bellevue Hospital Center,30 to 49,100,M,Other Race,Spanish/Hispanic,6,Emergency,Court/Law Enforcement,2020,MBD020,SEDATIVE-RELATED DISORDERS,IMG006,COMPUTERIZED TOMOGRAPHY (CT) WITH CONTRAST,773,OPIOID ABUSE & DEPENDENCE,20,ALCOHOL/DRUG USE AND ALCOHOL/DRUG INDUCED ORGANIC MENTAL DISORDERS,2,Moderate,Minor,Medical,Medicaid,,,,,Y,55481,31906.24
New York City,Manhattan,7002001,001438,Bellevue Hospital Center,30 to 49,112,M,Black/African American,Spanish/Hispanic,3,Emergency,Court/Law Enforcement,2020,MBD018,OPIOID-RELATED DISORDERS,SUD001,SUBSTANCE USE DETOXIFICATION,773,OPIOID ABUSE & DEPENDENCE,20,ALCOHOL/DRUG USE AND ALCOHOL/DRUG INDUCED ORGANIC MENTAL DISORDERS,2,Moderate,Moderate,Medical,Medicaid,,,,,Y,23264.28,13378.92
New York City,Manhattan,7002001,001438,Bellevue Hospital Center,50 to 69,100,M,White,Not Span/Hispanic,8,Urgent,Home or Self Care,2020,MBD017,ALCOHOL-RELATED DISORDERS,IMG005,MAGNETIC RESONANCE IMAGING (MRI),773,OPIOID ABUSE & DEPENDENCE,20,ALCOHOL/DRUG USE AND ALCOHOL/DRUG INDUCED ORGANIC MENTAL DISORDERS,2,Moderate,Minor,Medical,Medicaid,,,,,N,63910.56,36753.94
New York City,Manhattan,7002001,001438,Bellevue Hospital Center,30 to 49,114,M,Other Race,Not Span/Hispanic,1,Emergency,Home or Self Care,2020,MBD025,OTHER SPECIFIED SUBSTANCE-RELATED DISORDERS,,,773,OPIOID ABUSE & DEPENDENCE,20,ALCOHOL/DRUG USE AND ALCOHOL/DRUG INDUCED ORGANIC MENTAL DISORDERS,2,Moderate,Minor,Medical,Medicaid,,,,,Y,6704.93,3855.9
New York City,Manhattan,7002001,001438,Bellevue Hospital Center,30 to 49,100,M,Other Race,Unknown,1,Emergency,Home or Self Care,2020,MBD017,ALCOHOL-RELATED DISORDERS,,,773,OPIOID ABUSE & DEPENDENCE,20,ALCOHOL/DRUG USE AND ALCOHOL/DRUG INDUCED ORGANIC MENTAL DISORDERS,2,Moderate,Minor,Medical,Medicaid,,,,,Y,4963.25,2854.29
New York City,Manhattan,7002001,001438,Bellevue Hospital Center,50 to 69,112,M,Black/African American,Not Span/Hispanic,1,Emergency,Home or Self Care,2020,MBD021,STIMULANT-RELATED DISORDERS,,,773,OPIOID ABUSE & DEPENDENCE,20,ALCOHOL/DRUG USE AND ALCOHOL/DRUG INDUCED ORGANIC MENTAL DISORDERS,2,Moderate,Minor,Medical,Medicare,Medicaid,,,,Y,7504.1,4315.49
New York City,Manhattan,7002001,001438,Bellevue Hospital Center,30 to 49,100,F,Black/African American,Not Span/Hispanic,2,Emergency,Home or Self Care,2020,MBD018,OPIOID-RELATED DISORDERS,MHT001,PHARMACOTHERAPY FOR MENTAL HEALTH (EXCLUDING SUBSTANCE USE),773,OPIOID ABUSE & DEPENDENCE,20,ALCOHOL/DRUG USE AND ALCOHOL/DRUG INDUCED ORGANIC MENTAL DISORDERS,2,Moderate,Minor,Medical,Medicare,Medicaid,,,,Y,13848.8,7964.22
New York City,Manhattan,7002001,001438,Bellevue Hospital Center,30 to 49,100,M,White,Not Span/Hispanic,5,Urgent,Home or Self Care,2020,MBD017,ALCOHOL-RELATED DISORDERS,SUD001,SUBSTANCE USE DETOXIFICATION,773,OPIOID ABUSE & DEPENDENCE,20,ALCOHOL/DRUG USE AND ALCOHOL/DRUG INDUCED ORGANIC MENTAL DISORDERS,2,Moderate,Minor,Medical,Medicaid,,,,,N,33721.64,19392.78
New York City,Manhattan,7002001,001438,Bellevue Hospital Center,30 to 49,114,M,White,Not Span/Hispanic,1,Emergency,Home or Self Care,2020,MBD018,OPIOID-RELATED DISORDERS,SUD002,PHARMACOTHERAPY FOR SUBSTANCE USE,773,OPIOID ABUSE & DEPENDENCE,20,ALCOHOL/DRUG USE AND ALCOHOL/DRUG INDUCED ORGANIC MENTAL DISORDERS,1,Minor,Minor,Medical,Medicaid,,,,,Y,5778.18,3322.94
New York City,Manhattan,7002001,001438,Bellevue Hospital Center,30 to 49,100,F,Black/African American,Unknown,12,Emergency,Home or Self Care,2020,MBD017,ALCOHOL-RELATED DISORDERS,ESA006,CARDIOVERSION,773,OPIOID ABUSE & DEPENDENCE,20,ALCOHOL/DRUG USE AND ALCOHOL/DRUG INDUCED ORGANIC MENTAL DISORDERS,2,Moderate,Major,Medical,Medicaid,,,,,Y,93965.75,54038.2
New York City,Manhattan,7002001,001438,Bellevue Hospital Center,30 to 49,100,M,Other Race,Unknown,2,Emergency,Home or Self Care,2020,MBD021,STIMULANT-RELATED DISORDERS,MHT001,PHARMACOTHERAPY FOR MENTAL HEALTH (EXCLUDING SUBSTANCE USE),773,OPIOID ABUSE & DEPENDENCE,20,ALCOHOL/DRUG USE AND ALCOHOL/DRUG INDUCED ORGANIC MENTAL DISORDERS,2,Moderate,Minor,Medical,Medicaid,,,,,Y,10154.82,5839.87
New York City,Manhattan,7002001,001438,Bellevue Hospital Center,30 to 49,100,M,White,Unknown,7,Emergency,Home or Self Care,2020,MBD020,SEDATIVE-RELATED DISORDERS,SKB006,SKIN LACERATION REPAIR (EXCLUDING PERINEUM),773,OPIOID ABUSE & DEPENDENCE,20,ALCOHOL/DRUG USE AND ALCOHOL/DRUG INDUCED ORGANIC MENTAL DISORDERS,2,Moderate,Moderate,Medical,Medicaid,,,,,Y,74691.77,42954.04
New York City,Manhattan,7002001,001438,Bellevue Hospital Center,30 to 49,100,M,White,Not Span/Hispanic,6,Emergency,Home or Self Care,2020,MBD021,STIMULANT-RELATED DISORDERS,MHT001,PHARMACOTHERAPY FOR MENTAL HEALTH (EXCLUDING SUBSTANCE USE),773,OPIOID ABUSE & DEPENDENCE,20,ALCOHOL/DRUG USE AND ALCOHOL/DRUG INDUCED ORGANIC MENTAL DISORDERS,2,Moderate,Minor,Medical,Medicaid,,,,,Y,25730.17,14797.01
New York City,Manhattan,7002001,001438,Bellevue Hospital Center,50 to 69,100,M,Other Race,Spanish/Hispanic,1,Emergency,Home or Self Care,2020,MBD025,OTHER SPECIFIED SUBSTANCE-RELATED DISORDERS,MHT001,PHARMACOTHERAPY FOR MENTAL HEALTH (EXCLUDING SUBSTANCE USE),773,OPIOID ABUSE & DEPENDENCE,20,ALCOHOL/DRUG USE AND ALCOHOL/DRUG INDUCED ORGANIC MENTAL DISORDERS,2,Moderate,Minor,Medical,Medicaid,,,,,Y,5771.65,3319.18
New York City,Manhattan,7002001,001438,Bellevue Hospital Center,30 to 49,112,M,Black/African American,Not Span/Hispanic,1,Emergency,Home or Self Care,2020,MBD025,OTHER SPECIFIED SUBSTANCE-RELATED DISORDERS,ADM021,"ADMINISTRATION OF THERAPEUTIC SUBSTANCES, NEC",773,OPIOID ABUSE & DEPENDENCE,20,ALCOHOL/DRUG USE AND ALCOHOL/DRUG INDUCED ORGANIC MENTAL DISORDERS,2,Moderate,Minor,Medical,Medicaid,,,,,Y,5884.8,3384.25
New York City,Manhattan,7002001,001438,Bellevue Hospital Center,50 to 69,100,M,Black/African American,Not Span/Hispanic,4,Emergency,Home or Self Care,2020,MBD018,OPIOID-RELATED DISORDERS,IMG008,ULTRASONOGRAPHY,773,OPIOID ABUSE & DEPENDENCE,20,ALCOHOL/DRUG USE AND ALCOHOL/DRUG INDUCED ORGANIC MENTAL DISORDERS,2,Moderate,Major,Medical,Medicare,Medicaid,,,,Y,39533.83,22735.27
New York City,Manhattan,7002001,001438,Bellevue Hospital Center,30 to 49,100,F,Black/African American,Not Span/Hispanic,4,Emergency,Home or Self Care,2020,MBD017,ALCOHOL-RELATED DISORDERS,MHT001,PHARMACOTHERAPY FOR MENTAL HEALTH (EXCLUDING SUBSTANCE USE),773,OPIOID ABUSE & DEPENDENCE,20,ALCOHOL/DRUG USE AND ALCOHOL/DRUG INDUCED ORGANIC MENTAL DISORDERS,2,Moderate,Minor,Medical,Medicare,Medicaid,,,,Y,20029.48,11518.63
New York City,Manhattan,7002001,001438,Bellevue Hospital Center,50 to 69,104,F,Black/African American,Spanish/Hispanic,8,Urgent,Home or Self Care,2020,MBD020,SEDATIVE-RELATED DISORDERS,SUD002,PHARMACOTHERAPY FOR SUBSTANCE USE,773,OPIOID ABUSE & DEPENDENCE,20,ALCOHOL/DRUG USE AND ALCOHOL/DRUG INDUCED ORGANIC MENTAL DISORDERS,3,Major,Minor,Medical,Medicaid,,,,,N,34889.88,20064.61
New York City,Manhattan,7002001,001438,Bellevue Hospital Center,30 to 49,100,F,White,Not Span/Hispanic,1,Emergency,Home or Self Care,2020,MBD026,MENTAL AND SUBSTANCE USE DISORDERS IN REMISSION,MHT001,PHARMACOTHERAPY FOR MENTAL HEALTH (EXCLUDING SUBSTANCE USE),773,OPIOID ABUSE & DEPENDENCE,20,ALCOHOL/DRUG USE AND ALCOHOL/DRUG INDUCED ORGANIC MENTAL DISORDERS,2,Moderate,Minor,Medical,Medicaid,,,,,Y,5513.78,3170.89
New York City,Manhattan,7002001,001438,Bellevue Hospital Center,30 to 49,100,M,White,Not Span/Hispanic,5,Urgent,Home or Self Care,2020,MBD018,OPIOID-RELATED DISORDERS,ADM020,"ADMINISTRATION OF DIAGNOSTIC SUBSTANCES, NEC",773,OPIOID ABUSE & DEPENDENCE,20,ALCOHOL/DRUG USE AND ALCOHOL/DRUG INDUCED ORGANIC MENTAL DISORDERS,2,Moderate,Major,Medical,Medicaid,,,,,N,33367.58,19189.16
New York City,Manhattan,7002001,001438,Bellevue Hospital Center,30 to 49,113,M,Black/African American,Not Span/Hispanic,1,Emergency,Home or Self Care,2020,MBD025,OTHER SPECIFIED SUBSTANCE-RELATED DISORDERS,ADM021,"ADMINISTRATION OF THERAPEUTIC SUBSTANCES, NEC",773,OPIOID ABUSE & DEPENDENCE,20,ALCOHOL/DRUG USE AND ALCOHOL/DRUG INDUCED ORGANIC MENTAL DISORDERS,2,Moderate,Minor,Medical,Medicaid,Medicaid,,,,Y,5503.04,3164.71
New York City,Manhattan,7002001,001438,Bellevue Hospital Center,50 to 69,112,M,Black/African American,Not Span/Hispanic,2,Emergency,Home or Self Care,2020,MBD018,OPIOID-RELATED DISORDERS,,,773,OPIOID ABUSE & DEPENDENCE,20,ALCOHOL/DRUG USE AND ALCOHOL/DRUG INDUCED ORGANIC MENTAL DISORDERS,2,Moderate,Minor,Medical,Medicaid,,,,,Y,10465.47,6018.52
New York City,Manhattan,7002001,001438,Bellevue Hospital Center,18 to 29,100,M,White,Not Span/Hispanic,2,Emergency,Home or Self Care,2020,MBD025,OTHER SPECIFIED SUBSTANCE-RELATED DISORDERS,SUD001,SUBSTANCE USE DETOXIFICATION,773,OPIOID ABUSE & DEPENDENCE,20,ALCOHOL/DRUG USE AND ALCOHOL/DRUG INDUCED ORGANIC MENTAL DISORDERS,2,Moderate,Minor,Medical,Medicaid,,,,,Y,9479.61,5451.57
New York City,Manhattan,7002001,001438,Bellevue Hospital Center,50 to 69,100,F,White,Unknown,1,Emergency,Home or Self Care,2020,MBD017,ALCOHOL-RELATED DISORDERS,ADM021,"ADMINISTRATION OF THERAPEUTIC SUBSTANCES, NEC",773,OPIOID ABUSE & DEPENDENCE,20,ALCOHOL/DRUG USE AND ALCOHOL/DRUG INDUCED ORGANIC MENTAL DISORDERS,2,Moderate,Minor,Medical,Medicaid,,,,,Y,2101.7,1208.65
New York City,Manhattan,7002001,001438,Bellevue Hospital Center,30 to 49,100,M,White,Not Span/Hispanic,1,Emergency,Home or Self Care,2020,MBD025,OTHER SPECIFIED SUBSTANCE-RELATED DISORDERS,MHT001,PHARMACOTHERAPY FOR MENTAL HEALTH (EXCLUDING SUBSTANCE USE),773,OPIOID ABUSE & DEPENDENCE,20,ALCOHOL/DRUG USE AND ALCOHOL/DRUG INDUCED ORGANIC MENTAL DISORDERS,2,Moderate,Minor,Medical,Medicaid,,,,,Y,5941.87,3417.07
New York City,Manhattan,7002001,001438,Bellevue Hospital Center,30 to 49,100,M,Black/African American,Not Span/Hispanic,12,Emergency,Home or Self Care,2020,MBD022,HALLUCINOGEN-RELATED DISORDERS,MHT001,PHARMACOTHERAPY FOR MENTAL HEALTH (EXCLUDING SUBSTANCE USE),773,OPIOID ABUSE & DEPENDENCE,20,ALCOHOL/DRUG USE AND ALCOHOL/DRUG INDUCED ORGANIC MENTAL DISORDERS,2,Moderate,Minor,Medical,Medicaid,,,,,Y,50568.64,29081.22
New York City,Manhattan,7002001,001438,Bellevue Hospital Center,50 to 69,100,M,Black/African American,Not Span/Hispanic,4,Emergency,Home or Self Care,2020,MBD021,STIMULANT-RELATED DISORDERS,ADM001,TRANSFUSION OF BLOOD AND BLOOD PRODUCTS,773,OPIOID ABUSE & DEPENDENCE,20,ALCOHOL/DRUG USE AND ALCOHOL/DRUG INDUCED ORGANIC MENTAL DISORDERS,3,Major,Minor,Medical,Medicaid,,,,,Y,34659.47,19932.11
New York City,Manhattan,7002001,001438,Bellevue Hospital Center,30 to 49,112,F,White,Not Span/Hispanic,5,Emergency,Home or Self Care,2020,MBD017,ALCOHOL-RELATED DISORDERS,ADM021,"ADMINISTRATION OF THERAPEUTIC SUBSTANCES, NEC",773,OPIOID ABUSE & DEPENDENCE,20,ALCOHOL/DRUG USE AND ALCOHOL/DRUG INDUCED ORGANIC MENTAL DISORDERS,1,Minor,Minor,Medical,Medicare,,,,,Y,37668.48,21662.54
New York City,Manhattan,7002001,001438,Bellevue Hospital Center,30 to 49,100,M,Other Race,Not Span/Hispanic,7,Emergency,Home or Self Care,2020,MBD017,ALCOHOL-RELATED DISORDERS,SUD001,SUBSTANCE USE DETOXIFICATION,773,OPIOID ABUSE & DEPENDENCE,20,ALCOHOL/DRUG USE AND ALCOHOL/DRUG INDUCED ORGANIC MENTAL DISORDERS,2,Moderate,Minor,Medical,Medicaid,,,,,Y,48274.68,27762
New York City,Manhattan,7002001,001438,Bellevue Hospital Center,18 to 29,114,M,Black/African American,Not Span/Hispanic,11,Urgent,Home or Self Care,2020,MBD018,OPIOID-RELATED DISORDERS,IMG007,COMPUTERIZED TOMOGRAPHY (CT) WITHOUT CONTRAST,773,OPIOID ABUSE & DEPENDENCE,20,ALCOHOL/DRUG USE AND ALCOHOL/DRUG INDUCED ORGANIC MENTAL DISORDERS,3,Major,Moderate,Medical,Private Health Insurance,,,,,N,44858.13,25797.19
New York City,Manhattan,7002001,001438,Bellevue Hospital Center,18 to 29,100,M,Black/African American,Not Span/Hispanic,1,Emergency,Home or Self Care,2020,MBD018,OPIOID-RELATED DISORDERS,ADM021,"ADMINISTRATION OF THERAPEUTIC SUBSTANCES, NEC",773,OPIOID ABUSE & DEPENDENCE,20,ALCOHOL/DRUG USE AND ALCOHOL/DRUG INDUCED ORGANIC MENTAL DISORDERS,2,Moderate,Minor,Medical,Medicaid,,,,,Y,8652.68,4976.02
New York City,Manhattan,7002001,001438,Bellevue Hospital Center,30 to 49,104,M,Black/African American,Not Span/Hispanic,11,Emergency,Home or Self Care,2020,MBD021,STIMULANT-RELATED DISORDERS,MHT001,PHARMACOTHERAPY FOR MENTAL HEALTH (EXCLUDING SUBSTANCE USE),773,OPIOID ABUSE & DEPENDENCE,20,ALCOHOL/DRUG USE AND ALCOHOL/DRUG INDUCED ORGANIC MENTAL DISORDERS,2,Moderate,Minor,Medical,Medicaid,,,,,Y,48623.33,27962.5
New York City,Manhattan,7002001,001438,Bellevue Hospital Center,30 to 49,104,F,Other Race,Spanish/Hispanic,1,Emergency,Home or Self Care,2020,MBD025,OTHER SPECIFIED SUBSTANCE-RELATED DISORDERS,MHT001,PHARMACOTHERAPY FOR MENTAL HEALTH (EXCLUDING SUBSTANCE USE),773,OPIOID ABUSE & DEPENDENCE,20,ALCOHOL/DRUG USE AND ALCOHOL/DRUG INDUCED ORGANIC MENTAL DISORDERS,2,Moderate,Minor,Medical,Medicare,Medicaid,,,,Y,6103.99,3510.31
New York City,Manhattan,7002001,001438,Bellevue Hospital Center,50 to 69,100,M,Black/African American,Not Span/Hispanic,12,Urgent,Court/Law Enforcement,2020,MBD017,ALCOHOL-RELATED DISORDERS,IMG007,COMPUTERIZED TOMOGRAPHY (CT) WITHOUT CONTRAST,773,OPIOID ABUSE & DEPENDENCE,20,ALCOHOL/DRUG USE AND ALCOHOL/DRUG INDUCED ORGANIC MENTAL DISORDERS,3,Major,Major,Medical,Medicaid,,,,,N,84828.44,48783.48
New York City,Manhattan,7002001,001438,Bellevue Hospital Center,30 to 49,104,M,Black/African American,Not Span/Hispanic,2,Emergency,Home or Self Care,2020,MBD021,STIMULANT-RELATED DISORDERS,MHT001,PHARMACOTHERAPY FOR MENTAL HEALTH (EXCLUDING SUBSTANCE USE),773,OPIOID ABUSE & DEPENDENCE,20,ALCOHOL/DRUG USE AND ALCOHOL/DRUG INDUCED ORGANIC MENTAL DISORDERS,2,Moderate,Minor,Medical,Medicaid,,,,,Y,10591.4,6090.94
New York City,Manhattan,7002001,001438,Bellevue Hospital Center,30 to 49,111,F,White,Not Span/Hispanic,1,Emergency,Home or Self Care,2020,MBD021,STIMULANT-RELATED DISORDERS,MHT001,PHARMACOTHERAPY FOR MENTAL HEALTH (EXCLUDING SUBSTANCE USE),773,OPIOID ABUSE & DEPENDENCE,20,ALCOHOL/DRUG USE AND ALCOHOL/DRUG INDUCED ORGANIC MENTAL DISORDERS,2,Moderate,Minor,Medical,Medicaid,,,,,Y,5529.75,3180.07
