Hospital Service Area,Hospital County,Operating Certificate Number,Permanent Facility Id,Facility Name,Age Group,Zip Code - 3 digits,Gender,Race,Ethnicity,Length of Stay,Type of Admission,Patient Disposition,Discharge Year,CCS Diagnosis Code,CCS Diagnosis Description,CCS Procedure Code,CCS Procedure Description,APR DRG Code,APR DRG Description,APR MDC Code,APR MDC Description,APR Severity of Illness Code,APR Severity of Illness Description,APR Risk of Mortality,APR Medical Surgical Description,Payment Typology 1,Payment Typology 2,Payment Typology 3,Birth Weight,Abortion Edit Indicator,Emergency Department Indicator,Total Charges,Total Costs
New York City,Manhattan,7002053,001463,NYU Langone Hospitals,30 to 49,100,M,Black/African American,Not Span/Hispanic,2,Emergency,Home or Self Care,2019,MBD021,STIMULANT-RELATED DISORDERS,,,774,COCAINE ABUSE & DEPENDENCE,20,ALCOHOL/DRUG USE AND ALCOHOL/DRUG INDUCED ORGANIC MENTAL DISORDERS,2,Moderate,Minor,Medical,Self-Pay,,,,,true,15631.26,4220.79
New York City,Manhattan,7002053,001463,NYU Langone Hospitals,18 to 29,100,M,Other Race,Unknown,4,Emergency,Home or Self Care,2019,MBD017,ALCOHOL-RELATED DISORDERS,OTR004,ISOLATION PROCEDURES,774,COCAINE ABUSE & DEPENDENCE,20,ALCOHOL/DRUG USE AND ALCOHOL/DRUG INDUCED ORGANIC MENTAL DISORDERS,2,Moderate,Minor,Medical,Medicaid,,,,,true,52286.05,16149.52
New York City,Manhattan,7002053,001463,NYU Langone Hospitals,18 to 29,112,M,White,Not Span/Hispanic,4,Emergency,Home or Self Care,2019,MBD025,OTHER SPECIFIED SUBSTANCE-RELATED DISORDERS,MAM011,ELECTROENCEPHALOGRAM (EEG),774,COCAINE ABUSE & DEPENDENCE,20,ALCOHOL/DRUG USE AND ALCOHOL/DRUG INDUCED ORGANIC MENTAL DISORDERS,2,Moderate,Moderate,Medical,Private Health Insurance,,,,,false,115803.83,17336.33
New York City,Manhattan,7002053,001463,NYU Langone Hospitals,30 to 49,111,M,White,Not Span/Hispanic,4,Emergency,Home or Self Care,2019,MBD017,ALCOHOL-RELATED DISORDERS,ADM007,INTRAVENOUS INDUCTION OF LABOR,774,COCAINE ABUSE & DEPENDENCE,20,ALCOHOL/DRUG USE AND ALCOHOL/DRUG INDUCED ORGANIC MENTAL DISORDERS,4,Extreme,Moderate,Medical,Blue Cross/Blue Shield,,,,,true,59384.12,15333.22
New York City,Manhattan,7002053,001463,NYU Langone Hospitals,30 to 49,113,M,Other Race,Not Span/Hispanic,8,Emergency,Psychiatric Hospital or Unit of Hosp,2019,MBD017,ALCOHOL-RELATED DISORDERS,,,774,COCAINE ABUSE & DEPENDENCE,20,ALCOHOL/DRUG USE AND ALCOHOL/DRUG INDUCED ORGANIC MENTAL DISORDERS,2,Moderate,Minor,Medical,Medicaid,,,,,true,88759.77,39026.82
New York City,Manhattan,7002053,001463,NYU Langone Hospitals,18 to 29,100,F,White,Not Span/Hispanic,4,Emergency,Home or Self Care,2019,MBD025,OTHER SPECIFIED SUBSTANCE-RELATED DISORDERS,MHT002,PSYCHOTHERAPY FOR MENTAL HEALTH (EXCLUDING SUBSTANCE USE),774,COCAINE ABUSE & DEPENDENCE,20,ALCOHOL/DRUG USE AND ALCOHOL/DRUG INDUCED ORGANIC MENTAL DISORDERS,2,Moderate,Minor,Medical,Blue Cross/Blue Shield,,,,,true,31249.68,11628.32
New York City,Manhattan,7002053,001463,NYU Langone Hospitals,18 to 29,,M,White,Not Span/Hispanic,4,Emergency,Home or Self Care,2019,MBD017,ALCOHOL-RELATED DISORDERS,MHT001,PHARMACOTHERAPY FOR MENTAL HEALTH (EXCLUDING SUBSTANCE USE),774,COCAINE ABUSE & DEPENDENCE,20,ALCOHOL/DRUG USE AND ALCOHOL/DRUG INDUCED ORGANIC MENTAL DISORDERS,2,Moderate,Minor,Medical,Private Health Insurance,,,,,true,29193.07,11249.73
New York City,Manhattan,7002053,001463,NYU Langone Hospitals,50 to 69,100,M,Black/African American,Not Span/Hispanic,3,Emergency,Inpatient Rehabilitation Facility,2019,MBD017,ALCOHOL-RELATED DISORDERS,MAM005,MEASUREMENT DURING CARDIAC CATHETERIZATION,774,COCAINE ABUSE & DEPENDENCE,20,ALCOHOL/DRUG USE AND ALCOHOL/DRUG INDUCED ORGANIC MENTAL DISORDERS,2,Moderate,Minor,Medical,Medicaid,,,,,true,61463.96,15460.2
New York City,Manhattan,7002053,001463,NYU Langone Hospitals,18 to 29,OOS,F,White,Not Span/Hispanic,10,Emergency,Home or Self Care,2019,MBD025,OTHER SPECIFIED SUBSTANCE-RELATED DISORDERS,,,774,COCAINE ABUSE & DEPENDENCE,20,ALCOHOL/DRUG USE AND ALCOHOL/DRUG INDUCED ORGANIC MENTAL DISORDERS,2,Moderate,Minor,Medical,Blue Cross/Blue Shield,,,,,true,61858.53,26482.8
New York City,Manhattan,7002053,001463,NYU Langone Hospitals,30 to 49,112,M,Other Race,Spanish/Hispanic,2,Emergency,Home or Self Care,2019,MBD017,ALCOHOL-RELATED DISORDERS,,,774,COCAINE ABUSE & DEPENDENCE,20,ALCOHOL/DRUG USE AND ALCOHOL/DRUG INDUCED ORGANIC MENTAL DISORDERS,3,Major,Moderate,Medical,Medicaid,,,,,true,28023.55,7856.77
New York City,Manhattan,7002053,001463,NYU Langone Hospitals,50 to 69,104,M,Black/African American,Not Span/Hispanic,3,Emergency,Home w/ Home Health Services,2019,MBD017,ALCOHOL-RELATED DISORDERS,,,774,COCAINE ABUSE & DEPENDENCE,20,ALCOHOL/DRUG USE AND ALCOHOL/DRUG INDUCED ORGANIC MENTAL DISORDERS,2,Moderate,Minor,Medical,Medicaid,,,,,true,39166.57,12182.8
New York City,Manhattan,7002053,001463,NYU Langone Hospitals,30 to 49,100,M,Other Race,Not Span/Hispanic,3,Emergency,Home or Self Care,2019,MBD021,STIMULANT-RELATED DISORDERS,,,774,COCAINE ABUSE & DEPENDENCE,20,ALCOHOL/DRUG USE AND ALCOHOL/DRUG INDUCED ORGANIC MENTAL DISORDERS,2,Moderate,Minor,Medical,Self-Pay,,,,,true,13646.37,3844.8
New York City,Manhattan,7002053,001463,NYU Langone Hospitals,30 to 49,110,M,Other Race,Not Span/Hispanic,4,Emergency,Home or Self Care,2019,MBD019,CANNABIS-RELATED DISORDERS,MHT001,PHARMACOTHERAPY FOR MENTAL HEALTH (EXCLUDING SUBSTANCE USE),774,COCAINE ABUSE & DEPENDENCE,20,ALCOHOL/DRUG USE AND ALCOHOL/DRUG INDUCED ORGANIC MENTAL DISORDERS,2,Moderate,Minor,Medical,Private Health Insurance,,,,,true,32064.05,11857.96
New York City,Manhattan,7002053,001463,NYU Langone Hospitals,30 to 49,104,F,White,Not Span/Hispanic,1,Emergency,Home or Self Care,2019,MBD021,STIMULANT-RELATED DISORDERS,ADM005,ADMINISTRATION OF THROMBOLYTICS AND PLATELET INHIBITORS,774,COCAINE ABUSE & DEPENDENCE,20,ALCOHOL/DRUG USE AND ALCOHOL/DRUG INDUCED ORGANIC MENTAL DISORDERS,3,Major,Minor,Medical,Self-Pay,,,,,true,149439.45,12249.84
New York City,Manhattan,7002053,001463,NYU Langone Hospitals,18 to 29,115,M,Other Race,Not Span/Hispanic,3,Emergency,Home or Self Care,2019,MBD025,OTHER SPECIFIED SUBSTANCE-RELATED DISORDERS,,,774,COCAINE ABUSE & DEPENDENCE,20,ALCOHOL/DRUG USE AND ALCOHOL/DRUG INDUCED ORGANIC MENTAL DISORDERS,2,Moderate,Minor,Medical,Private Health Insurance,,,,,true,24553.53,9098.07
New York City,Manhattan,7002053,001463,NYU Langone Hospitals,30 to 49,113,M,Other Race,Not Span/Hispanic,4,Emergency,Home or Self Care,2019,MBD017,ALCOHOL-RELATED DISORDERS,,,774,COCAINE ABUSE & DEPENDENCE,20,ALCOHOL/DRUG USE AND ALCOHOL/DRUG INDUCED ORGANIC MENTAL DISORDERS,2,Moderate,Minor,Medical,Medicaid,,,,,true,52797.47,20989.5
New York City,Manhattan,7002053,001463,NYU Langone Hospitals,18 to 29,100,F,Black/African American,Not Span/Hispanic,2,Emergency,Home or Self Care,2019,MBD021,STIMULANT-RELATED DISORDERS,MHT002,PSYCHOTHERAPY FOR MENTAL HEALTH (EXCLUDING SUBSTANCE USE),774,COCAINE ABUSE & DEPENDENCE,20,ALCOHOL/DRUG USE AND ALCOHOL/DRUG INDUCED ORGANIC MENTAL DISORDERS,2,Moderate,Minor,Medical,Medicare,Medicaid,,,,true,26377.22,7607.41
New York City,Manhattan,7002053,001463,NYU Langone Hospitals,30 to 49,112,M,White,Not Span/Hispanic,6,Emergency,Home or Self Care,2019,MBD025,OTHER SPECIFIED SUBSTANCE-RELATED DISORDERS,,,774,COCAINE ABUSE & DEPENDENCE,20,ALCOHOL/DRUG USE AND ALCOHOL/DRUG INDUCED ORGANIC MENTAL DISORDERS,2,Moderate,Minor,Medical,Medicaid,,,,,true,39803.24,16213.9
New York City,Manhattan,7002053,001463,NYU Langone Hospitals,30 to 49,OOS,M,White,Not Span/Hispanic,4,Emergency,Home or Self Care,2019,MBD017,ALCOHOL-RELATED DISORDERS,,,774,COCAINE ABUSE & DEPENDENCE,20,ALCOHOL/DRUG USE AND ALCOHOL/DRUG INDUCED ORGANIC MENTAL DISORDERS,2,Moderate,Minor,Medical,Self-Pay,,,,,true,50342.18,15439.35
