Hospital Service Area,Hospital County,Operating Certificate Number,Permanent Facility Id,Facility Name,Age Group,Zip Code - 3 digits,Gender,Race,Ethnicity,Length of Stay,Type of Admission,Patient Disposition,Discharge Year,CCS Diagnosis Code,CCS Diagnosis Description,CCS Procedure Code,CCS Procedure Description,APR DRG Code,APR DRG Description,APR MDC Code,APR MDC Description,APR Severity of Illness Code,APR Severity of Illness Description,APR Risk of Mortality,APR Medical Surgical Description,Payment Typology 1,Payment Typology 2,Payment Typology 3,Birth Weight,Abortion Edit Indicator,Emergency Department Indicator,Total Charges,Total Costs
Long Island,Suffolk,5123000,000885,Long Island Community Hospital,50 to 69,117,M,Black/African American,Not Span/Hispanic,5,Emergency,Home or Self Care,2019,MBD017,ALCOHOL-RELATED DISORDERS,SUD001,SUBSTANCE USE DETOXIFICATION,774,COCAINE ABUSE & DEPENDENCE,20,ALCOHOL/DRUG USE AND ALCOHOL/DRUG INDUCED ORGANIC MENTAL DISORDERS,3,Major,Moderate,Medical,Medicare,Medicare,Medicaid,,,true,43932.19,9084.1
Long Island,Suffolk,5123000,000885,Long Island Community Hospital,50 to 69,117,M,White,Not Span/Hispanic,5,Emergency,Home or Self Care,2019,MBD017,ALCOHOL-RELATED DISORDERS,SUD001,SUBSTANCE USE DETOXIFICATION,774,COCAINE ABUSE & DEPENDENCE,20,ALCOHOL/DRUG USE AND ALCOHOL/DRUG INDUCED ORGANIC MENTAL DISORDERS,3,Major,Moderate,Medical,Private Health Insurance,Medicaid,,,,true,35340.62,7303.04
Long Island,Suffolk,5123000,000885,Long Island Community Hospital,30 to 49,117,F,White,Not Span/Hispanic,5,Emergency,Home or Self Care,2019,MBD017,ALCOHOL-RELATED DISORDERS,SUD001,SUBSTANCE USE DETOXIFICATION,774,COCAINE ABUSE & DEPENDENCE,20,ALCOHOL/DRUG USE AND ALCOHOL/DRUG INDUCED ORGANIC MENTAL DISORDERS,2,Moderate,Minor,Medical,Private Health Insurance,Medicaid,,,,true,26675.68,6278.89
Long Island,Suffolk,5123000,000885,Long Island Community Hospital,30 to 49,117,M,White,Not Span/Hispanic,2,Emergency,Home or Self Care,2019,MBD017,ALCOHOL-RELATED DISORDERS,SUD001,SUBSTANCE USE DETOXIFICATION,774,COCAINE ABUSE & DEPENDENCE,20,ALCOHOL/DRUG USE AND ALCOHOL/DRUG INDUCED ORGANIC MENTAL DISORDERS,2,Moderate,Moderate,Medical,Private Health Insurance,Medicaid,,,,true,18468.44,3179.24
Long Island,Suffolk,5123000,000885,Long Island Community Hospital,30 to 49,117,F,White,Not Span/Hispanic,2,Emergency,Home or Self Care,2019,MBD017,ALCOHOL-RELATED DISORDERS,,,774,COCAINE ABUSE & DEPENDENCE,20,ALCOHOL/DRUG USE AND ALCOHOL/DRUG INDUCED ORGANIC MENTAL DISORDERS,3,Major,Major,Medical,Private Health Insurance,Medicaid,,,,true,35368.86,3550.71
Long Island,Suffolk,5123000,000885,Long Island Community Hospital,30 to 49,117,F,White,Not Span/Hispanic,2,Emergency,Psychiatric Hospital or Unit of Hosp,2019,MBD017,ALCOHOL-RELATED DISORDERS,SUD002,PHARMACOTHERAPY FOR SUBSTANCE USE,774,COCAINE ABUSE & DEPENDENCE,20,ALCOHOL/DRUG USE AND ALCOHOL/DRUG INDUCED ORGANIC MENTAL DISORDERS,2,Moderate,Minor,Medical,Private Health Insurance,Medicaid,,,,true,15717.47,3002.28
Long Island,Suffolk,5123000,000885,Long Island Community Hospital,50 to 69,119,M,White,Not Span/Hispanic,3,Emergency,Home or Self Care,2019,MBD017,ALCOHOL-RELATED DISORDERS,SUD001,SUBSTANCE USE DETOXIFICATION,774,COCAINE ABUSE & DEPENDENCE,20,ALCOHOL/DRUG USE AND ALCOHOL/DRUG INDUCED ORGANIC MENTAL DISORDERS,3,Major,Moderate,Medical,Private Health Insurance,Medicaid,,,,true,22914.5,4676.15
Long Island,Suffolk,5123000,000885,Long Island Community Hospital,30 to 49,117,M,White,Not Span/Hispanic,5,Emergency,Home or Self Care,2019,MBD017,ALCOHOL-RELATED DISORDERS,SUD001,SUBSTANCE USE DETOXIFICATION,774,COCAINE ABUSE & DEPENDENCE,20,ALCOHOL/DRUG USE AND ALCOHOL/DRUG INDUCED ORGANIC MENTAL DISORDERS,2,Moderate,Minor,Medical,Private Health Insurance,Medicaid,,,,true,32711.81,6725.59
Long Island,Suffolk,5123000,000885,Long Island Community Hospital,30 to 49,117,M,Other Race,Not Span/Hispanic,8,Emergency,Home or Self Care,2019,MBD021,STIMULANT-RELATED DISORDERS,SUD002,PHARMACOTHERAPY FOR SUBSTANCE USE,774,COCAINE ABUSE & DEPENDENCE,20,ALCOHOL/DRUG USE AND ALCOHOL/DRUG INDUCED ORGANIC MENTAL DISORDERS,2,Moderate,Minor,Medical,Private Health Insurance,,,,,true,60200.64,7731.2
Long Island,Suffolk,5123000,000885,Long Island Community Hospital,50 to 69,115,M,White,Not Span/Hispanic,2,Emergency,Another Type Not Listed,2019,MBD025,OTHER SPECIFIED SUBSTANCE-RELATED DISORDERS,,,774,COCAINE ABUSE & DEPENDENCE,20,ALCOHOL/DRUG USE AND ALCOHOL/DRUG INDUCED ORGANIC MENTAL DISORDERS,3,Major,Moderate,Medical,Medicare,Medicare,,,,true,18339.14,3051.43
Long Island,Suffolk,5123000,000885,Long Island Community Hospital,30 to 49,117,M,White,Not Span/Hispanic,6,Emergency,Home or Self Care,2019,MBD017,ALCOHOL-RELATED DISORDERS,SUD001,SUBSTANCE USE DETOXIFICATION,774,COCAINE ABUSE & DEPENDENCE,20,ALCOHOL/DRUG USE AND ALCOHOL/DRUG INDUCED ORGANIC MENTAL DISORDERS,3,Major,Moderate,Medical,Private Health Insurance,Medicaid,,,,true,32971.65,7664.45
Long Island,Suffolk,5123000,000885,Long Island Community Hospital,50 to 69,117,M,Black/African American,Not Span/Hispanic,3,Emergency,Home or Self Care,2019,MBD017,ALCOHOL-RELATED DISORDERS,SUD002,PHARMACOTHERAPY FOR SUBSTANCE USE,774,COCAINE ABUSE & DEPENDENCE,20,ALCOHOL/DRUG USE AND ALCOHOL/DRUG INDUCED ORGANIC MENTAL DISORDERS,2,Moderate,Minor,Medical,Private Health Insurance,Medicaid,,,,true,19177.39,4129.31
Long Island,Suffolk,5123000,000885,Long Island Community Hospital,30 to 49,117,M,White,Not Span/Hispanic,6,Emergency,Home or Self Care,2019,MBD017,ALCOHOL-RELATED DISORDERS,SUD001,SUBSTANCE USE DETOXIFICATION,774,COCAINE ABUSE & DEPENDENCE,20,ALCOHOL/DRUG USE AND ALCOHOL/DRUG INDUCED ORGANIC MENTAL DISORDERS,2,Moderate,Minor,Medical,Private Health Insurance,Medicaid,,,,true,40027.32,8134.03
Long Island,Suffolk,5123000,000885,Long Island Community Hospital,30 to 49,117,M,Black/African American,Not Span/Hispanic,1,Emergency,Home or Self Care,2019,MBD019,CANNABIS-RELATED DISORDERS,,,774,COCAINE ABUSE & DEPENDENCE,20,ALCOHOL/DRUG USE AND ALCOHOL/DRUG INDUCED ORGANIC MENTAL DISORDERS,3,Major,Minor,Medical,Medicaid,,,,,true,15656.36,2547.79
