Hospital Service Area,Hospital County,Operating Certificate Number,Permanent Facility Id,Facility Name,Age Group,Zip Code - 3 digits,Gender,Race,Ethnicity,Length of Stay,Type of Admission,Patient Disposition,Discharge Year,CCS Diagnosis Code,CCS Diagnosis Description,CCS Procedure Code,CCS Procedure Description,APR DRG Code,APR DRG Description,APR MDC Code,APR MDC Description,APR Severity of Illness Code,APR Severity of Illness Description,APR Risk of Mortality,APR Medical Surgical Description,Payment Typology 1,Payment Typology 2,Payment Typology 3,Birth Weight,Abortion Edit Indicator,Emergency Department Indicator,Total Charges,Total Costs
Long Island,Suffolk,5123000,000885,Brookhaven Memorial Hospital Medical Center Inc,70 or Older,117,M,Black/African American,Not Span/Hispanic,120 +,Emergency,Skilled Nursing Home,2017,660,Alcohol-related disorders,000,NO PROC,775,Alcohol abuse & dependence,20,Alcohol/Drug Use and Alcohol/Drug Induced Organic Mental Disorders,3,Major,Major,Medical,Medicare,Medicare,Medicaid,,N,Y,1163639.58,285923.24
Long Island,Suffolk,5123000,000885,Brookhaven Memorial Hospital Medical Center Inc,50 to 69,117,F,White,Not Span/Hispanic,11,Emergency,Skilled Nursing Home,2017,660,Alcohol-related disorders,000,NO PROC,775,Alcohol abuse & dependence,20,Alcohol/Drug Use and Alcohol/Drug Induced Organic Mental Disorders,3,Major,Major,Medical,Medicare,Medicare,,,N,Y,72659.50,14629.93
Long Island,Suffolk,5123000,000885,Brookhaven Memorial Hospital Medical Center Inc,50 to 69,117,M,White,Not Span/Hispanic,3,Emergency,Home or Self Care,2017,660,Alcohol-related disorders,219,ALCO/DRUG REHAB/DETOX,775,Alcohol abuse & dependence,20,Alcohol/Drug Use and Alcohol/Drug Induced Organic Mental Disorders,2,Moderate,Moderate,Medical,Private Health Insurance,Medicaid,,,N,Y,36703.30,5680.12
Long Island,Suffolk,5123000,000885,Brookhaven Memorial Hospital Medical Center Inc,50 to 69,119,M,White,Not Span/Hispanic,5,Emergency,Home or Self Care,2017,660,Alcohol-related disorders,219,ALCO/DRUG REHAB/DETOX,775,Alcohol abuse & dependence,20,Alcohol/Drug Use and Alcohol/Drug Induced Organic Mental Disorders,2,Moderate,Minor,Medical,Private Health Insurance,Medicaid,,,N,Y,24997.29,5815.18
Long Island,Suffolk,5123000,000885,Brookhaven Memorial Hospital Medical Center Inc,50 to 69,119,F,White,Not Span/Hispanic,4,Emergency,Psychiatric Hospital or Unit of Hosp,2017,660,Alcohol-related disorders,219,ALCO/DRUG REHAB/DETOX,775,Alcohol abuse & dependence,20,Alcohol/Drug Use and Alcohol/Drug Induced Organic Mental Disorders,2,Moderate,Minor,Medical,Medicaid,,,,N,Y,21482.23,4810.94
Long Island,Suffolk,5123000,000885,Brookhaven Memorial Hospital Medical Center Inc,50 to 69,117,M,White,Not Span/Hispanic,5,Emergency,Skilled Nursing Home,2017,661,Substance-related disorders,219,ALCO/DRUG REHAB/DETOX,775,Alcohol abuse & dependence,20,Alcohol/Drug Use and Alcohol/Drug Induced Organic Mental Disorders,2,Moderate,Minor,Medical,Medicare,Medicare,Medicaid,,N,Y,45533.39,7529.81
Long Island,Suffolk,5123000,000885,Brookhaven Memorial Hospital Medical Center Inc,30 to 49,119,M,White,Not Span/Hispanic,2,Emergency,Home or Self Care,2017,660,Alcohol-related disorders,219,ALCO/DRUG REHAB/DETOX,775,Alcohol abuse & dependence,20,Alcohol/Drug Use and Alcohol/Drug Induced Organic Mental Disorders,2,Moderate,Moderate,Medical,Private Health Insurance,Medicaid,,,N,Y,15701.48,2985.88
Long Island,Suffolk,5123000,000885,Brookhaven Memorial Hospital Medical Center Inc,50 to 69,117,M,White,Not Span/Hispanic,3,Emergency,Home or Self Care,2017,660,Alcohol-related disorders,219,ALCO/DRUG REHAB/DETOX,775,Alcohol abuse & dependence,20,Alcohol/Drug Use and Alcohol/Drug Induced Organic Mental Disorders,2,Moderate,Moderate,Medical,Self-Pay,,,,N,Y,26871.31,4414.13
Long Island,Suffolk,5123000,000885,Brookhaven Memorial Hospital Medical Center Inc,30 to 49,119,F,White,Not Span/Hispanic,5,Emergency,Psychiatric Hospital or Unit of Hosp,2017,660,Alcohol-related disorders,219,ALCO/DRUG REHAB/DETOX,775,Alcohol abuse & dependence,20,Alcohol/Drug Use and Alcohol/Drug Induced Organic Mental Disorders,2,Moderate,Minor,Medical,Medicaid,,,,N,Y,27382.07,6043.30
Long Island,Suffolk,5123000,000885,Brookhaven Memorial Hospital Medical Center Inc,50 to 69,119,F,White,Not Span/Hispanic,5,Emergency,Home w/ Home Health Services,2017,660,Alcohol-related disorders,219,ALCO/DRUG REHAB/DETOX,775,Alcohol abuse & dependence,20,Alcohol/Drug Use and Alcohol/Drug Induced Organic Mental Disorders,2,Moderate,Moderate,Medical,Private Health Insurance,,,,N,Y,34130.46,6203.58
Long Island,Suffolk,5123000,000885,Brookhaven Memorial Hospital Medical Center Inc,70 or Older,117,F,White,Not Span/Hispanic,5,Emergency,Skilled Nursing Home,2017,660,Alcohol-related disorders,219,ALCO/DRUG REHAB/DETOX,775,Alcohol abuse & dependence,20,Alcohol/Drug Use and Alcohol/Drug Induced Organic Mental Disorders,2,Moderate,Moderate,Medical,Medicare,Medicare,Blue Cross/Blue Shield,,N,Y,32244.15,6449.27
Long Island,Suffolk,5123000,000885,Brookhaven Memorial Hospital Medical Center Inc,50 to 69,119,F,Black/African American,Not Span/Hispanic,3,Emergency,Home or Self Care,2017,660,Alcohol-related disorders,219,ALCO/DRUG REHAB/DETOX,775,Alcohol abuse & dependence,20,Alcohol/Drug Use and Alcohol/Drug Induced Organic Mental Disorders,2,Moderate,Moderate,Medical,Private Health Insurance,Medicaid,,,N,Y,19132.71,4000.33
Long Island,Suffolk,5123000,000885,Brookhaven Memorial Hospital Medical Center Inc,30 to 49,119,F,White,Not Span/Hispanic,4,Emergency,Home or Self Care,2017,660,Alcohol-related disorders,219,ALCO/DRUG REHAB/DETOX,775,Alcohol abuse & dependence,20,Alcohol/Drug Use and Alcohol/Drug Induced Organic Mental Disorders,3,Major,Moderate,Medical,Private Health Insurance,Medicaid,,,N,Y,34381.67,6472.76
Long Island,Suffolk,5123000,000885,Brookhaven Memorial Hospital Medical Center Inc,50 to 69,117,M,White,Not Span/Hispanic,3,Emergency,Home or Self Care,2017,660,Alcohol-related disorders,219,ALCO/DRUG REHAB/DETOX,775,Alcohol abuse & dependence,20,Alcohol/Drug Use and Alcohol/Drug Induced Organic Mental Disorders,3,Major,Major,Medical,Blue Cross/Blue Shield,,,,N,Y,31730.84,4331.85
Long Island,Suffolk,5123000,000885,Brookhaven Memorial Hospital Medical Center Inc,30 to 49,117,F,Other Race,Not Span/Hispanic,3,Emergency,Home or Self Care,2017,660,Alcohol-related disorders,219,ALCO/DRUG REHAB/DETOX,775,Alcohol abuse & dependence,20,Alcohol/Drug Use and Alcohol/Drug Induced Organic Mental Disorders,2,Moderate,Minor,Medical,Medicaid,,,,N,Y,28553.03,5426.56
Long Island,Suffolk,5123000,000885,Brookhaven Memorial Hospital Medical Center Inc,50 to 69,117,M,White,Not Span/Hispanic,4,Emergency,Home or Self Care,2017,660,Alcohol-related disorders,219,ALCO/DRUG REHAB/DETOX,775,Alcohol abuse & dependence,20,Alcohol/Drug Use and Alcohol/Drug Induced Organic Mental Disorders,2,Moderate,Moderate,Medical,Private Health Insurance,,,,N,Y,24163.83,5128.07
Long Island,Suffolk,5123000,000885,Brookhaven Memorial Hospital Medical Center Inc,50 to 69,117,M,White,Not Span/Hispanic,2,Emergency,Home or Self Care,2017,660,Alcohol-related disorders,219,ALCO/DRUG REHAB/DETOX,775,Alcohol abuse & dependence,20,Alcohol/Drug Use and Alcohol/Drug Induced Organic Mental Disorders,2,Moderate,Minor,Medical,Private Health Insurance,,,,N,Y,14861.59,2889.27
Long Island,Suffolk,5123000,000885,Brookhaven Memorial Hospital Medical Center Inc,30 to 49,117,M,White,Not Span/Hispanic,8,Emergency,Home or Self Care,2017,660,Alcohol-related disorders,219,ALCO/DRUG REHAB/DETOX,775,Alcohol abuse & dependence,20,Alcohol/Drug Use and Alcohol/Drug Induced Organic Mental Disorders,2,Moderate,Minor,Medical,Blue Cross/Blue Shield,,,,N,Y,47864.40,9816.39
Long Island,Suffolk,5123000,000885,Brookhaven Memorial Hospital Medical Center Inc,30 to 49,119,M,Black/African American,Not Span/Hispanic,1,Emergency,Home or Self Care,2017,660,Alcohol-related disorders,219,ALCO/DRUG REHAB/DETOX,775,Alcohol abuse & dependence,20,Alcohol/Drug Use and Alcohol/Drug Induced Organic Mental Disorders,2,Moderate,Minor,Medical,Self-Pay,,,,N,Y,34287.98,2377.37
Long Island,Suffolk,5123000,000885,Brookhaven Memorial Hospital Medical Center Inc,50 to 69,117,M,White,Not Span/Hispanic,2,Emergency,Home or Self Care,2017,660,Alcohol-related disorders,219,ALCO/DRUG REHAB/DETOX,775,Alcohol abuse & dependence,20,Alcohol/Drug Use and Alcohol/Drug Induced Organic Mental Disorders,2,Moderate,Minor,Medical,Medicaid,,,,N,Y,13850.97,2752.80
Long Island,Suffolk,5123000,000885,Brookhaven Memorial Hospital Medical Center Inc,30 to 49,117,M,White,Not Span/Hispanic,4,Emergency,Home or Self Care,2017,660,Alcohol-related disorders,199,ELECTROENCEPHALOGRAM,775,Alcohol abuse & dependence,20,Alcohol/Drug Use and Alcohol/Drug Induced Organic Mental Disorders,2,Moderate,Minor,Medical,Private Health Insurance,,,,N,Y,35498.60,5876.90
Long Island,Suffolk,5123000,000885,Brookhaven Memorial Hospital Medical Center Inc,50 to 69,119,M,White,Not Span/Hispanic,6,Emergency,Skilled Nursing Home,2017,660,Alcohol-related disorders,219,ALCO/DRUG REHAB/DETOX,775,Alcohol abuse & dependence,20,Alcohol/Drug Use and Alcohol/Drug Induced Organic Mental Disorders,3,Major,Moderate,Medical,Medicare,Medicare,,,N,Y,33973.29,7388.63
Long Island,Suffolk,5123000,000885,Brookhaven Memorial Hospital Medical Center Inc,18 to 29,117,M,Other Race,Not Span/Hispanic,2,Emergency,Home or Self Care,2017,660,Alcohol-related disorders,219,ALCO/DRUG REHAB/DETOX,775,Alcohol abuse & dependence,20,Alcohol/Drug Use and Alcohol/Drug Induced Organic Mental Disorders,2,Moderate,Minor,Medical,Medicaid,,,,N,Y,37846.20,3505.98
Long Island,Suffolk,5123000,000885,Brookhaven Memorial Hospital Medical Center Inc,50 to 69,117,M,White,Not Span/Hispanic,2,Emergency,Home or Self Care,2017,660,Alcohol-related disorders,219,ALCO/DRUG REHAB/DETOX,775,Alcohol abuse & dependence,20,Alcohol/Drug Use and Alcohol/Drug Induced Organic Mental Disorders,2,Moderate,Minor,Medical,Private Health Insurance,,,,N,Y,14266.20,2860.65
Long Island,Suffolk,5123000,000885,Brookhaven Memorial Hospital Medical Center Inc,30 to 49,117,M,White,Not Span/Hispanic,8,Emergency,Home or Self Care,2017,660,Alcohol-related disorders,219,ALCO/DRUG REHAB/DETOX,775,Alcohol abuse & dependence,20,Alcohol/Drug Use and Alcohol/Drug Induced Organic Mental Disorders,2,Moderate,Minor,Medical,Private Health Insurance,,,,N,Y,39224.65,9295.90
Long Island,Suffolk,5123000,000885,Brookhaven Memorial Hospital Medical Center Inc,30 to 49,117,M,White,Not Span/Hispanic,6,Emergency,Skilled Nursing Home,2017,660,Alcohol-related disorders,219,ALCO/DRUG REHAB/DETOX,775,Alcohol abuse & dependence,20,Alcohol/Drug Use and Alcohol/Drug Induced Organic Mental Disorders,3,Major,Moderate,Medical,Private Health Insurance,,,,N,Y,39306.57,7671.08
Long Island,Suffolk,5123000,000885,Brookhaven Memorial Hospital Medical Center Inc,50 to 69,117,M,White,Not Span/Hispanic,3,Emergency,Home or Self Care,2017,660,Alcohol-related disorders,219,ALCO/DRUG REHAB/DETOX,775,Alcohol abuse & dependence,20,Alcohol/Drug Use and Alcohol/Drug Induced Organic Mental Disorders,2,Moderate,Minor,Medical,Blue Cross/Blue Shield,,,,N,Y,25111.55,4334.09
Long Island,Suffolk,5123000,000885,Brookhaven Memorial Hospital Medical Center Inc,50 to 69,117,M,White,Not Span/Hispanic,4,Emergency,Home or Self Care,2017,660,Alcohol-related disorders,219,ALCO/DRUG REHAB/DETOX,775,Alcohol abuse & dependence,20,Alcohol/Drug Use and Alcohol/Drug Induced Organic Mental Disorders,2,Moderate,Minor,Medical,Private Health Insurance,,,,N,Y,23970.04,5173.78
Long Island,Suffolk,5123000,000885,Brookhaven Memorial Hospital Medical Center Inc,30 to 49,119,M,Other Race,Not Span/Hispanic,2,Emergency,Home or Self Care,2017,660,Alcohol-related disorders,000,NO PROC,775,Alcohol abuse & dependence,20,Alcohol/Drug Use and Alcohol/Drug Induced Organic Mental Disorders,2,Moderate,Major,Medical,Medicaid,,,,N,Y,19538.67,3024.02
Long Island,Suffolk,5123000,000885,Brookhaven Memorial Hospital Medical Center Inc,50 to 69,117,M,White,Not Span/Hispanic,4,Emergency,Home or Self Care,2017,660,Alcohol-related disorders,219,ALCO/DRUG REHAB/DETOX,775,Alcohol abuse & dependence,20,Alcohol/Drug Use and Alcohol/Drug Induced Organic Mental Disorders,2,Moderate,Minor,Medical,Private Health Insurance,,,,N,Y,24304.09,5155.35
Long Island,Suffolk,5123000,000885,Brookhaven Memorial Hospital Medical Center Inc,50 to 69,117,M,White,Not Span/Hispanic,2,Emergency,Home or Self Care,2017,660,Alcohol-related disorders,219,ALCO/DRUG REHAB/DETOX,775,Alcohol abuse & dependence,20,Alcohol/Drug Use and Alcohol/Drug Induced Organic Mental Disorders,2,Moderate,Minor,Medical,Medicaid,,,,N,Y,13341.91,2784.99
Long Island,Suffolk,5123000,000885,Brookhaven Memorial Hospital Medical Center Inc,30 to 49,119,M,White,Not Span/Hispanic,4,Emergency,Home or Self Care,2017,660,Alcohol-related disorders,219,ALCO/DRUG REHAB/DETOX,775,Alcohol abuse & dependence,20,Alcohol/Drug Use and Alcohol/Drug Induced Organic Mental Disorders,2,Moderate,Minor,Medical,Medicaid,,,,N,Y,29221.29,5832.96
Long Island,Suffolk,5123000,000885,Brookhaven Memorial Hospital Medical Center Inc,50 to 69,119,F,White,Not Span/Hispanic,5,Emergency,Home or Self Care,2017,661,Substance-related disorders,070,UP GASTRO ENDOSC/BIOPSY,775,Alcohol abuse & dependence,20,Alcohol/Drug Use and Alcohol/Drug Induced Organic Mental Disorders,2,Moderate,Minor,Medical,Medicare,,,,N,Y,37846.74,8084.96
Long Island,Suffolk,5123000,000885,Brookhaven Memorial Hospital Medical Center Inc,30 to 49,119,M,Black/African American,Not Span/Hispanic,13,Emergency,Home or Self Care,2017,660,Alcohol-related disorders,216,RESP INTUB/MECH VENTIL,775,Alcohol abuse & dependence,20,Alcohol/Drug Use and Alcohol/Drug Induced Organic Mental Disorders,4,Extreme,Extreme,Medical,Medicaid,,,,N,Y,137207.42,28475.57
Long Island,Suffolk,5123000,000885,Brookhaven Memorial Hospital Medical Center Inc,50 to 69,119,M,White,Not Span/Hispanic,4,Emergency,Home or Self Care,2017,660,Alcohol-related disorders,219,ALCO/DRUG REHAB/DETOX,775,Alcohol abuse & dependence,20,Alcohol/Drug Use and Alcohol/Drug Induced Organic Mental Disorders,2,Moderate,Moderate,Medical,Private Health Insurance,,,,N,Y,22869.06,4935.77
Long Island,Suffolk,5123000,000885,Brookhaven Memorial Hospital Medical Center Inc,50 to 69,117,M,White,Not Span/Hispanic,5,Emergency,Home or Self Care,2017,660,Alcohol-related disorders,070,UP GASTRO ENDOSC/BIOPSY,775,Alcohol abuse & dependence,20,Alcohol/Drug Use and Alcohol/Drug Induced Organic Mental Disorders,3,Major,Major,Medical,Blue Cross/Blue Shield,Medicare,,,N,Y,83323.41,11781.52
Long Island,Suffolk,5123000,000885,Brookhaven Memorial Hospital Medical Center Inc,50 to 69,117,M,White,Not Span/Hispanic,5,Emergency,Another Type Not Listed,2017,660,Alcohol-related disorders,219,ALCO/DRUG REHAB/DETOX,775,Alcohol abuse & dependence,20,Alcohol/Drug Use and Alcohol/Drug Induced Organic Mental Disorders,2,Moderate,Moderate,Medical,Private Health Insurance,,,,N,Y,32168.67,6433.43
Long Island,Suffolk,5123000,000885,Brookhaven Memorial Hospital Medical Center Inc,30 to 49,119,M,White,Not Span/Hispanic,2,Emergency,Court/Law Enforcement,2017,660,Alcohol-related disorders,000,NO PROC,775,Alcohol abuse & dependence,20,Alcohol/Drug Use and Alcohol/Drug Induced Organic Mental Disorders,2,Moderate,Minor,Medical,Medicaid,,,,N,Y,23285.09,3913.94
Long Island,Suffolk,5123000,000885,Brookhaven Memorial Hospital Medical Center Inc,50 to 69,119,F,White,Not Span/Hispanic,3,Emergency,Home w/ Home Health Services,2017,660,Alcohol-related disorders,219,ALCO/DRUG REHAB/DETOX,775,Alcohol abuse & dependence,20,Alcohol/Drug Use and Alcohol/Drug Induced Organic Mental Disorders,2,Moderate,Moderate,Medical,Private Health Insurance,,,,N,Y,29739.22,4135.44
Long Island,Suffolk,5123000,000885,Brookhaven Memorial Hospital Medical Center Inc,50 to 69,117,M,Black/African American,Not Span/Hispanic,4,Emergency,Home w/ Home Health Services,2017,660,Alcohol-related disorders,171,SUTURE SKIN/SUBCUT TISS,775,Alcohol abuse & dependence,20,Alcohol/Drug Use and Alcohol/Drug Induced Organic Mental Disorders,2,Moderate,Minor,Medical,Medicare,,,,N,Y,39736.86,6115.28
Long Island,Suffolk,5123000,000885,Brookhaven Memorial Hospital Medical Center Inc,30 to 49,119,M,White,Not Span/Hispanic,1,Emergency,Home or Self Care,2017,660,Alcohol-related disorders,000,NO PROC,775,Alcohol abuse & dependence,20,Alcohol/Drug Use and Alcohol/Drug Induced Organic Mental Disorders,3,Major,Moderate,Medical,Medicaid,,,,N,Y,16275.46,2557.02
Long Island,Suffolk,5123000,000885,Brookhaven Memorial Hospital Medical Center Inc,50 to 69,117,F,White,Not Span/Hispanic,3,Emergency,Home or Self Care,2017,660,Alcohol-related disorders,219,ALCO/DRUG REHAB/DETOX,775,Alcohol abuse & dependence,20,Alcohol/Drug Use and Alcohol/Drug Induced Organic Mental Disorders,2,Moderate,Minor,Medical,Private Health Insurance,,,,N,Y,28222.41,4361.83
Long Island,Suffolk,5123000,000885,Brookhaven Memorial Hospital Medical Center Inc,50 to 69,117,M,White,Not Span/Hispanic,5,Emergency,Another Type Not Listed,2017,660,Alcohol-related disorders,219,ALCO/DRUG REHAB/DETOX,775,Alcohol abuse & dependence,20,Alcohol/Drug Use and Alcohol/Drug Induced Organic Mental Disorders,3,Major,Moderate,Medical,Private Health Insurance,,,,N,Y,66411.44,8439.63
Long Island,Suffolk,5123000,000885,Brookhaven Memorial Hospital Medical Center Inc,50 to 69,117,M,White,Not Span/Hispanic,4,Emergency,Home or Self Care,2017,660,Alcohol-related disorders,000,NO PROC,775,Alcohol abuse & dependence,20,Alcohol/Drug Use and Alcohol/Drug Induced Organic Mental Disorders,2,Moderate,Minor,Medical,Private Health Insurance,,,,N,Y,25835.90,5480.49
Long Island,Suffolk,5123000,000885,Brookhaven Memorial Hospital Medical Center Inc,50 to 69,119,M,White,Not Span/Hispanic,1,Emergency,Home or Self Care,2017,660,Alcohol-related disorders,219,ALCO/DRUG REHAB/DETOX,775,Alcohol abuse & dependence,20,Alcohol/Drug Use and Alcohol/Drug Induced Organic Mental Disorders,3,Major,Moderate,Medical,Private Health Insurance,,,,N,Y,25784.42,3143.78
Long Island,Suffolk,5123000,000885,Brookhaven Memorial Hospital Medical Center Inc,30 to 49,117,M,White,Not Span/Hispanic,3,Emergency,Home or Self Care,2017,660,Alcohol-related disorders,219,ALCO/DRUG REHAB/DETOX,775,Alcohol abuse & dependence,20,Alcohol/Drug Use and Alcohol/Drug Induced Organic Mental Disorders,2,Moderate,Moderate,Medical,Private Health Insurance,,,,N,Y,21560.66,4228.45
Long Island,Suffolk,5123000,000885,Brookhaven Memorial Hospital Medical Center Inc,50 to 69,117,M,Black/African American,Not Span/Hispanic,1,Emergency,Home or Self Care,2017,660,Alcohol-related disorders,000,NO PROC,775,Alcohol abuse & dependence,20,Alcohol/Drug Use and Alcohol/Drug Induced Organic Mental Disorders,2,Moderate,Moderate,Medical,Medicare,Medicare,,,N,Y,12321.16,1985.69
Long Island,Suffolk,5123000,000885,Brookhaven Memorial Hospital Medical Center Inc,30 to 49,119,M,Other Race,Not Span/Hispanic,2,Emergency,Home or Self Care,2017,660,Alcohol-related disorders,219,ALCO/DRUG REHAB/DETOX,775,Alcohol abuse & dependence,20,Alcohol/Drug Use and Alcohol/Drug Induced Organic Mental Disorders,3,Major,Moderate,Medical,Medicaid,,,,N,Y,18516.53,3170.33
Long Island,Suffolk,5123000,000885,Brookhaven Memorial Hospital Medical Center Inc,50 to 69,119,M,White,Not Span/Hispanic,3,Emergency,Home or Self Care,2017,660,Alcohol-related disorders,219,ALCO/DRUG REHAB/DETOX,775,Alcohol abuse & dependence,20,Alcohol/Drug Use and Alcohol/Drug Induced Organic Mental Disorders,2,Moderate,Minor,Medical,Private Health Insurance,,,,N,Y,16617.61,3787.82
Long Island,Suffolk,5123000,000885,Brookhaven Memorial Hospital Medical Center Inc,30 to 49,117,M,White,Not Span/Hispanic,2,Emergency,Home or Self Care,2017,660,Alcohol-related disorders,219,ALCO/DRUG REHAB/DETOX,775,Alcohol abuse & dependence,20,Alcohol/Drug Use and Alcohol/Drug Induced Organic Mental Disorders,2,Moderate,Minor,Medical,Private Health Insurance,,,,N,Y,30918.96,4904.59
Long Island,Suffolk,5123000,000885,Brookhaven Memorial Hospital Medical Center Inc,50 to 69,117,M,White,Not Span/Hispanic,5,Emergency,Another Type Not Listed,2017,660,Alcohol-related disorders,219,ALCO/DRUG REHAB/DETOX,775,Alcohol abuse & dependence,20,Alcohol/Drug Use and Alcohol/Drug Induced Organic Mental Disorders,2,Moderate,Moderate,Medical,Self-Pay,,,,N,Y,43741.78,7109.32
Long Island,Suffolk,5123000,000885,Brookhaven Memorial Hospital Medical Center Inc,30 to 49,117,M,White,Not Span/Hispanic,3,Emergency,Home or Self Care,2017,660,Alcohol-related disorders,219,ALCO/DRUG REHAB/DETOX,775,Alcohol abuse & dependence,20,Alcohol/Drug Use and Alcohol/Drug Induced Organic Mental Disorders,2,Moderate,Minor,Medical,Private Health Insurance,,,,N,Y,18269.71,3843.65
Long Island,Suffolk,5123000,000885,Brookhaven Memorial Hospital Medical Center Inc,30 to 49,119,M,White,Not Span/Hispanic,4,Emergency,Home or Self Care,2017,660,Alcohol-related disorders,219,ALCO/DRUG REHAB/DETOX,775,Alcohol abuse & dependence,20,Alcohol/Drug Use and Alcohol/Drug Induced Organic Mental Disorders,3,Major,Major,Medical,Medicaid,,,,N,Y,35615.15,5577.21
Long Island,Suffolk,5123000,000885,Brookhaven Memorial Hospital Medical Center Inc,30 to 49,,M,White,Not Span/Hispanic,1,Emergency,Home or Self Care,2017,660,Alcohol-related disorders,219,ALCO/DRUG REHAB/DETOX,775,Alcohol abuse & dependence,20,Alcohol/Drug Use and Alcohol/Drug Induced Organic Mental Disorders,3,Major,Moderate,Medical,Medicaid,,,,N,Y,9609.14,1715.87
Long Island,Suffolk,5123000,000885,Brookhaven Memorial Hospital Medical Center Inc,50 to 69,117,M,White,Not Span/Hispanic,6,Emergency,Home w/ Home Health Services,2017,660,Alcohol-related disorders,219,ALCO/DRUG REHAB/DETOX,775,Alcohol abuse & dependence,20,Alcohol/Drug Use and Alcohol/Drug Induced Organic Mental Disorders,2,Moderate,Minor,Medical,Private Health Insurance,,,,N,Y,32022.78,7177.11
Long Island,Suffolk,5123000,000885,Brookhaven Memorial Hospital Medical Center Inc,30 to 49,119,F,White,Not Span/Hispanic,6,Emergency,Home w/ Home Health Services,2017,660,Alcohol-related disorders,219,ALCO/DRUG REHAB/DETOX,775,Alcohol abuse & dependence,20,Alcohol/Drug Use and Alcohol/Drug Induced Organic Mental Disorders,2,Moderate,Minor,Medical,Private Health Insurance,,,,N,Y,33092.67,7334.88
Long Island,Suffolk,5123000,000885,Brookhaven Memorial Hospital Medical Center Inc,50 to 69,119,F,White,Not Span/Hispanic,3,Emergency,Home w/ Home Health Services,2017,660,Alcohol-related disorders,219,ALCO/DRUG REHAB/DETOX,775,Alcohol abuse & dependence,20,Alcohol/Drug Use and Alcohol/Drug Induced Organic Mental Disorders,2,Moderate,Major,Medical,Private Health Insurance,Medicaid,,,N,Y,23344.53,4160.15
Long Island,Suffolk,5123000,000885,Brookhaven Memorial Hospital Medical Center Inc,50 to 69,117,M,White,Not Span/Hispanic,2,Emergency,Home or Self Care,2017,660,Alcohol-related disorders,219,ALCO/DRUG REHAB/DETOX,775,Alcohol abuse & dependence,20,Alcohol/Drug Use and Alcohol/Drug Induced Organic Mental Disorders,2,Moderate,Minor,Medical,Private Health Insurance,Medicaid,,,N,Y,22574.31,3499.63
Long Island,Suffolk,5123000,000885,Brookhaven Memorial Hospital Medical Center Inc,30 to 49,117,M,White,Not Span/Hispanic,6,Emergency,Home or Self Care,2017,660,Alcohol-related disorders,219,ALCO/DRUG REHAB/DETOX,775,Alcohol abuse & dependence,20,Alcohol/Drug Use and Alcohol/Drug Induced Organic Mental Disorders,3,Major,Minor,Medical,Blue Cross/Blue Shield,Medicaid,,,N,Y,55945.16,11969.24
Long Island,Suffolk,5123000,000885,Brookhaven Memorial Hospital Medical Center Inc,30 to 49,117,M,White,Not Span/Hispanic,7,Emergency,Home or Self Care,2017,660,Alcohol-related disorders,219,ALCO/DRUG REHAB/DETOX,775,Alcohol abuse & dependence,20,Alcohol/Drug Use and Alcohol/Drug Induced Organic Mental Disorders,2,Moderate,Moderate,Medical,Medicare,Medicare,Medicaid,,N,Y,34764.79,8099.49