Hospital Service Area,Hospital County,Operating Certificate Number,Permanent Facility Id,Facility Name,Age Group,Zip Code - 3 digits,Gender,Race,Ethnicity,Length of Stay,Type of Admission,Patient Disposition,Discharge Year,CCS Diagnosis Code,CCS Diagnosis Description,CCS Procedure Code,CCS Procedure Description,APR DRG Code,APR DRG Description,APR MDC Code,APR MDC Description,APR Severity of Illness Code,APR Severity of Illness Description,APR Risk of Mortality,APR Medical Surgical Description,Payment Typology 1,Payment Typology 2,Payment Typology 3,Birth Weight,Abortion Edit Indicator,Emergency Department Indicator,Total Charges,Total Costs
New York City,Manhattan,7002053,001463,NYU Langone Hospitals,30 to 49,112,F,Other Race,Not Span/Hispanic,1,Emergency,Home or Self Care,2019,MBD017,ALCOHOL-RELATED DISORDERS,,,775,ALCOHOL ABUSE & DEPENDENCE,20,ALCOHOL/DRUG USE AND ALCOHOL/DRUG INDUCED ORGANIC MENTAL DISORDERS,2,Moderate,Minor,Medical,Blue Cross/Blue Shield,,,,,true,22709.1,7691.77
New York City,Manhattan,7002053,001463,NYU Langone Hospitals,50 to 69,100,F,White,Not Span/Hispanic,3,Emergency,Home w/ Home Health Services,2019,MBD017,ALCOHOL-RELATED DISORDERS,,,775,ALCOHOL ABUSE & DEPENDENCE,20,ALCOHOL/DRUG USE AND ALCOHOL/DRUG INDUCED ORGANIC MENTAL DISORDERS,3,Major,Extreme,Medical,Blue Cross/Blue Shield,,,,,true,40889.33,12848.09
New York City,Manhattan,7002053,001463,NYU Langone Hospitals,50 to 69,100,M,White,Not Span/Hispanic,3,Emergency,Home or Self Care,2019,MBD017,ALCOHOL-RELATED DISORDERS,,,775,ALCOHOL ABUSE & DEPENDENCE,20,ALCOHOL/DRUG USE AND ALCOHOL/DRUG INDUCED ORGANIC MENTAL DISORDERS,3,Major,Moderate,Medical,Medicaid,,,,,true,61220.78,12807.31
New York City,Manhattan,7002053,001463,NYU Langone Hospitals,50 to 69,112,M,White,Not Span/Hispanic,1,Emergency,Home or Self Care,2019,MBD017,ALCOHOL-RELATED DISORDERS,,,775,ALCOHOL ABUSE & DEPENDENCE,20,ALCOHOL/DRUG USE AND ALCOHOL/DRUG INDUCED ORGANIC MENTAL DISORDERS,2,Moderate,Minor,Medical,Medicare,Medicaid,,,,true,28112.73,5841.4
New York City,Manhattan,7002053,001463,NYU Langone Hospitals,30 to 49,113,F,White,Not Span/Hispanic,4,Emergency,Home or Self Care,2019,MBD017,ALCOHOL-RELATED DISORDERS,,,775,ALCOHOL ABUSE & DEPENDENCE,20,ALCOHOL/DRUG USE AND ALCOHOL/DRUG INDUCED ORGANIC MENTAL DISORDERS,2,Moderate,Minor,Medical,Private Health Insurance,Medicare,,,,true,30488.65,11906.74
New York City,Manhattan,7002053,001463,NYU Langone Hospitals,70 or Older,112,M,White,Spanish/Hispanic,3,Emergency,Home w/ Home Health Services,2019,MBD017,ALCOHOL-RELATED DISORDERS,,,775,ALCOHOL ABUSE & DEPENDENCE,20,ALCOHOL/DRUG USE AND ALCOHOL/DRUG INDUCED ORGANIC MENTAL DISORDERS,3,Major,Major,Medical,Medicare,Blue Cross/Blue Shield,,,,true,43604.23,15624.18
New York City,Manhattan,7002053,001463,NYU Langone Hospitals,70 or Older,100,M,White,Not Span/Hispanic,9,Emergency,Skilled Nursing Home,2019,MBD017,ALCOHOL-RELATED DISORDERS,,,775,ALCOHOL ABUSE & DEPENDENCE,20,ALCOHOL/DRUG USE AND ALCOHOL/DRUG INDUCED ORGANIC MENTAL DISORDERS,3,Major,Major,Medical,Medicare,,,,,true,99258.93,33445.46
New York City,Manhattan,7002053,001463,NYU Langone Hospitals,50 to 69,,F,White,Not Span/Hispanic,2,Emergency,Home or Self Care,2019,MBD017,ALCOHOL-RELATED DISORDERS,,,775,ALCOHOL ABUSE & DEPENDENCE,20,ALCOHOL/DRUG USE AND ALCOHOL/DRUG INDUCED ORGANIC MENTAL DISORDERS,1,Minor,Minor,Medical,Self-Pay,,,,,true,26390.06,7954.25
New York City,Manhattan,7002053,001463,NYU Langone Hospitals,30 to 49,112,M,Multi-racial,Spanish/Hispanic,2,Emergency,Home or Self Care,2019,MBD017,ALCOHOL-RELATED DISORDERS,MAM007,ELECTROCARDIOGRAM (ECG),775,ALCOHOL ABUSE & DEPENDENCE,20,ALCOHOL/DRUG USE AND ALCOHOL/DRUG INDUCED ORGANIC MENTAL DISORDERS,2,Moderate,Moderate,Medical,Medicaid,,,,,true,29023.63,8747.71
New York City,Manhattan,7002053,001463,NYU Langone Hospitals,50 to 69,112,F,Black/African American,Not Span/Hispanic,6,Emergency,Short-term Hospital,2019,MBD017,ALCOHOL-RELATED DISORDERS,,,775,ALCOHOL ABUSE & DEPENDENCE,20,ALCOHOL/DRUG USE AND ALCOHOL/DRUG INDUCED ORGANIC MENTAL DISORDERS,2,Moderate,Moderate,Medical,Medicare,,,,,true,43538.15,16746.43
New York City,Manhattan,7002053,001463,NYU Langone Hospitals,50 to 69,100,M,White,Not Span/Hispanic,12,Emergency,Home w/ Home Health Services,2019,MBD017,ALCOHOL-RELATED DISORDERS,CAR024,VENOUS AND ARTERIAL CATHETER PLACEMENT,775,ALCOHOL ABUSE & DEPENDENCE,20,ALCOHOL/DRUG USE AND ALCOHOL/DRUG INDUCED ORGANIC MENTAL DISORDERS,4,Extreme,Extreme,Medical,Private Health Insurance,,,,,true,291799.81,76489.32
New York City,Manhattan,7002053,001463,NYU Langone Hospitals,50 to 69,104,M,Black/African American,Not Span/Hispanic,3,Emergency,Home or Self Care,2019,MBD017,ALCOHOL-RELATED DISORDERS,,,775,ALCOHOL ABUSE & DEPENDENCE,20,ALCOHOL/DRUG USE AND ALCOHOL/DRUG INDUCED ORGANIC MENTAL DISORDERS,2,Moderate,Minor,Medical,Medicaid,,,,,true,45836.07,13096.78
New York City,Manhattan,7002053,001463,NYU Langone Hospitals,50 to 69,OOS,M,White,Not Span/Hispanic,14,Emergency,Inpatient Rehabilitation Facility,2019,MBD017,ALCOHOL-RELATED DISORDERS,OTR004,ISOLATION PROCEDURES,775,ALCOHOL ABUSE & DEPENDENCE,20,ALCOHOL/DRUG USE AND ALCOHOL/DRUG INDUCED ORGANIC MENTAL DISORDERS,3,Major,Major,Medical,Private Health Insurance,,,,,true,152367.52,49640.15
New York City,Manhattan,7002053,001463,NYU Langone Hospitals,50 to 69,114,M,Other Race,Not Span/Hispanic,4,Emergency,Home or Self Care,2019,MBD017,ALCOHOL-RELATED DISORDERS,,,775,ALCOHOL ABUSE & DEPENDENCE,20,ALCOHOL/DRUG USE AND ALCOHOL/DRUG INDUCED ORGANIC MENTAL DISORDERS,1,Minor,Minor,Medical,Private Health Insurance,,,,,true,38806.87,14464.72
New York City,Manhattan,7002053,001463,NYU Langone Hospitals,50 to 69,100,M,White,Not Span/Hispanic,13,Emergency,Home or Self Care,2019,MBD017,ALCOHOL-RELATED DISORDERS,,,775,ALCOHOL ABUSE & DEPENDENCE,20,ALCOHOL/DRUG USE AND ALCOHOL/DRUG INDUCED ORGANIC MENTAL DISORDERS,3,Major,Major,Medical,Private Health Insurance,,,,,true,202689.06,73693.82
New York City,Manhattan,7002053,001463,NYU Langone Hospitals,70 or Older,100,F,White,Not Span/Hispanic,1,Emergency,Home w/ Home Health Services,2019,MBD017,ALCOHOL-RELATED DISORDERS,,,775,ALCOHOL ABUSE & DEPENDENCE,20,ALCOHOL/DRUG USE AND ALCOHOL/DRUG INDUCED ORGANIC MENTAL DISORDERS,3,Major,Moderate,Medical,Medicare,Medicare,,,,true,41244.86,13014.35
New York City,Manhattan,7002053,001463,NYU Langone Hospitals,50 to 69,125,M,Black/African American,Not Span/Hispanic,2,Emergency,Psychiatric Hospital or Unit of Hosp,2019,MBD017,ALCOHOL-RELATED DISORDERS,EYP002,EYELID PROCEDURES,775,ALCOHOL ABUSE & DEPENDENCE,20,ALCOHOL/DRUG USE AND ALCOHOL/DRUG INDUCED ORGANIC MENTAL DISORDERS,2,Moderate,Minor,Medical,Medicare,Private Health Insurance,,,,true,44457.64,10605.12
New York City,Manhattan,7002053,001463,NYU Langone Hospitals,18 to 29,OOS,M,White,Not Span/Hispanic,7,Emergency,Home or Self Care,2019,MBD017,ALCOHOL-RELATED DISORDERS,MAM011,ELECTROENCEPHALOGRAM (EEG),775,ALCOHOL ABUSE & DEPENDENCE,20,ALCOHOL/DRUG USE AND ALCOHOL/DRUG INDUCED ORGANIC MENTAL DISORDERS,3,Major,Major,Medical,Private Health Insurance,,,,,true,125396.82,27032.22
New York City,Manhattan,7002053,001463,NYU Langone Hospitals,18 to 29,100,M,White,Not Span/Hispanic,1,Emergency,Home or Self Care,2019,MBD017,ALCOHOL-RELATED DISORDERS,SUD001,SUBSTANCE USE DETOXIFICATION,775,ALCOHOL ABUSE & DEPENDENCE,20,ALCOHOL/DRUG USE AND ALCOHOL/DRUG INDUCED ORGANIC MENTAL DISORDERS,2,Moderate,Minor,Medical,Private Health Insurance,,,,,true,13992.17,4358.07
New York City,Manhattan,7002053,001463,NYU Langone Hospitals,30 to 49,100,M,Other Race,Not Span/Hispanic,7,Emergency,Inpatient Rehabilitation Facility,2019,MBD017,ALCOHOL-RELATED DISORDERS,,,775,ALCOHOL ABUSE & DEPENDENCE,20,ALCOHOL/DRUG USE AND ALCOHOL/DRUG INDUCED ORGANIC MENTAL DISORDERS,3,Major,Major,Medical,Medicaid,,,,,true,163469.41,47714.96
New York City,Manhattan,7002053,001463,NYU Langone Hospitals,50 to 69,114,M,Other Race,Unknown,3,Emergency,Home or Self Care,2019,MBD017,ALCOHOL-RELATED DISORDERS,,,775,ALCOHOL ABUSE & DEPENDENCE,20,ALCOHOL/DRUG USE AND ALCOHOL/DRUG INDUCED ORGANIC MENTAL DISORDERS,2,Moderate,Minor,Medical,Medicaid,,,,,true,40098.73,14663
New York City,Manhattan,7002053,001463,NYU Langone Hospitals,30 to 49,104,M,Other Race,Spanish/Hispanic,4,Emergency,Home or Self Care,2019,MBD017,ALCOHOL-RELATED DISORDERS,,,775,ALCOHOL ABUSE & DEPENDENCE,20,ALCOHOL/DRUG USE AND ALCOHOL/DRUG INDUCED ORGANIC MENTAL DISORDERS,2,Moderate,Minor,Medical,Medicaid,,,,,true,33838.33,12247.05
New York City,Manhattan,7002053,001463,NYU Langone Hospitals,18 to 29,100,F,White,Not Span/Hispanic,4,Emergency,Home or Self Care,2019,MBD017,ALCOHOL-RELATED DISORDERS,,,775,ALCOHOL ABUSE & DEPENDENCE,20,ALCOHOL/DRUG USE AND ALCOHOL/DRUG INDUCED ORGANIC MENTAL DISORDERS,3,Major,Minor,Medical,Private Health Insurance,,,,,true,29487.23,11278.94
New York City,Manhattan,7002053,001463,NYU Langone Hospitals,30 to 49,112,F,White,Unknown,6,Emergency,Psychiatric Hospital or Unit of Hosp,2019,MBD017,ALCOHOL-RELATED DISORDERS,,,775,ALCOHOL ABUSE & DEPENDENCE,20,ALCOHOL/DRUG USE AND ALCOHOL/DRUG INDUCED ORGANIC MENTAL DISORDERS,3,Major,Minor,Medical,Private Health Insurance,,,,,true,72453.14,21516.52
New York City,Manhattan,7002053,001463,NYU Langone Hospitals,30 to 49,112,M,White,Unknown,2,Emergency,Home or Self Care,2019,MBD017,ALCOHOL-RELATED DISORDERS,,,775,ALCOHOL ABUSE & DEPENDENCE,20,ALCOHOL/DRUG USE AND ALCOHOL/DRUG INDUCED ORGANIC MENTAL DISORDERS,1,Minor,Minor,Medical,Medicaid,,,,,true,25997.64,9014.56
New York City,Manhattan,7002053,001463,NYU Langone Hospitals,30 to 49,111,M,Multi-racial,Not Span/Hispanic,1,Emergency,Home or Self Care,2019,MBD017,ALCOHOL-RELATED DISORDERS,,,775,ALCOHOL ABUSE & DEPENDENCE,20,ALCOHOL/DRUG USE AND ALCOHOL/DRUG INDUCED ORGANIC MENTAL DISORDERS,2,Moderate,Moderate,Medical,Private Health Insurance,,,,,true,17234.74,4838.04
New York City,Manhattan,7002053,001463,NYU Langone Hospitals,30 to 49,OOS,M,Other Race,Unknown,4,Emergency,Home or Self Care,2019,MBD017,ALCOHOL-RELATED DISORDERS,,,775,ALCOHOL ABUSE & DEPENDENCE,20,ALCOHOL/DRUG USE AND ALCOHOL/DRUG INDUCED ORGANIC MENTAL DISORDERS,2,Moderate,Minor,Medical,Medicaid,,,,,true,40920,14820.55
New York City,Manhattan,7002053,001463,NYU Langone Hospitals,50 to 69,100,M,White,Not Span/Hispanic,4,Emergency,Home w/ Home Health Services,2019,MBD017,ALCOHOL-RELATED DISORDERS,,,775,ALCOHOL ABUSE & DEPENDENCE,20,ALCOHOL/DRUG USE AND ALCOHOL/DRUG INDUCED ORGANIC MENTAL DISORDERS,2,Moderate,Moderate,Medical,Medicaid,,,,,true,92112.65,19404.55
New York City,Manhattan,7002053,001463,NYU Langone Hospitals,50 to 69,112,F,Other Race,Spanish/Hispanic,3,Emergency,Home or Self Care,2019,MBD017,ALCOHOL-RELATED DISORDERS,,,775,ALCOHOL ABUSE & DEPENDENCE,20,ALCOHOL/DRUG USE AND ALCOHOL/DRUG INDUCED ORGANIC MENTAL DISORDERS,2,Moderate,Moderate,Medical,Medicaid,,,,,true,29563.66,10823.96
New York City,Manhattan,7002053,001463,NYU Langone Hospitals,30 to 49,112,M,Other Race,Spanish/Hispanic,7,Emergency,Home or Self Care,2019,MBD017,ALCOHOL-RELATED DISORDERS,,,775,ALCOHOL ABUSE & DEPENDENCE,20,ALCOHOL/DRUG USE AND ALCOHOL/DRUG INDUCED ORGANIC MENTAL DISORDERS,3,Major,Moderate,Medical,Medicaid,,,,,true,113937.2,38532.31
New York City,Manhattan,7002053,001463,NYU Langone Hospitals,30 to 49,107,M,White,Not Span/Hispanic,4,Emergency,Another Type Not Listed,2019,MBD017,ALCOHOL-RELATED DISORDERS,,,775,ALCOHOL ABUSE & DEPENDENCE,20,ALCOHOL/DRUG USE AND ALCOHOL/DRUG INDUCED ORGANIC MENTAL DISORDERS,2,Moderate,Moderate,Medical,Self-Pay,,,,,true,31130.11,11014.83
New York City,Manhattan,7002053,001463,NYU Langone Hospitals,50 to 69,104,M,Other Race,Not Span/Hispanic,2,Emergency,Home or Self Care,2019,MBD017,ALCOHOL-RELATED DISORDERS,,,775,ALCOHOL ABUSE & DEPENDENCE,20,ALCOHOL/DRUG USE AND ALCOHOL/DRUG INDUCED ORGANIC MENTAL DISORDERS,2,Moderate,Moderate,Medical,Medicaid,,,,,true,35053.48,9553.69
New York City,Manhattan,7002053,001463,NYU Langone Hospitals,30 to 49,OOS,F,White,Not Span/Hispanic,3,Emergency,Home or Self Care,2019,MBD017,ALCOHOL-RELATED DISORDERS,,,775,ALCOHOL ABUSE & DEPENDENCE,20,ALCOHOL/DRUG USE AND ALCOHOL/DRUG INDUCED ORGANIC MENTAL DISORDERS,2,Moderate,Moderate,Medical,Self-Pay,,,,,true,36756.12,12520.07
New York City,Manhattan,7002053,001463,NYU Langone Hospitals,30 to 49,111,M,White,Not Span/Hispanic,8,Emergency,Home or Self Care,2019,MBD017,ALCOHOL-RELATED DISORDERS,,,775,ALCOHOL ABUSE & DEPENDENCE,20,ALCOHOL/DRUG USE AND ALCOHOL/DRUG INDUCED ORGANIC MENTAL DISORDERS,2,Moderate,Minor,Medical,Private Health Insurance,,,,,true,148135.72,45588.74
New York City,Manhattan,7002053,001463,NYU Langone Hospitals,50 to 69,100,F,White,Not Span/Hispanic,2,Emergency,Home or Self Care,2019,MBD017,ALCOHOL-RELATED DISORDERS,,,775,ALCOHOL ABUSE & DEPENDENCE,20,ALCOHOL/DRUG USE AND ALCOHOL/DRUG INDUCED ORGANIC MENTAL DISORDERS,3,Major,Moderate,Medical,Medicare,Medicaid,,,,true,24907.74,8120.69
New York City,Manhattan,7002053,001463,NYU Langone Hospitals,30 to 49,100,F,Black/African American,Not Span/Hispanic,2,Emergency,Home or Self Care,2019,MBD017,ALCOHOL-RELATED DISORDERS,ADM021,"ADMINISTRATION OF THERAPEUTIC SUBSTANCES, NEC",775,ALCOHOL ABUSE & DEPENDENCE,20,ALCOHOL/DRUG USE AND ALCOHOL/DRUG INDUCED ORGANIC MENTAL DISORDERS,2,Moderate,Moderate,Medical,Blue Cross/Blue Shield,,,,,true,24101.7,7909.98
New York City,Manhattan,7002053,001463,NYU Langone Hospitals,30 to 49,OOS,M,White,Not Span/Hispanic,2,Emergency,Home or Self Care,2019,MBD017,ALCOHOL-RELATED DISORDERS,,,775,ALCOHOL ABUSE & DEPENDENCE,20,ALCOHOL/DRUG USE AND ALCOHOL/DRUG INDUCED ORGANIC MENTAL DISORDERS,3,Major,Moderate,Medical,Self-Pay,,,,,true,26613.98,8283.63
New York City,Manhattan,7002053,001463,NYU Langone Hospitals,70 or Older,100,F,Other Race,Not Span/Hispanic,15,Emergency,Inpatient Rehabilitation Facility,2019,MBD017,ALCOHOL-RELATED DISORDERS,MAM011,ELECTROENCEPHALOGRAM (EEG),775,ALCOHOL ABUSE & DEPENDENCE,20,ALCOHOL/DRUG USE AND ALCOHOL/DRUG INDUCED ORGANIC MENTAL DISORDERS,3,Major,Major,Medical,Medicare,Medicare,,,,true,465748.97,93599.52
New York City,Manhattan,7002053,001463,NYU Langone Hospitals,30 to 49,100,M,Other Race,Not Span/Hispanic,2,Emergency,Home or Self Care,2019,MBD017,ALCOHOL-RELATED DISORDERS,,,775,ALCOHOL ABUSE & DEPENDENCE,20,ALCOHOL/DRUG USE AND ALCOHOL/DRUG INDUCED ORGANIC MENTAL DISORDERS,2,Moderate,Moderate,Medical,Medicaid,,,,,true,26346.08,8309.86
New York City,Manhattan,7002053,001463,NYU Langone Hospitals,30 to 49,112,M,White,Not Span/Hispanic,6,Emergency,Home or Self Care,2019,MBD017,ALCOHOL-RELATED DISORDERS,HEP001,LIVER BIOPSY,775,ALCOHOL ABUSE & DEPENDENCE,20,ALCOHOL/DRUG USE AND ALCOHOL/DRUG INDUCED ORGANIC MENTAL DISORDERS,3,Major,Moderate,Medical,Private Health Insurance,,,,,true,106445.5,27360.77
New York City,Manhattan,7002053,001463,NYU Langone Hospitals,50 to 69,114,M,Other Race,Unknown,5,Emergency,Short-term Hospital,2019,MBD017,ALCOHOL-RELATED DISORDERS,,,775,ALCOHOL ABUSE & DEPENDENCE,20,ALCOHOL/DRUG USE AND ALCOHOL/DRUG INDUCED ORGANIC MENTAL DISORDERS,3,Major,Major,Medical,Medicaid,,,,,true,102879.07,24932.21
New York City,Manhattan,7002053,001463,NYU Langone Hospitals,18 to 29,112,F,White,Not Span/Hispanic,2,Emergency,Home or Self Care,2019,MBD017,ALCOHOL-RELATED DISORDERS,MAM011,ELECTROENCEPHALOGRAM (EEG),775,ALCOHOL ABUSE & DEPENDENCE,20,ALCOHOL/DRUG USE AND ALCOHOL/DRUG INDUCED ORGANIC MENTAL DISORDERS,2,Moderate,Moderate,Medical,Blue Cross/Blue Shield,,,,,true,86086.5,10561.16
New York City,Manhattan,7002053,001463,NYU Langone Hospitals,50 to 69,111,F,White,Not Span/Hispanic,7,Emergency,Home or Self Care,2019,MBD017,ALCOHOL-RELATED DISORDERS,,,775,ALCOHOL ABUSE & DEPENDENCE,20,ALCOHOL/DRUG USE AND ALCOHOL/DRUG INDUCED ORGANIC MENTAL DISORDERS,1,Minor,Minor,Medical,Medicaid,,,,,true,46435.82,18724.43
New York City,Manhattan,7002053,001463,NYU Langone Hospitals,50 to 69,OOS,F,White,Not Span/Hispanic,4,Emergency,Home or Self Care,2019,MBD017,ALCOHOL-RELATED DISORDERS,IMG008,ULTRASONOGRAPHY,775,ALCOHOL ABUSE & DEPENDENCE,20,ALCOHOL/DRUG USE AND ALCOHOL/DRUG INDUCED ORGANIC MENTAL DISORDERS,2,Moderate,Minor,Medical,Private Health Insurance,,,,,true,85304.02,21180.2
New York City,Manhattan,7002053,001463,NYU Langone Hospitals,30 to 49,112,F,Other Race,Not Span/Hispanic,2,Emergency,Home or Self Care,2019,MBD017,ALCOHOL-RELATED DISORDERS,,,775,ALCOHOL ABUSE & DEPENDENCE,20,ALCOHOL/DRUG USE AND ALCOHOL/DRUG INDUCED ORGANIC MENTAL DISORDERS,2,Moderate,Minor,Medical,Blue Cross/Blue Shield,,,,,true,25390.88,8028.26
New York City,Manhattan,7002053,001463,NYU Langone Hospitals,50 to 69,112,M,Other Race,Unknown,1,Emergency,Home or Self Care,2019,MBD017,ALCOHOL-RELATED DISORDERS,,,775,ALCOHOL ABUSE & DEPENDENCE,20,ALCOHOL/DRUG USE AND ALCOHOL/DRUG INDUCED ORGANIC MENTAL DISORDERS,2,Moderate,Moderate,Medical,Medicare,Medicaid,,,,true,16659.81,4738.35
New York City,Manhattan,7002053,001463,NYU Langone Hospitals,50 to 69,100,M,Black/African American,Unknown,1,Emergency,Home or Self Care,2019,MBD017,ALCOHOL-RELATED DISORDERS,ADM017,ADMINISTRATION OF NUTRITIONAL AND ELECTROLYTIC SUBSTANCES,775,ALCOHOL ABUSE & DEPENDENCE,20,ALCOHOL/DRUG USE AND ALCOHOL/DRUG INDUCED ORGANIC MENTAL DISORDERS,2,Moderate,Moderate,Medical,Medicaid,,,,,true,33673.81,10451.13
New York City,Manhattan,7002053,001463,NYU Langone Hospitals,50 to 69,OOS,M,White,Not Span/Hispanic,8,Emergency,Inpatient Rehabilitation Facility,2019,MBD017,ALCOHOL-RELATED DISORDERS,,,775,ALCOHOL ABUSE & DEPENDENCE,20,ALCOHOL/DRUG USE AND ALCOHOL/DRUG INDUCED ORGANIC MENTAL DISORDERS,3,Major,Moderate,Medical,Private Health Insurance,,,,,true,101677.46,35463.88
New York City,Manhattan,7002053,001463,NYU Langone Hospitals,50 to 69,103,M,White,Not Span/Hispanic,1,Emergency,Home or Self Care,2019,MBD017,ALCOHOL-RELATED DISORDERS,,,775,ALCOHOL ABUSE & DEPENDENCE,20,ALCOHOL/DRUG USE AND ALCOHOL/DRUG INDUCED ORGANIC MENTAL DISORDERS,2,Moderate,Moderate,Medical,Blue Cross/Blue Shield,,,,,true,18258.59,4916.22
New York City,Manhattan,7002053,001463,NYU Langone Hospitals,30 to 49,100,M,White,Not Span/Hispanic,1,Emergency,Home or Self Care,2019,MBD017,ALCOHOL-RELATED DISORDERS,,,775,ALCOHOL ABUSE & DEPENDENCE,20,ALCOHOL/DRUG USE AND ALCOHOL/DRUG INDUCED ORGANIC MENTAL DISORDERS,2,Moderate,Minor,Medical,Medicare,Medicaid,,,,true,32186.04,11847.22
New York City,Manhattan,7002053,001463,NYU Langone Hospitals,50 to 69,112,F,White,Not Span/Hispanic,2,Emergency,Short-term Hospital,2019,MBD017,ALCOHOL-RELATED DISORDERS,,,775,ALCOHOL ABUSE & DEPENDENCE,20,ALCOHOL/DRUG USE AND ALCOHOL/DRUG INDUCED ORGANIC MENTAL DISORDERS,2,Moderate,Minor,Medical,Private Health Insurance,,,,,true,17353.87,7102.34
New York City,Manhattan,7002053,001463,NYU Langone Hospitals,50 to 69,100,M,White,Not Span/Hispanic,2,Emergency,Home or Self Care,2019,MBD020,SEDATIVE-RELATED DISORDERS,SKB006,SKIN LACERATION REPAIR (EXCLUDING PERINEUM),775,ALCOHOL ABUSE & DEPENDENCE,20,ALCOHOL/DRUG USE AND ALCOHOL/DRUG INDUCED ORGANIC MENTAL DISORDERS,2,Moderate,Minor,Medical,Medicaid,,,,,true,31444.97,8898.29
New York City,Manhattan,7002053,001463,NYU Langone Hospitals,30 to 49,104,M,Other Race,Spanish/Hispanic,2,Emergency,Home or Self Care,2019,MBD017,ALCOHOL-RELATED DISORDERS,,,775,ALCOHOL ABUSE & DEPENDENCE,20,ALCOHOL/DRUG USE AND ALCOHOL/DRUG INDUCED ORGANIC MENTAL DISORDERS,2,Moderate,Moderate,Medical,Medicaid,,,,,true,23263.1,7865.75
New York City,Manhattan,7002053,001463,NYU Langone Hospitals,30 to 49,100,M,White,Not Span/Hispanic,7,Emergency,Home or Self Care,2019,MBD017,ALCOHOL-RELATED DISORDERS,,,775,ALCOHOL ABUSE & DEPENDENCE,20,ALCOHOL/DRUG USE AND ALCOHOL/DRUG INDUCED ORGANIC MENTAL DISORDERS,2,Moderate,Minor,Medical,Blue Cross/Blue Shield,,,,,true,46142.45,18695.25
New York City,Manhattan,7002053,001463,NYU Langone Hospitals,30 to 49,111,M,White,Not Span/Hispanic,2,Emergency,Home or Self Care,2019,MBD017,ALCOHOL-RELATED DISORDERS,,,775,ALCOHOL ABUSE & DEPENDENCE,20,ALCOHOL/DRUG USE AND ALCOHOL/DRUG INDUCED ORGANIC MENTAL DISORDERS,2,Moderate,Moderate,Medical,Blue Cross/Blue Shield,,,,,true,30336.85,8139.42
New York City,Manhattan,7002053,001463,NYU Langone Hospitals,18 to 29,112,M,White,Not Span/Hispanic,2,Emergency,Home or Self Care,2019,MBD017,ALCOHOL-RELATED DISORDERS,SKB006,SKIN LACERATION REPAIR (EXCLUDING PERINEUM),775,ALCOHOL ABUSE & DEPENDENCE,20,ALCOHOL/DRUG USE AND ALCOHOL/DRUG INDUCED ORGANIC MENTAL DISORDERS,2,Moderate,Minor,Medical,Medicare,,,,,true,27715.85,7986.1
New York City,Manhattan,7002053,001463,NYU Langone Hospitals,30 to 49,100,M,White,Not Span/Hispanic,6,Emergency,Home or Self Care,2019,MBD017,ALCOHOL-RELATED DISORDERS,MHT002,PSYCHOTHERAPY FOR MENTAL HEALTH (EXCLUDING SUBSTANCE USE),775,ALCOHOL ABUSE & DEPENDENCE,20,ALCOHOL/DRUG USE AND ALCOHOL/DRUG INDUCED ORGANIC MENTAL DISORDERS,2,Moderate,Minor,Medical,Private Health Insurance,,,,,true,39651.41,16239.34
New York City,Manhattan,7002053,001463,NYU Langone Hospitals,30 to 49,104,M,Other Race,Spanish/Hispanic,2,Emergency,Home or Self Care,2019,MBD017,ALCOHOL-RELATED DISORDERS,,,775,ALCOHOL ABUSE & DEPENDENCE,20,ALCOHOL/DRUG USE AND ALCOHOL/DRUG INDUCED ORGANIC MENTAL DISORDERS,3,Major,Moderate,Medical,Medicaid,,,,,true,22987.13,7935.23
New York City,Manhattan,7002053,001463,NYU Langone Hospitals,30 to 49,101,M,White,Not Span/Hispanic,4,Emergency,Home or Self Care,2019,MBD021,STIMULANT-RELATED DISORDERS,,,775,ALCOHOL ABUSE & DEPENDENCE,20,ALCOHOL/DRUG USE AND ALCOHOL/DRUG INDUCED ORGANIC MENTAL DISORDERS,3,Major,Moderate,Medical,Private Health Insurance,,,,,true,67707.77,23493.54
New York City,Manhattan,7002053,001463,NYU Langone Hospitals,30 to 49,112,F,White,Not Span/Hispanic,4,Emergency,Home or Self Care,2019,MBD017,ALCOHOL-RELATED DISORDERS,ADM017,ADMINISTRATION OF NUTRITIONAL AND ELECTROLYTIC SUBSTANCES,775,ALCOHOL ABUSE & DEPENDENCE,20,ALCOHOL/DRUG USE AND ALCOHOL/DRUG INDUCED ORGANIC MENTAL DISORDERS,3,Major,Minor,Medical,Medicaid,,,,,true,54596.3,14659.63
New York City,Manhattan,7002053,001463,NYU Langone Hospitals,18 to 29,113,M,White,Not Span/Hispanic,2,Emergency,Home or Self Care,2019,MBD025,OTHER SPECIFIED SUBSTANCE-RELATED DISORDERS,MHT002,PSYCHOTHERAPY FOR MENTAL HEALTH (EXCLUDING SUBSTANCE USE),775,ALCOHOL ABUSE & DEPENDENCE,20,ALCOHOL/DRUG USE AND ALCOHOL/DRUG INDUCED ORGANIC MENTAL DISORDERS,2,Moderate,Minor,Medical,Private Health Insurance,,,,,true,19674.3,6424.23
New York City,Manhattan,7002053,001463,NYU Langone Hospitals,50 to 69,OOS,M,Black/African American,Not Span/Hispanic,1,Emergency,Home or Self Care,2019,MBD017,ALCOHOL-RELATED DISORDERS,,,775,ALCOHOL ABUSE & DEPENDENCE,20,ALCOHOL/DRUG USE AND ALCOHOL/DRUG INDUCED ORGANIC MENTAL DISORDERS,1,Minor,Minor,Medical,Medicare,Private Health Insurance,,,,true,29418.76,10283.21
New York City,Manhattan,7002053,001463,NYU Langone Hospitals,50 to 69,116,M,White,Not Span/Hispanic,62,Emergency,Skilled Nursing Home,2019,MBD017,ALCOHOL-RELATED DISORDERS,GIS017,GASTROSTOMY,775,ALCOHOL ABUSE & DEPENDENCE,20,ALCOHOL/DRUG USE AND ALCOHOL/DRUG INDUCED ORGANIC MENTAL DISORDERS,4,Extreme,Major,Medical,Medicaid,,,,,true,883425.77,327259.73
New York City,Manhattan,7002053,001463,NYU Langone Hospitals,50 to 69,OOS,F,White,Not Span/Hispanic,2,Emergency,Home or Self Care,2019,MBD017,ALCOHOL-RELATED DISORDERS,ADM010,VACCINATIONS,775,ALCOHOL ABUSE & DEPENDENCE,20,ALCOHOL/DRUG USE AND ALCOHOL/DRUG INDUCED ORGANIC MENTAL DISORDERS,2,Moderate,Moderate,Medical,Private Health Insurance,,,,,true,28682.11,8985.64
New York City,Manhattan,7002053,001463,NYU Langone Hospitals,50 to 69,100,M,White,Unknown,27,Emergency,Skilled Nursing Home,2019,MBD017,ALCOHOL-RELATED DISORDERS,RES007,AIRWAY INTUBATION,775,ALCOHOL ABUSE & DEPENDENCE,20,ALCOHOL/DRUG USE AND ALCOHOL/DRUG INDUCED ORGANIC MENTAL DISORDERS,4,Extreme,Extreme,Medical,Medicaid,,,,,true,488423.27,160935.92