Hospital Service Area,Hospital County,Operating Certificate Number,Permanent Facility Id,Facility Name,Age Group,Zip Code - 3 digits,Gender,Race,Ethnicity,Length of Stay,Type of Admission,Patient Disposition,Discharge Year,CCS Diagnosis Code,CCS Diagnosis Description,CCS Procedure Code,CCS Procedure Description,APR DRG Code,APR DRG Description,APR MDC Code,APR MDC Description,APR Severity of Illness Code,APR Severity of Illness Description,APR Risk of Mortality,APR Medical Surgical Description,Payment Typology 1,Payment Typology 2,Payment Typology 3,Birth Weight,Abortion Edit Indicator,Emergency Department Indicator,Total Charges,Total Costs
New York City,Manhattan,7002053,001463,NYU Langone Hospitals,18 to 29,112,M,Other Race,Spanish/Hispanic,7,Elective,Home or Self Care,2019,MBD025,OTHER SPECIFIED SUBSTANCE-RELATED DISORDERS,,,776,OTHER DRUG ABUSE & DEPENDENCE,20,ALCOHOL/DRUG USE AND ALCOHOL/DRUG INDUCED ORGANIC MENTAL DISORDERS,2,Moderate,Moderate,Medical,Medicaid,,,,,false,36872.13,17341.13
New York City,Manhattan,7002053,001463,NYU Langone Hospitals,18 to 29,112,F,White,Not Span/Hispanic,5,Emergency,Home or Self Care,2019,MBD025,OTHER SPECIFIED SUBSTANCE-RELATED DISORDERS,,,776,OTHER DRUG ABUSE & DEPENDENCE,20,ALCOHOL/DRUG USE AND ALCOHOL/DRUG INDUCED ORGANIC MENTAL DISORDERS,2,Moderate,Minor,Medical,Blue Cross/Blue Shield,,,,,true,35572.2,13848.72
New York City,Manhattan,7002053,001463,NYU Langone Hospitals,50 to 69,100,F,White,Not Span/Hispanic,1,Emergency,Home or Self Care,2019,MBD020,SEDATIVE-RELATED DISORDERS,CNS002,LUMBAR PUNCTURE,776,OTHER DRUG ABUSE & DEPENDENCE,20,ALCOHOL/DRUG USE AND ALCOHOL/DRUG INDUCED ORGANIC MENTAL DISORDERS,1,Minor,Minor,Medical,Medicare,Private Health Insurance,,,,true,41211.35,8087.12
New York City,Manhattan,7002053,001463,NYU Langone Hospitals,50 to 69,100,F,White,Not Span/Hispanic,12,Emergency,Inpatient Rehabilitation Facility,2019,MBD025,OTHER SPECIFIED SUBSTANCE-RELATED DISORDERS,GIS017,GASTROSTOMY,776,OTHER DRUG ABUSE & DEPENDENCE,20,ALCOHOL/DRUG USE AND ALCOHOL/DRUG INDUCED ORGANIC MENTAL DISORDERS,3,Major,Major,Medical,Medicaid,,,,,true,216738.97,57073.71
New York City,Manhattan,7002053,001463,NYU Langone Hospitals,18 to 29,100,M,Other Race,Not Span/Hispanic,4,Emergency,Home or Self Care,2019,MBD020,SEDATIVE-RELATED DISORDERS,MHT002,PSYCHOTHERAPY FOR MENTAL HEALTH (EXCLUDING SUBSTANCE USE),776,OTHER DRUG ABUSE & DEPENDENCE,20,ALCOHOL/DRUG USE AND ALCOHOL/DRUG INDUCED ORGANIC MENTAL DISORDERS,2,Moderate,Moderate,Medical,Private Health Insurance,,,,,true,31235.78,11680.37
New York City,Manhattan,7002053,001463,NYU Langone Hospitals,18 to 29,112,F,Other Race,Spanish/Hispanic,1,Emergency,Home or Self Care,2019,MBD019,CANNABIS-RELATED DISORDERS,,,776,OTHER DRUG ABUSE & DEPENDENCE,20,ALCOHOL/DRUG USE AND ALCOHOL/DRUG INDUCED ORGANIC MENTAL DISORDERS,1,Minor,Minor,Medical,Private Health Insurance,,,,,true,42854.98,16005.46
New York City,Manhattan,7002053,001463,NYU Langone Hospitals,18 to 29,112,F,White,Unknown,6,Emergency,Home or Self Care,2019,MBD025,OTHER SPECIFIED SUBSTANCE-RELATED DISORDERS,MHT002,PSYCHOTHERAPY FOR MENTAL HEALTH (EXCLUDING SUBSTANCE USE),776,OTHER DRUG ABUSE & DEPENDENCE,20,ALCOHOL/DRUG USE AND ALCOHOL/DRUG INDUCED ORGANIC MENTAL DISORDERS,2,Moderate,Minor,Medical,Medicaid,,,,,true,40227.38,16322.93
New York City,Manhattan,7002053,001463,NYU Langone Hospitals,50 to 69,100,F,White,Unknown,8,Emergency,Home or Self Care,2019,MBD020,SEDATIVE-RELATED DISORDERS,,,776,OTHER DRUG ABUSE & DEPENDENCE,20,ALCOHOL/DRUG USE AND ALCOHOL/DRUG INDUCED ORGANIC MENTAL DISORDERS,2,Moderate,Minor,Medical,Medicare,Blue Cross/Blue Shield,,,,true,54167.86,21698
New York City,Manhattan,7002053,001463,NYU Langone Hospitals,30 to 49,100,M,White,Not Span/Hispanic,7,Emergency,Home or Self Care,2019,MBD021,STIMULANT-RELATED DISORDERS,,,776,OTHER DRUG ABUSE & DEPENDENCE,20,ALCOHOL/DRUG USE AND ALCOHOL/DRUG INDUCED ORGANIC MENTAL DISORDERS,2,Moderate,Minor,Medical,Private Health Insurance,,,,,true,45886.6,19041.07
New York City,Manhattan,7002053,001463,NYU Langone Hospitals,30 to 49,117,M,White,Unknown,6,Emergency,Home or Self Care,2019,MBD021,STIMULANT-RELATED DISORDERS,,,776,OTHER DRUG ABUSE & DEPENDENCE,20,ALCOHOL/DRUG USE AND ALCOHOL/DRUG INDUCED ORGANIC MENTAL DISORDERS,2,Moderate,Minor,Medical,Medicaid,,,,,true,49413.43,17569.64
New York City,Manhattan,7002053,001463,NYU Langone Hospitals,18 to 29,112,M,White,Not Span/Hispanic,3,Emergency,Home or Self Care,2019,MBD025,OTHER SPECIFIED SUBSTANCE-RELATED DISORDERS,,,776,OTHER DRUG ABUSE & DEPENDENCE,20,ALCOHOL/DRUG USE AND ALCOHOL/DRUG INDUCED ORGANIC MENTAL DISORDERS,2,Moderate,Minor,Medical,Private Health Insurance,,,,,true,28019.58,9438.69
New York City,Manhattan,7002053,001463,NYU Langone Hospitals,18 to 29,112,M,Black/African American,Not Span/Hispanic,16,Emergency,Home or Self Care,2019,MBD025,OTHER SPECIFIED SUBSTANCE-RELATED DISORDERS,ESA006,CARDIOVERSION,776,OTHER DRUG ABUSE & DEPENDENCE,20,ALCOHOL/DRUG USE AND ALCOHOL/DRUG INDUCED ORGANIC MENTAL DISORDERS,4,Extreme,Extreme,Medical,Blue Cross/Blue Shield,,,,,true,358362.33,80738.86
New York City,Manhattan,7002053,001463,NYU Langone Hospitals,30 to 49,100,M,White,Not Span/Hispanic,6,Emergency,Home or Self Care,2019,MBD021,STIMULANT-RELATED DISORDERS,,,776,OTHER DRUG ABUSE & DEPENDENCE,20,ALCOHOL/DRUG USE AND ALCOHOL/DRUG INDUCED ORGANIC MENTAL DISORDERS,1,Minor,Minor,Medical,Medicaid,,,,,true,40555.58,16609.68
New York City,Manhattan,7002053,001463,NYU Langone Hospitals,18 to 29,112,M,White,Not Span/Hispanic,5,Emergency,Home or Self Care,2019,MBD022,HALLUCINOGEN-RELATED DISORDERS,,,776,OTHER DRUG ABUSE & DEPENDENCE,20,ALCOHOL/DRUG USE AND ALCOHOL/DRUG INDUCED ORGANIC MENTAL DISORDERS,1,Minor,Minor,Medical,Medicaid,,,,,true,33175,13799.49
New York City,Manhattan,7002053,001463,NYU Langone Hospitals,30 to 49,100,M,White,Not Span/Hispanic,4,Emergency,Home or Self Care,2019,MBD021,STIMULANT-RELATED DISORDERS,,,776,OTHER DRUG ABUSE & DEPENDENCE,20,ALCOHOL/DRUG USE AND ALCOHOL/DRUG INDUCED ORGANIC MENTAL DISORDERS,2,Moderate,Minor,Medical,Medicaid,,,,,true,31144.23,11441.02
