Hospital Service Area,Hospital County,Operating Certificate Number,Permanent Facility Id,Facility Name,Age Group,Zip Code - 3 digits,Gender,Race,Ethnicity,Length of Stay,Type of Admission,Patient Disposition,Discharge Year,CCS Diagnosis Code,CCS Diagnosis Description,CCS Procedure Code,CCS Procedure Description,APR DRG Code,APR DRG Description,APR MDC Code,APR MDC Description,APR Severity of Illness Code,APR Severity of Illness Description,APR Risk of Mortality,APR Medical Surgical Description,Payment Typology 1,Payment Typology 2,Payment Typology 3,Birth Weight,Abortion Edit Indicator,Emergency Department Indicator,Total Charges,Total Costs
New York City,Manhattan,7002053,001463,NYU Langone Hospitals,18 to 29,100,M,Black/African American,Not Span/Hispanic,7,Emergency,Home w/ Home Health Services,2017,237,Complication of device; implant or graft,172,SKIN GRAFT,791,O.R. procedure for other complications of treatment,21,"Poisonings, Toxic Effects, Other Injuries and Other Complications of Treatment",3,Major,Moderate,Surgical,Blue Cross/Blue Shield,,,,N,Y,144675.98,35514.28
New York City,Manhattan,7002053,001463,NYU Langone Hospitals,50 to 69,113,F,White,Not Span/Hispanic,3,Elective,Home w/ Home Health Services,2017,237,Complication of device; implant or graft,042,OT OR RX PRCS RESP SYS,791,O.R. procedure for other complications of treatment,21,"Poisonings, Toxic Effects, Other Injuries and Other Complications of Treatment",3,Major,Moderate,Surgical,Private Health Insurance,,,,N,N,61568.20,17343.65
New York City,Manhattan,7002053,001463,NYU Langone Hospitals,70 or Older,100,M,White,Not Span/Hispanic,3,Emergency,Home or Self Care,2017,238,Complications of surgical procedures or medical care,099,OT OR GI THER PRCS,791,O.R. procedure for other complications of treatment,21,"Poisonings, Toxic Effects, Other Injuries and Other Complications of Treatment",3,Major,Major,Surgical,Blue Cross/Blue Shield,,,,N,Y,99669.33,35466.16
New York City,Manhattan,7002053,001463,NYU Langone Hospitals,70 or Older,113,M,Other Race,Not Span/Hispanic,1,Emergency,Home or Self Care,2017,238,Complications of surgical procedures or medical care,092,OTHER BOWEL DX PRCS,791,O.R. procedure for other complications of treatment,21,"Poisonings, Toxic Effects, Other Injuries and Other Complications of Treatment",2,Moderate,Moderate,Surgical,Medicaid,,,,N,Y,27220.19,7916.26
New York City,Manhattan,7002053,001463,NYU Langone Hospitals,70 or Older,,F,Other Race,Not Span/Hispanic,3,Emergency,Home w/ Home Health Services,2017,238,Complications of surgical procedures or medical care,099,OT OR GI THER PRCS,791,O.R. procedure for other complications of treatment,21,"Poisonings, Toxic Effects, Other Injuries and Other Complications of Treatment",2,Moderate,Moderate,Surgical,Private Health Insurance,,,,N,Y,47124.73,16095.61
New York City,Manhattan,7002053,001463,NYU Langone Hospitals,70 or Older,112,M,White,Not Span/Hispanic,3,Emergency,Home w/ Home Health Services,2017,238,Complications of surgical procedures or medical care,096,OT OR LOW GI THER PRCS,791,O.R. procedure for other complications of treatment,21,"Poisonings, Toxic Effects, Other Injuries and Other Complications of Treatment",3,Major,Moderate,Surgical,Medicare,,,,N,Y,81984.05,23995.46
New York City,Manhattan,7002053,001463,NYU Langone Hospitals,70 or Older,OOS,M,White,Not Span/Hispanic,1,Elective,Home or Self Care,2017,238,Complications of surgical procedures or medical care,161,OT OR THER PRCS ON BONE,791,O.R. procedure for other complications of treatment,21,"Poisonings, Toxic Effects, Other Injuries and Other Complications of Treatment",2,Moderate,Moderate,Surgical,Medicare,,,,N,N,30846.97,10752.36
New York City,Manhattan,7002053,001463,NYU Langone Hospitals,30 to 49,124,F,White,Not Span/Hispanic,10,Urgent,Inpatient Rehabilitation Facility,2017,238,Complications of surgical procedures or medical care,001,INCISION & EXCISION CNS,791,O.R. procedure for other complications of treatment,21,"Poisonings, Toxic Effects, Other Injuries and Other Complications of Treatment",4,Extreme,Extreme,Surgical,Medicaid,,,,N,N,307346.88,95931.72
New York City,Manhattan,7002053,001463,NYU Langone Hospitals,30 to 49,100,M,White,Not Span/Hispanic,5,Elective,Home w/ Home Health Services,2017,238,Complications of surgical procedures or medical care,175,OT OR THER PRC SKN/BRST,791,O.R. procedure for other complications of treatment,21,"Poisonings, Toxic Effects, Other Injuries and Other Complications of Treatment",3,Major,Minor,Surgical,Self-Pay,,,,N,N,67674.26,18536.27
New York City,Manhattan,7002053,001463,NYU Langone Hospitals,50 to 69,101,F,White,Not Span/Hispanic,2,Emergency,Home or Self Care,2017,238,Complications of surgical procedures or medical care,096,OT OR LOW GI THER PRCS,791,O.R. procedure for other complications of treatment,21,"Poisonings, Toxic Effects, Other Injuries and Other Complications of Treatment",3,Major,Minor,Surgical,Private Health Insurance,,,,N,Y,49690.55,14650.02
New York City,Manhattan,7002053,001463,NYU Langone Hospitals,30 to 49,112,M,Black/African American,Not Span/Hispanic,5,Emergency,Home or Self Care,2017,237,Complication of device; implant or graft,005,INS CATHETER/SPNL STIM,791,O.R. procedure for other complications of treatment,21,"Poisonings, Toxic Effects, Other Injuries and Other Complications of Treatment",2,Moderate,Minor,Surgical,Medicaid,,,,N,Y,99848.32,35651.13
New York City,Manhattan,7002053,001463,NYU Langone Hospitals,50 to 69,117,M,White,Not Span/Hispanic,5,Emergency,Home or Self Care,2017,238,Complications of surgical procedures or medical care,009,OTHER OR THER NERV SYS,791,O.R. procedure for other complications of treatment,21,"Poisonings, Toxic Effects, Other Injuries and Other Complications of Treatment",3,Major,Moderate,Surgical,Blue Cross/Blue Shield,,,,N,Y,120133.26,33473.41
New York City,Manhattan,7002053,001463,NYU Langone Hospitals,50 to 69,113,M,White,Not Span/Hispanic,2,Emergency,Home or Self Care,2017,238,Complications of surgical procedures or medical care,096,OT OR LOW GI THER PRCS,791,O.R. procedure for other complications of treatment,21,"Poisonings, Toxic Effects, Other Injuries and Other Complications of Treatment",1,Minor,Minor,Surgical,Private Health Insurance,,,,N,Y,79199.07,19624.33
New York City,Manhattan,7002053,001463,NYU Langone Hospitals,70 or Older,OOS,M,White,Not Span/Hispanic,2,Elective,Home or Self Care,2017,238,Complications of surgical procedures or medical care,160,OT THER PRCS ON MUSCLES,791,O.R. procedure for other complications of treatment,21,"Poisonings, Toxic Effects, Other Injuries and Other Complications of Treatment",2,Moderate,Moderate,Surgical,Private Health Insurance,,,,N,N,84567.47,25309.26
New York City,Manhattan,7002053,001463,NYU Langone Hospitals,50 to 69,100,F,White,Not Span/Hispanic,5,Emergency,Home w/ Home Health Services,2017,238,Complications of surgical procedures or medical care,006,DECOMP PERIPHERAL NERVE,791,O.R. procedure for other complications of treatment,21,"Poisonings, Toxic Effects, Other Injuries and Other Complications of Treatment",1,Minor,Minor,Surgical,Blue Cross/Blue Shield,,,,N,Y,96793.02,25669.98
New York City,Manhattan,7002053,001463,NYU Langone Hospitals,30 to 49,112,F,White,Not Span/Hispanic,1,Emergency,Home w/ Home Health Services,2017,238,Complications of surgical procedures or medical care,175,OT OR THER PRC SKN/BRST,791,O.R. procedure for other complications of treatment,21,"Poisonings, Toxic Effects, Other Injuries and Other Complications of Treatment",1,Minor,Minor,Surgical,Blue Cross/Blue Shield,,,,N,Y,58073.08,13190.34
New York City,Manhattan,7002053,001463,NYU Langone Hospitals,30 to 49,112,F,Other Race,Spanish/Hispanic,2,Elective,Home or Self Care,2017,238,Complications of surgical procedures or medical care,175,OT OR THER PRC SKN/BRST,791,O.R. procedure for other complications of treatment,21,"Poisonings, Toxic Effects, Other Injuries and Other Complications of Treatment",1,Minor,Minor,Surgical,Medicaid,,,,N,N,66913.21,14137.44
New York City,Manhattan,7002053,001463,NYU Langone Hospitals,0 to 17,103,F,White,Not Span/Hispanic,1,Elective,Home or Self Care,2017,237,Complication of device; implant or graft,009,OTHER OR THER NERV SYS,791,O.R. procedure for other complications of treatment,21,"Poisonings, Toxic Effects, Other Injuries and Other Complications of Treatment",2,Moderate,Minor,Surgical,Private Health Insurance,,,,N,N,160369.01,32577.66
New York City,Manhattan,7002053,001463,NYU Langone Hospitals,30 to 49,,F,Other Race,Spanish/Hispanic,2,Elective,Home or Self Care,2017,237,Complication of device; implant or graft,161,OT OR THER PRCS ON BONE,791,O.R. procedure for other complications of treatment,21,"Poisonings, Toxic Effects, Other Injuries and Other Complications of Treatment",2,Moderate,Minor,Surgical,Private Health Insurance,,,,N,N,401309.84,81399.69
New York City,Manhattan,7002053,001463,NYU Langone Hospitals,50 to 69,OOS,F,White,Not Span/Hispanic,22,Emergency,Inpatient Rehabilitation Facility,2017,238,Complications of surgical procedures or medical care,162,OT OR THER PRC ON JOINT,791,O.R. procedure for other complications of treatment,21,"Poisonings, Toxic Effects, Other Injuries and Other Complications of Treatment",4,Extreme,Major,Surgical,Medicare,,,,N,Y,479654.74,167642.79
New York City,Manhattan,7002053,001463,NYU Langone Hospitals,50 to 69,104,M,Other Race,Not Span/Hispanic,7,Emergency,Home w/ Home Health Services,2017,238,Complications of surgical procedures or medical care,099,OT OR GI THER PRCS,791,O.R. procedure for other complications of treatment,21,"Poisonings, Toxic Effects, Other Injuries and Other Complications of Treatment",4,Extreme,Moderate,Surgical,Private Health Insurance,,,,N,Y,125139.04,38277.05
New York City,Manhattan,7002053,001463,NYU Langone Hospitals,0 to 17,113,M,White,Not Span/Hispanic,5,Emergency,Home or Self Care,2017,237,Complication of device; implant or graft,009,OTHER OR THER NERV SYS,791,O.R. procedure for other complications of treatment,21,"Poisonings, Toxic Effects, Other Injuries and Other Complications of Treatment",3,Major,Moderate,Surgical,Blue Cross/Blue Shield,,,,N,Y,78558.42,20892.54
New York City,Manhattan,7002053,001463,NYU Langone Hospitals,30 to 49,111,F,Black/African American,Not Span/Hispanic,19,Emergency,Home or Self Care,2017,238,Complications of surgical procedures or medical care,098,OT NON-OR GI THER PRCS,791,O.R. procedure for other complications of treatment,21,"Poisonings, Toxic Effects, Other Injuries and Other Complications of Treatment",2,Moderate,Minor,Surgical,Private Health Insurance,,,,N,Y,317344.92,100298.44
New York City,Manhattan,7002053,001463,NYU Langone Hospitals,30 to 49,109,F,White,Not Span/Hispanic,1,Emergency,Home or Self Care,2017,238,Complications of surgical procedures or medical care,161,OT OR THER PRCS ON BONE,791,O.R. procedure for other complications of treatment,21,"Poisonings, Toxic Effects, Other Injuries and Other Complications of Treatment",2,Moderate,Moderate,Surgical,Private Health Insurance,,,,N,Y,55559.37,12783.21
New York City,Manhattan,7002053,001463,NYU Langone Hospitals,50 to 69,107,F,Other Race,Not Span/Hispanic,3,Elective,Home or Self Care,2017,238,Complications of surgical procedures or medical care,112,OT OR THER PRCS URINARY,791,O.R. procedure for other complications of treatment,21,"Poisonings, Toxic Effects, Other Injuries and Other Complications of Treatment",2,Moderate,Minor,Surgical,Private Health Insurance,,,,N,N,66783.03,16228.11
New York City,Manhattan,7002053,001463,NYU Langone Hospitals,70 or Older,107,M,White,Not Span/Hispanic,6,Elective,Home or Self Care,2017,238,Complications of surgical procedures or medical care,175,OT OR THER PRC SKN/BRST,791,O.R. procedure for other complications of treatment,21,"Poisonings, Toxic Effects, Other Injuries and Other Complications of Treatment",2,Moderate,Minor,Surgical,Medicare,,,,N,N,351145.95,84723.41
New York City,Manhattan,7002053,001463,NYU Langone Hospitals,70 or Older,112,F,White,Not Span/Hispanic,3,Elective,Home w/ Home Health Services,2017,238,Complications of surgical procedures or medical care,175,OT OR THER PRC SKN/BRST,791,O.R. procedure for other complications of treatment,21,"Poisonings, Toxic Effects, Other Injuries and Other Complications of Treatment",3,Major,Moderate,Surgical,Medicare,,,,N,N,68521.03,16483.78
New York City,Manhattan,7002053,001463,NYU Langone Hospitals,18 to 29,100,F,Other Race,Spanish/Hispanic,5,Elective,Home w/ Home Health Services,2017,238,Complications of surgical procedures or medical care,104,NEPHRECTOMY; PART/TOTAL,791,O.R. procedure for other complications of treatment,21,"Poisonings, Toxic Effects, Other Injuries and Other Complications of Treatment",3,Major,Moderate,Surgical,Medicaid,,,,N,N,256479.99,62383.16
New York City,Manhattan,7002053,001463,NYU Langone Hospitals,30 to 49,112,F,Other Race,Not Span/Hispanic,3,Emergency,Home or Self Care,2017,238,Complications of surgical procedures or medical care,087,LAPAROSCOPY,791,O.R. procedure for other complications of treatment,21,"Poisonings, Toxic Effects, Other Injuries and Other Complications of Treatment",3,Major,Moderate,Surgical,Private Health Insurance,,,,N,Y,77538.92,17120.02
New York City,Manhattan,7002053,001463,NYU Langone Hospitals,70 or Older,112,M,White,Not Span/Hispanic,14,Elective,Home w/ Home Health Services,2017,238,Complications of surgical procedures or medical care,042,OT OR RX PRCS RESP SYS,791,O.R. procedure for other complications of treatment,21,"Poisonings, Toxic Effects, Other Injuries and Other Complications of Treatment",4,Extreme,Extreme,Surgical,Medicare,,,,N,N,393893.73,110737.52
New York City,Manhattan,7002053,001463,NYU Langone Hospitals,50 to 69,OOS,F,White,Not Span/Hispanic,6,Emergency,Home w/ Home Health Services,2017,237,Complication of device; implant or graft,042,OT OR RX PRCS RESP SYS,791,O.R. procedure for other complications of treatment,21,"Poisonings, Toxic Effects, Other Injuries and Other Complications of Treatment",3,Major,Major,Surgical,Medicare,,,,N,Y,109738.58,33470.76
New York City,Manhattan,7002053,001463,NYU Langone Hospitals,30 to 49,112,F,White,Not Span/Hispanic,13,Elective,Home w/ Home Health Services,2017,237,Complication of device; implant or graft,172,SKIN GRAFT,791,O.R. procedure for other complications of treatment,21,"Poisonings, Toxic Effects, Other Injuries and Other Complications of Treatment",3,Major,Moderate,Surgical,Private Health Insurance,,,,N,N,204165.71,79722.82
New York City,Manhattan,7002053,001463,NYU Langone Hospitals,50 to 69,115,F,White,Not Span/Hispanic,4,Elective,Home w/ Home Health Services,2017,238,Complications of surgical procedures or medical care,175,OT OR THER PRC SKN/BRST,791,O.R. procedure for other complications of treatment,21,"Poisonings, Toxic Effects, Other Injuries and Other Complications of Treatment",2,Moderate,Minor,Surgical,Medicare,,,,N,N,95389.56,23570.75
New York City,Manhattan,7002053,001463,NYU Langone Hospitals,50 to 69,103,F,White,Not Span/Hispanic,1,Elective,Home or Self Care,2017,237,Complication of device; implant or graft,161,OT OR THER PRCS ON BONE,791,O.R. procedure for other complications of treatment,21,"Poisonings, Toxic Effects, Other Injuries and Other Complications of Treatment",1,Minor,Minor,Surgical,Medicare,,,,N,N,37781.83,11844.27
New York City,Manhattan,7002053,001463,NYU Langone Hospitals,0 to 17,109,F,White,Not Span/Hispanic,1,Elective,Home or Self Care,2017,237,Complication of device; implant or graft,170,EXCISION OF SKIN LESION,791,O.R. procedure for other complications of treatment,21,"Poisonings, Toxic Effects, Other Injuries and Other Complications of Treatment",1,Minor,Minor,Surgical,Private Health Insurance,,,,N,N,41823.88,12679.97
New York City,Manhattan,7002053,001463,NYU Langone Hospitals,18 to 29,112,F,White,Not Span/Hispanic,11,Elective,Home or Self Care,2017,237,Complication of device; implant or graft,002,IRR XCRANIAL VENT SHUNT,791,O.R. procedure for other complications of treatment,21,"Poisonings, Toxic Effects, Other Injuries and Other Complications of Treatment",3,Major,Moderate,Surgical,Private Health Insurance,,,,N,N,130760.16,47610.86
New York City,Manhattan,7002053,001463,NYU Langone Hospitals,0 to 17,OOS,M,White,Not Span/Hispanic,2,Elective,Home or Self Care,2017,238,Complications of surgical procedures or medical care,009,OTHER OR THER NERV SYS,791,O.R. procedure for other complications of treatment,21,"Poisonings, Toxic Effects, Other Injuries and Other Complications of Treatment",4,Extreme,Major,Surgical,Private Health Insurance,,,,N,N,74200.07,15712.99
New York City,Manhattan,7002053,001463,NYU Langone Hospitals,50 to 69,103,F,White,Not Span/Hispanic,32,Emergency,Medicare Cert Long Term Care Hospital,2017,238,Complications of surgical procedures or medical care,054,OT VASC CATH; NOT HEART,791,O.R. procedure for other complications of treatment,21,"Poisonings, Toxic Effects, Other Injuries and Other Complications of Treatment",3,Major,Moderate,Surgical,Blue Cross/Blue Shield,,,,N,Y,424528.69,145173.03
New York City,Manhattan,7002053,001463,NYU Langone Hospitals,30 to 49,113,F,White,Not Span/Hispanic,3,Emergency,Home w/ Home Health Services,2017,238,Complications of surgical procedures or medical care,112,OT OR THER PRCS URINARY,791,O.R. procedure for other complications of treatment,21,"Poisonings, Toxic Effects, Other Injuries and Other Complications of Treatment",2,Moderate,Moderate,Surgical,Blue Cross/Blue Shield,,,,N,Y,73150.97,18716.06
New York City,Manhattan,7002053,001463,NYU Langone Hospitals,18 to 29,113,M,Other Race,Not Span/Hispanic,1,Elective,Home or Self Care,2017,237,Complication of device; implant or graft,175,OT OR THER PRC SKN/BRST,791,O.R. procedure for other complications of treatment,21,"Poisonings, Toxic Effects, Other Injuries and Other Complications of Treatment",2,Moderate,Minor,Surgical,Medicaid,,,,N,N,51028.59,14255.31
New York City,Manhattan,7002053,001463,NYU Langone Hospitals,70 or Older,112,M,Other Race,Not Span/Hispanic,15,Emergency,Expired,2017,237,Complication of device; implant or graft,097,OTHER GI DX PRCS,791,O.R. procedure for other complications of treatment,21,"Poisonings, Toxic Effects, Other Injuries and Other Complications of Treatment",4,Extreme,Extreme,Surgical,Medicare,,,,N,Y,212038.53,69447.08
New York City,Manhattan,7002053,001463,NYU Langone Hospitals,30 to 49,109,F,White,Not Span/Hispanic,16,Urgent,Left Against Medical Advice,2017,238,Complications of surgical procedures or medical care,175,OT OR THER PRC SKN/BRST,791,O.R. procedure for other complications of treatment,21,"Poisonings, Toxic Effects, Other Injuries and Other Complications of Treatment",4,Extreme,Major,Surgical,Private Health Insurance,,,,N,N,203606.68,65552.79
New York City,Manhattan,7002053,001463,NYU Langone Hospitals,30 to 49,112,M,Black/African American,Not Span/Hispanic,4,Emergency,Home or Self Care,2017,238,Complications of surgical procedures or medical care,088,ABDOMINAL PARACENTESIS,791,O.R. procedure for other complications of treatment,21,"Poisonings, Toxic Effects, Other Injuries and Other Complications of Treatment",4,Extreme,Extreme,Surgical,Blue Cross/Blue Shield,,,,N,Y,105921.79,39252.80
New York City,Manhattan,7002053,001463,NYU Langone Hospitals,50 to 69,103,M,White,Not Span/Hispanic,5,Emergency,Home or Self Care,2017,238,Complications of surgical procedures or medical care,042,OT OR RX PRCS RESP SYS,791,O.R. procedure for other complications of treatment,21,"Poisonings, Toxic Effects, Other Injuries and Other Complications of Treatment",2,Moderate,Minor,Surgical,Blue Cross/Blue Shield,,,,N,Y,81330.97,26093.08
New York City,Manhattan,7002053,001463,NYU Langone Hospitals,50 to 69,117,M,White,Not Span/Hispanic,3,Emergency,Home or Self Care,2017,238,Complications of surgical procedures or medical care,175,OT OR THER PRC SKN/BRST,791,O.R. procedure for other complications of treatment,21,"Poisonings, Toxic Effects, Other Injuries and Other Complications of Treatment",2,Moderate,Minor,Surgical,Private Health Insurance,,,,N,Y,81092.27,21681.48
New York City,Manhattan,7002053,001463,NYU Langone Hospitals,30 to 49,100,M,White,Not Span/Hispanic,7,Elective,Home w/ Home Health Services,2017,238,Complications of surgical procedures or medical care,172,SKIN GRAFT,791,O.R. procedure for other complications of treatment,21,"Poisonings, Toxic Effects, Other Injuries and Other Complications of Treatment",2,Moderate,Moderate,Surgical,Private Health Insurance,,,,N,N,141619.84,47071.07
New York City,Manhattan,7002053,001463,NYU Langone Hospitals,70 or Older,103,M,Black/African American,Not Span/Hispanic,11,Emergency,Home w/ Home Health Services,2017,238,Complications of surgical procedures or medical care,061,OT OR PRCS VES NOT HEAD,791,O.R. procedure for other complications of treatment,21,"Poisonings, Toxic Effects, Other Injuries and Other Complications of Treatment",3,Major,Moderate,Surgical,Medicare,,,,N,Y,305895.93,111389.86
New York City,Manhattan,7002053,001463,NYU Langone Hospitals,30 to 49,111,M,White,Not Span/Hispanic,1,Elective,Home or Self Care,2017,237,Complication of device; implant or graft,002,IRR XCRANIAL VENT SHUNT,791,O.R. procedure for other complications of treatment,21,"Poisonings, Toxic Effects, Other Injuries and Other Complications of Treatment",3,Major,Minor,Surgical,Private Health Insurance,,,,N,N,107366.25,23399.36
New York City,Manhattan,7002053,001463,NYU Langone Hospitals,18 to 29,,M,Other Race,Spanish/Hispanic,1,Elective,Home w/ Home Health Services,2017,237,Complication of device; implant or graft,175,OT OR THER PRC SKN/BRST,791,O.R. procedure for other complications of treatment,21,"Poisonings, Toxic Effects, Other Injuries and Other Complications of Treatment",2,Moderate,Minor,Surgical,Medicaid,,,,N,N,174054.34,34830.45
New York City,Manhattan,7002053,001463,NYU Langone Hospitals,50 to 69,125,F,White,Not Span/Hispanic,1,Emergency,Home or Self Care,2017,237,Complication of device; implant or graft,174,OT NON-OR THER PRC SKIN,791,O.R. procedure for other complications of treatment,21,"Poisonings, Toxic Effects, Other Injuries and Other Complications of Treatment",2,Moderate,Minor,Surgical,Private Health Insurance,,,,N,Y,66053.25,13289.18
New York City,Manhattan,7002053,001463,NYU Langone Hospitals,70 or Older,112,M,White,Not Span/Hispanic,5,Urgent,Home w/ Home Health Services,2017,238,Complications of surgical procedures or medical care,061,OT OR PRCS VES NOT HEAD,791,O.R. procedure for other complications of treatment,21,"Poisonings, Toxic Effects, Other Injuries and Other Complications of Treatment",3,Major,Moderate,Surgical,Medicare,,,,N,N,94327.60,23052.41
New York City,Manhattan,7002053,001463,NYU Langone Hospitals,50 to 69,113,M,Other Race,Not Span/Hispanic,3,Urgent,Home w/ Home Health Services,2017,238,Complications of surgical procedures or medical care,099,OT OR GI THER PRCS,791,O.R. procedure for other complications of treatment,21,"Poisonings, Toxic Effects, Other Injuries and Other Complications of Treatment",2,Moderate,Minor,Surgical,Private Health Insurance,,,,N,N,66819.69,26616.24
New York City,Manhattan,7002053,001463,NYU Langone Hospitals,70 or Older,112,F,Other Race,Not Span/Hispanic,10,Emergency,Home w/ Home Health Services,2017,237,Complication of device; implant or graft,094,OT OR UP GI THER PRCS,791,O.R. procedure for other complications of treatment,21,"Poisonings, Toxic Effects, Other Injuries and Other Complications of Treatment",2,Moderate,Moderate,Surgical,Medicare,,,,N,Y,134213.19,48232.20