Hospital Service Area,Hospital County,Operating Certificate Number,Permanent Facility Id,Facility Name,Age Group,Zip Code - 3 digits,Gender,Race,Ethnicity,Length of Stay,Type of Admission,Patient Disposition,Discharge Year,CCS Diagnosis Code,CCS Diagnosis Description,CCS Procedure Code,CCS Procedure Description,APR DRG Code,APR DRG Description,APR MDC Code,APR MDC Description,APR Severity of Illness Code,APR Severity of Illness Description,APR Risk of Mortality,APR Medical Surgical Description,Payment Typology 1,Payment Typology 2,Payment Typology 3,Birth Weight,Abortion Edit Indicator,Emergency Department Indicator,Total Charges,Total Costs
New York City,Manhattan,7002001,001438,Bellevue Hospital Center,30 to 49,100,M,Black/African American,Not Span/Hispanic,39,Emergency,Inpatient Rehabilitation Facility,2019,INJ021,"EFFECT OF OTHER EXTERNAL CAUSES, INITIAL ENCOUNTER",RES007,AIRWAY INTUBATION,792,EXTENSIVE OR PROCEDURES FOR OTHER COMPLICATIONS OF TREATMENT,21,"INJURIES, POISONINGS AND TOXIC EFFECTS OF DRUGS",4,Extreme,Extreme,Surgical,Medicaid,Medicaid,,,,true,224350.76,149103.52
New York City,Manhattan,7002024,001456,Mount Sinai Hospital,50 to 69,112,M,Black/African American,Not Span/Hispanic,10,Emergency,Home or Self Care,2019,INJ037,"COMPLICATION OF OTHER SURGICAL OR MEDICAL CARE, INJURY, INITIAL ENCOUNTER",IMG004,FLUOROSCOPY OF NON-CIRCULATORY ORGANS,792,EXTENSIVE OR PROCEDURES FOR OTHER COMPLICATIONS OF TREATMENT,21,"INJURIES, POISONINGS AND TOXIC EFFECTS OF DRUGS",3,Major,Major,Surgical,Medicaid,Medicaid,Self-Pay,,,true,130940.3,42499.18
Long Island,Suffolk,5154001,000925,Good Samaritan Hospital Medical Center,50 to 69,117,M,White,Not Span/Hispanic,10,Emergency,Home w/ Home Health Services,2019,INJ037,"COMPLICATION OF OTHER SURGICAL OR MEDICAL CARE, INJURY, INITIAL ENCOUNTER",GIS003,GI SYSTEM BIOPSY (NON-ENDOSCOPIC),792,EXTENSIVE OR PROCEDURES FOR OTHER COMPLICATIONS OF TREATMENT,21,"INJURIES, POISONINGS AND TOXIC EFFECTS OF DRUGS",4,Extreme,Extreme,Surgical,Medicaid,Medicaid,,,,true,127165.37,29861.78
Hudson Valley,Westchester,5932000,001129,Phelps Hospital,50 to 69,105,M,Black/African American,Not Span/Hispanic,10,Emergency,Home or Self Care,2019,INJ037,"COMPLICATION OF OTHER SURGICAL OR MEDICAL CARE, INJURY, INITIAL ENCOUNTER",GIS007,GI SYSTEM DRAINAGE (EXCLUDING PARACENTESIS),792,EXTENSIVE OR PROCEDURES FOR OTHER COMPLICATIONS OF TREATMENT,21,"INJURIES, POISONINGS AND TOXIC EFFECTS OF DRUGS",4,Extreme,Major,Surgical,Medicare,,,,,true,128174.93,42054.56
New York City,Manhattan,7002054,001458,New York-Presbyterian Hospital - New York Weill Cornell Center,50 to 69,109,F,White,Not Span/Hispanic,4,Elective,Home or Self Care,2019,MUS037,POSTPROCEDURAL OR POSTOPERATIVE MUSCULOSKELETAL SYSTEM COMPLICATION,MST013,SPINE FUSION,792,EXTENSIVE OR PROCEDURES FOR OTHER COMPLICATIONS OF TREATMENT,21,"INJURIES, POISONINGS AND TOXIC EFFECTS OF DRUGS",3,Major,Minor,Surgical,Miscellaneous/Other,Self-Pay,,,,false,198496.84,84227.24
New York City,Queens,7003010,001637,New York - Presbyterian/Queens,30 to 49,113,F,Black/African American,Not Span/Hispanic,33,Emergency,Skilled Nursing Home,2019,INJ037,"COMPLICATION OF OTHER SURGICAL OR MEDICAL CARE, INJURY, INITIAL ENCOUNTER",GIS011,SMALL BOWEL RESECTION,792,EXTENSIVE OR PROCEDURES FOR OTHER COMPLICATIONS OF TREATMENT,21,"INJURIES, POISONINGS AND TOXIC EFFECTS OF DRUGS",4,Extreme,Extreme,Surgical,Medicaid,Self-Pay,,,,true,556067.2,169695.43
New York City,Manhattan,7002053,001463,NYU Langone Hospitals,30 to 49,117,F,White,Not Span/Hispanic,10,Emergency,Home or Self Care,2019,INJ037,"COMPLICATION OF OTHER SURGICAL OR MEDICAL CARE, INJURY, INITIAL ENCOUNTER",LYM006,SPLEEN PROCEDURES (EXCLUDING SPLENECTOMY),792,EXTENSIVE OR PROCEDURES FOR OTHER COMPLICATIONS OF TREATMENT,21,"INJURIES, POISONINGS AND TOXIC EFFECTS OF DRUGS",3,Major,Moderate,Surgical,Blue Cross/Blue Shield,,,,,false,245417.44,53320.22
New York City,Kings,7002053,001304,NYU Langone Hospital-Brooklyn,30 to 49,112,F,White,Unknown,5,Emergency,Home or Self Care,2019,RSP017,POSTPROCEDURAL OR POSTOPERATIVE RESPIRATORY SYSTEM COMPLICATION,RES014,"RESPIRATORY SYSTEM PROCEDURES, NEC",792,EXTENSIVE OR PROCEDURES FOR OTHER COMPLICATIONS OF TREATMENT,21,"INJURIES, POISONINGS AND TOXIC EFFECTS OF DRUGS",3,Major,Moderate,Surgical,Medicaid,,,,,true,98027.83,24982.37
New York City,Manhattan,7002012,001447,Hospital for Special Surgery,70 or Older,113,M,Other Race,Not Span/Hispanic,1,Urgent,Inpatient Rehabilitation Facility,2019,MUS037,POSTPROCEDURAL OR POSTOPERATIVE MUSCULOSKELETAL SYSTEM COMPLICATION,CNS003,SPINAL CANAL AND SPINAL CORD DRAINAGE (EXCLUDING LUMBAR PUNCTURE),792,EXTENSIVE OR PROCEDURES FOR OTHER COMPLICATIONS OF TREATMENT,21,"INJURIES, POISONINGS AND TOXIC EFFECTS OF DRUGS",2,Moderate,Minor,Surgical,Medicare,Blue Cross/Blue Shield,Private Health Insurance,,,false,58039,20282.57
Hudson Valley,Westchester,5957001,001139,Westchester Medical Center,50 to 69,105,F,White,Not Span/Hispanic,9,Elective,Home or Self Care,2019,INJ037,"COMPLICATION OF OTHER SURGICAL OR MEDICAL CARE, INJURY, INITIAL ENCOUNTER",MST013,SPINE FUSION,792,EXTENSIVE OR PROCEDURES FOR OTHER COMPLICATIONS OF TREATMENT,21,"INJURIES, POISONINGS AND TOXIC EFFECTS OF DRUGS",2,Moderate,Minor,Surgical,Private Health Insurance,,,,,false,424388.34,80267.71
Hudson Valley,Dutchess,5957001,000180,Mid-Hudson Valley Division of Westchester Medical Center,50 to 69,125,F,White,Not Span/Hispanic,6,Emergency,Skilled Nursing Home,2019,INJ037,"COMPLICATION OF OTHER SURGICAL OR MEDICAL CARE, INJURY, INITIAL ENCOUNTER",MST018,BONE EXCISION,792,EXTENSIVE OR PROCEDURES FOR OTHER COMPLICATIONS OF TREATMENT,21,"INJURIES, POISONINGS AND TOXIC EFFECTS OF DRUGS",3,Major,Minor,Surgical,Miscellaneous/Other,Blue Cross/Blue Shield,,,,true,153289.74,25984.32
Capital/Adirond,Albany,0101000,000001,Albany Medical Center Hospital,50 to 69,121,F,White,Not Span/Hispanic,13,Emergency,Home w/ Home Health Services,2019,NVS021,POSTPROCEDURAL OR POSTOPERATIVE NERVOUS SYSTEM COMPLICATION,CNS004,INTRACRANIAL EPIDURAL AND SUBDURAL SPACE DRAINAGE,792,EXTENSIVE OR PROCEDURES FOR OTHER COMPLICATIONS OF TREATMENT,21,"INJURIES, POISONINGS AND TOXIC EFFECTS OF DRUGS",3,Major,Minor,Surgical,Medicare,Blue Cross/Blue Shield,,,,true,105792.72,33321.4
Hudson Valley,Westchester,5957001,001139,Westchester Medical Center,30 to 49,105,F,White,Not Span/Hispanic,2,Emergency,Home or Self Care,2019,DIG024,POSTPROCEDURAL OR POSTOPERATIVE DIGESTIVE SYSTEM COMPLICATION,CAR010,LIGATION AND EMBOLIZATION OF VESSELS,792,EXTENSIVE OR PROCEDURES FOR OTHER COMPLICATIONS OF TREATMENT,21,"INJURIES, POISONINGS AND TOXIC EFFECTS OF DRUGS",3,Major,Major,Surgical,Medicaid,Medicaid,,,,true,172241.44,32019.63
Hudson Valley,Westchester,5957001,001139,Westchester Medical Center,70 or Older,OOS,M,White,Not Span/Hispanic,1,Elective,Home or Self Care,2019,INJ076,"COMPLICATION, SEQUELA",CAR010,LIGATION AND EMBOLIZATION OF VESSELS,792,EXTENSIVE OR PROCEDURES FOR OTHER COMPLICATIONS OF TREATMENT,21,"INJURIES, POISONINGS AND TOXIC EFFECTS OF DRUGS",2,Moderate,Moderate,Surgical,Medicare,Medicare,,,,false,176109.06,34489.08
New York City,Kings,7001021,001306,New York - Presbyterian Brooklyn Methodist Hospital,30 to 49,112,M,Black/African American,Not Span/Hispanic,7,Emergency,Home or Self Care,2019,MUS037,POSTPROCEDURAL OR POSTOPERATIVE MUSCULOSKELETAL SYSTEM COMPLICATION,MST006,KNEE ARTHROPLASTY,792,EXTENSIVE OR PROCEDURES FOR OTHER COMPLICATIONS OF TREATMENT,21,"INJURIES, POISONINGS AND TOXIC EFFECTS OF DRUGS",2,Moderate,Minor,Surgical,"Managed Care, Unspecified",Medicaid,Self-Pay,,,true,66323.95,23132.31
New York City,Bronx,7000001,001178,BronxCare Hospital Center,30 to 49,104,M,Other Race,Unknown,8,Emergency,Home or Self Care,2019,DIG024,POSTPROCEDURAL OR POSTOPERATIVE DIGESTIVE SYSTEM COMPLICATION,GIS021,GI SYSTEM REPAIR (EXCLUDING ANORECTAL),792,EXTENSIVE OR PROCEDURES FOR OTHER COMPLICATIONS OF TREATMENT,21,"INJURIES, POISONINGS AND TOXIC EFFECTS OF DRUGS",2,Moderate,Minor,Surgical,Medicare,Medicaid,,,,true,35309.18,38262.93
Capital/Adirond,Albany,0101004,000005,St. Peter's Hospital,70 or Older,122,M,White,Not Span/Hispanic,8,Elective,Home or Self Care,2019,DIG024,POSTPROCEDURAL OR POSTOPERATIVE DIGESTIVE SYSTEM COMPLICATION,GIS009,COLECTOMY,792,EXTENSIVE OR PROCEDURES FOR OTHER COMPLICATIONS OF TREATMENT,21,"INJURIES, POISONINGS AND TOXIC EFFECTS OF DRUGS",3,Major,Major,Surgical,Medicare,Blue Cross/Blue Shield,,,,false,82661.15,35244.08
Capital/Adirond,Albany,0101004,000005,St. Peter's Hospital,70 or Older,121,F,White,Not Span/Hispanic,7,Elective,Skilled Nursing Home,2019,INJ037,"COMPLICATION OF OTHER SURGICAL OR MEDICAL CARE, INJURY, INITIAL ENCOUNTER",MST017,JOINT TISSUE EXCISION (EXCLUDING DISCECTOMY),792,EXTENSIVE OR PROCEDURES FOR OTHER COMPLICATIONS OF TREATMENT,21,"INJURIES, POISONINGS AND TOXIC EFFECTS OF DRUGS",2,Moderate,Moderate,Surgical,Medicare,Private Health Insurance,,,,false,55237.2,23797.87
New York City,Kings,7001020,001305,Maimonides Medical Center,18 to 29,112,F,White,Not Span/Hispanic,2,Emergency,Home or Self Care,2019,DIG024,POSTPROCEDURAL OR POSTOPERATIVE DIGESTIVE SYSTEM COMPLICATION,GIS021,GI SYSTEM REPAIR (EXCLUDING ANORECTAL),792,EXTENSIVE OR PROCEDURES FOR OTHER COMPLICATIONS OF TREATMENT,21,"INJURIES, POISONINGS AND TOXIC EFFECTS OF DRUGS",3,Major,Moderate,Surgical,Medicaid,Medicaid,Self-Pay,,,false,31111.04,9722.55
New York City,Richmond,7004003,001740,Staten Island University Hosp-North,50 to 69,103,F,Black/African American,Not Span/Hispanic,8,Emergency,Home w/ Home Health Services,2019,INJ037,"COMPLICATION OF OTHER SURGICAL OR MEDICAL CARE, INJURY, INITIAL ENCOUNTER",HEP010,HEPATOBILIARY AND PANCREATIC DRAINAGE,792,EXTENSIVE OR PROCEDURES FOR OTHER COMPLICATIONS OF TREATMENT,21,"INJURIES, POISONINGS AND TOXIC EFFECTS OF DRUGS",3,Major,Moderate,Surgical,Medicare,Medicare,,,,true,90946.98,23994.33
Western NY,Cattaraugus,0401001,000066,Olean General Hospital,70 or Older,147,F,White,Not Span/Hispanic,5,Emergency,Home or Self Care,2019,DIG024,POSTPROCEDURAL OR POSTOPERATIVE DIGESTIVE SYSTEM COMPLICATION,GIS021,GI SYSTEM REPAIR (EXCLUDING ANORECTAL),792,EXTENSIVE OR PROCEDURES FOR OTHER COMPLICATIONS OF TREATMENT,21,"INJURIES, POISONINGS AND TOXIC EFFECTS OF DRUGS",3,Major,Major,Surgical,Medicare,Private Health Insurance,,,,true,20195.32,9179.28
New York City,Manhattan,7002054,001464,New York-Presbyterian Hospital - Columbia Presbyterian Center,0 to 17,103,F,White,Spanish/Hispanic,8,Emergency,Home or Self Care,2019,INJ037,"COMPLICATION OF OTHER SURGICAL OR MEDICAL CARE, INJURY, INITIAL ENCOUNTER",MST030,"MUSCULOSKELETAL PROCEDURES, NEC",792,EXTENSIVE OR PROCEDURES FOR OTHER COMPLICATIONS OF TREATMENT,21,"INJURIES, POISONINGS AND TOXIC EFFECTS OF DRUGS",4,Extreme,Major,Surgical,Blue Cross/Blue Shield,Self-Pay,,,,true,118912.64,28747.29
New York City,Kings,7001021,001306,New York - Presbyterian Brooklyn Methodist Hospital,50 to 69,OOS,M,Other Race,Not Span/Hispanic,8,Emergency,Home or Self Care,2019,INJ037,"COMPLICATION OF OTHER SURGICAL OR MEDICAL CARE, INJURY, INITIAL ENCOUNTER",GIS011,SMALL BOWEL RESECTION,792,EXTENSIVE OR PROCEDURES FOR OTHER COMPLICATIONS OF TREATMENT,21,"INJURIES, POISONINGS AND TOXIC EFFECTS OF DRUGS",3,Major,Major,Surgical,Medicare,Self-Pay,,,,false,89501.87,36133.91
Capital/Adirond,Albany,0101000,000001,Albany Medical Center Hospital,70 or Older,121,M,White,Not Span/Hispanic,6,Emergency,Home w/ Home Health Services,2019,MUS037,POSTPROCEDURAL OR POSTOPERATIVE MUSCULOSKELETAL SYSTEM COMPLICATION,MST007,HIP ARTHROPLASTY,792,EXTENSIVE OR PROCEDURES FOR OTHER COMPLICATIONS OF TREATMENT,21,"INJURIES, POISONINGS AND TOXIC EFFECTS OF DRUGS",2,Moderate,Minor,Surgical,Medicare,Blue Cross/Blue Shield,,,,true,56196.87,21793.02
New York City,Manhattan,7002054,001458,New York-Presbyterian Hospital - New York Weill Cornell Center,70 or Older,117,F,Other Race,Not Span/Hispanic,5,Elective,Inpatient Rehabilitation Facility,2019,INJ021,"EFFECT OF OTHER EXTERNAL CAUSES, INITIAL ENCOUNTER",CNS007,CNS EXCISION PROCEDURES,792,EXTENSIVE OR PROCEDURES FOR OTHER COMPLICATIONS OF TREATMENT,21,"INJURIES, POISONINGS AND TOXIC EFFECTS OF DRUGS",3,Major,Major,Surgical,Medicare,Blue Cross/Blue Shield,Self-Pay,,,false,102816.08,31344.83
Capital/Adirond,Albany,0101004,000005,St. Peter's Hospital,30 to 49,128,F,White,Not Span/Hispanic,4,Urgent,Home or Self Care,2019,INJ037,"COMPLICATION OF OTHER SURGICAL OR MEDICAL CARE, INJURY, INITIAL ENCOUNTER",FRS007,FEMALE GENITAL TRACT REPAIR (EXCLUDING VULVA),792,EXTENSIVE OR PROCEDURES FOR OTHER COMPLICATIONS OF TREATMENT,21,"INJURIES, POISONINGS AND TOXIC EFFECTS OF DRUGS",1,Minor,Minor,Surgical,Private Health Insurance,,,,,false,30596.55,13514.94
New York City,Manhattan,7002054,001464,New York-Presbyterian Hospital - Columbia Presbyterian Center,50 to 69,105,M,White,Not Span/Hispanic,7,Urgent,Inpatient Rehabilitation Facility,2019,INJ037,"COMPLICATION OF OTHER SURGICAL OR MEDICAL CARE, INJURY, INITIAL ENCOUNTER",SKB007,SKIN GRAFT,792,EXTENSIVE OR PROCEDURES FOR OTHER COMPLICATIONS OF TREATMENT,21,"INJURIES, POISONINGS AND TOXIC EFFECTS OF DRUGS",2,Moderate,Minor,Surgical,Medicare,Private Health Insurance,Self-Pay,,,false,213489.95,94721.91
New York City,Manhattan,7002054,001464,New York-Presbyterian Hospital - Columbia Presbyterian Center,50 to 69,109,M,White,Not Span/Hispanic,4,Elective,Skilled Nursing Home,2019,INJ037,"COMPLICATION OF OTHER SURGICAL OR MEDICAL CARE, INJURY, INITIAL ENCOUNTER",CNS014,"CNS PROCEDURES, NEC",792,EXTENSIVE OR PROCEDURES FOR OTHER COMPLICATIONS OF TREATMENT,21,"INJURIES, POISONINGS AND TOXIC EFFECTS OF DRUGS",3,Major,Major,Surgical,Private Health Insurance,Self-Pay,,,,false,79545.79,22286.04
Long Island,Nassau,2950001,000527,Mount Sinai South Nassau,70 or Older,115,F,White,Not Span/Hispanic,1,Emergency,Expired,2019,INJ037,"COMPLICATION OF OTHER SURGICAL OR MEDICAL CARE, INJURY, INITIAL ENCOUNTER",GIS010,GASTRECTOMY,792,EXTENSIVE OR PROCEDURES FOR OTHER COMPLICATIONS OF TREATMENT,21,"INJURIES, POISONINGS AND TOXIC EFFECTS OF DRUGS",4,Extreme,Extreme,Surgical,Medicare,Medicare,,,,true,115479.09,16974.52
Central NY,Onondaga,3301007,000635,University Hospital SUNY Health Science Center,30 to 49,130,F,White,Not Span/Hispanic,4,Emergency,Home w/ Home Health Services,2019,INJ036,"COMPLICATION OF TRANSPLANTED ORGANS OR TISSUE, INITIAL ENCOUNTER",MST018,BONE EXCISION,792,EXTENSIVE OR PROCEDURES FOR OTHER COMPLICATIONS OF TREATMENT,21,"INJURIES, POISONINGS AND TOXIC EFFECTS OF DRUGS",4,Extreme,Extreme,Surgical,Medicare,Medicaid,,,,true,58111.85,14587.15
Long Island,Suffolk,5154001,000925,Good Samaritan Hospital Medical Center,50 to 69,117,M,White,Not Span/Hispanic,14,Emergency,Skilled Nursing Home,2019,INJ037,"COMPLICATION OF OTHER SURGICAL OR MEDICAL CARE, INJURY, INITIAL ENCOUNTER",MST012,BONE FIXATION (EXCLUDING EXTREMITIES),792,EXTENSIVE OR PROCEDURES FOR OTHER COMPLICATIONS OF TREATMENT,21,"INJURIES, POISONINGS AND TOXIC EFFECTS OF DRUGS",3,Major,Major,Surgical,Medicare,Blue Cross/Blue Shield,,,,true,295465.26,61718.87
New York City,Manhattan,7002002,001439,Mount Sinai Beth Israel,70 or Older,112,M,Black/African American,Not Span/Hispanic,19,Emergency,Home w/ Home Health Services,2019,INJ037,"COMPLICATION OF OTHER SURGICAL OR MEDICAL CARE, INJURY, INITIAL ENCOUNTER",MST020,SUBCUTANEOUS TISSUE AND FASCIA EXCISION,792,EXTENSIVE OR PROCEDURES FOR OTHER COMPLICATIONS OF TREATMENT,21,"INJURIES, POISONINGS AND TOXIC EFFECTS OF DRUGS",3,Major,Major,Surgical,Medicare,Miscellaneous/Other,Medicaid,,,true,262193.86,55149.12
New York City,Manhattan,7002002,001439,Mount Sinai Beth Israel,30 to 49,100,F,Black/African American,Not Span/Hispanic,6,Emergency,Home w/ Home Health Services,2019,INJ037,"COMPLICATION OF OTHER SURGICAL OR MEDICAL CARE, INJURY, INITIAL ENCOUNTER",GIS018,ILEOSTOMY AND COLOSTOMY,792,EXTENSIVE OR PROCEDURES FOR OTHER COMPLICATIONS OF TREATMENT,21,"INJURIES, POISONINGS AND TOXIC EFFECTS OF DRUGS",2,Moderate,Minor,Surgical,Medicaid,Medicaid,Self-Pay,,,true,93482.02,19246.37
New York City,Manhattan,7002002,001439,Mount Sinai Beth Israel,70 or Older,100,F,White,Not Span/Hispanic,9,Urgent,Skilled Nursing Home,2019,DIG024,POSTPROCEDURAL OR POSTOPERATIVE DIGESTIVE SYSTEM COMPLICATION,URN006,BLADDER CATHETERIZATION AND DRAINAGE,792,EXTENSIVE OR PROCEDURES FOR OTHER COMPLICATIONS OF TREATMENT,21,"INJURIES, POISONINGS AND TOXIC EFFECTS OF DRUGS",3,Major,Moderate,Surgical,Medicare,Medicaid,Self-Pay,,,false,100450.7,21389.96
Central NY,Onondaga,3301007,000635,University Hospital SUNY Health Science Center,50 to 69,130,F,Multi-racial,Not Span/Hispanic,11,Emergency,Short-term Hospital,2019,CIR038,POSTPROCEDURAL OR POSTOPERATIVE CIRCULATORY SYSTEM COMPLICATION,CAR019,SEPTAL REPAIR AND OTHER THERAPEUTIC HEART PROCEDURES,792,EXTENSIVE OR PROCEDURES FOR OTHER COMPLICATIONS OF TREATMENT,21,"INJURIES, POISONINGS AND TOXIC EFFECTS OF DRUGS",4,Extreme,Extreme,Surgical,Private Health Insurance,,,,,false,151461.65,44640.83
Central NY,Onondaga,3301007,000635,University Hospital SUNY Health Science Center,70 or Older,130,M,White,Not Span/Hispanic,8,Emergency,Home w/ Home Health Services,2019,INJ037,"COMPLICATION OF OTHER SURGICAL OR MEDICAL CARE, INJURY, INITIAL ENCOUNTER",RES008,"LUNG, PLEURA, OR DIAPHRAGM RESECTION (OPEN AND THORACOSCOPIC)",792,EXTENSIVE OR PROCEDURES FOR OTHER COMPLICATIONS OF TREATMENT,21,"INJURIES, POISONINGS AND TOXIC EFFECTS OF DRUGS",3,Major,Major,Surgical,Medicare,Private Health Insurance,,,,true,101025.27,31055.91
Finger Lakes,Monroe,2701003,000411,Rochester General Hospital,50 to 69,145,M,White,Not Span/Hispanic,2,Elective,Home w/ Home Health Services,2019,INJ076,"COMPLICATION, SEQUELA",MST006,KNEE ARTHROPLASTY,792,EXTENSIVE OR PROCEDURES FOR OTHER COMPLICATIONS OF TREATMENT,21,"INJURIES, POISONINGS AND TOXIC EFFECTS OF DRUGS",1,Minor,Minor,Surgical,Blue Cross/Blue Shield,,,,,false,59572.87,16853.88
New York City,Manhattan,7002054,001464,New York-Presbyterian Hospital - Columbia Presbyterian Center,50 to 69,119,F,White,Not Span/Hispanic,30,Emergency,Skilled Nursing Home,2019,INJ037,"COMPLICATION OF OTHER SURGICAL OR MEDICAL CARE, INJURY, INITIAL ENCOUNTER",GIS011,SMALL BOWEL RESECTION,792,EXTENSIVE OR PROCEDURES FOR OTHER COMPLICATIONS OF TREATMENT,21,"INJURIES, POISONINGS AND TOXIC EFFECTS OF DRUGS",4,Extreme,Extreme,Surgical,Medicare,Private Health Insurance,Self-Pay,,,false,597575.96,190706.51
Western NY,Erie,1401014,000207,Buffalo General Medical Center,50 to 69,142,F,Black/African American,Not Span/Hispanic,4,Urgent,Home w/ Home Health Services,2019,INJ037,"COMPLICATION OF OTHER SURGICAL OR MEDICAL CARE, INJURY, INITIAL ENCOUNTER",MST029,"MUSCULOSKELETAL DEVICE PROCEDURES, NEC",792,EXTENSIVE OR PROCEDURES FOR OTHER COMPLICATIONS OF TREATMENT,21,"INJURIES, POISONINGS AND TOXIC EFFECTS OF DRUGS",3,Major,Moderate,Surgical,Medicaid,Self-Pay,,,,false,36362.02,13252.07
New York City,Bronx,7000014,001176,SBH Health System,30 to 49,104,F,White,Not Span/Hispanic,7,Elective,Home w/ Home Health Services,2019,GEN026,POSTPROCEDURAL OR POSTOPERATIVE GENITOURINARY SYSTEM COMPLICATION,GNR002,ABDOMINAL WALL REPAIR (INCLUDING HERNIA),792,EXTENSIVE OR PROCEDURES FOR OTHER COMPLICATIONS OF TREATMENT,21,"INJURIES, POISONINGS AND TOXIC EFFECTS OF DRUGS",2,Moderate,Minor,Surgical,Medicaid,Medicaid,,,,false,156984.59,63599.11
New York City,Kings,7001035,001318,Wyckoff Heights Medical Center,50 to 69,113,M,Other Race,Not Span/Hispanic,16,Emergency,Home w/ Home Health Services,2019,INJ037,"COMPLICATION OF OTHER SURGICAL OR MEDICAL CARE, INJURY, INITIAL ENCOUNTER",CAR008,ANGIOPLASTY AND RELATED VESSEL PROCEDURES (ENDOVASCULAR; EXCLUDING CAROTID),792,EXTENSIVE OR PROCEDURES FOR OTHER COMPLICATIONS OF TREATMENT,21,"INJURIES, POISONINGS AND TOXIC EFFECTS OF DRUGS",3,Major,Moderate,Surgical,Medicare,Medicare,,,,true,130503.13,65034.91
New York City,Manhattan,7002054,001464,New York-Presbyterian Hospital - Columbia Presbyterian Center,30 to 49,104,F,White,Multi-ethnic,3,Urgent,Home w/ Home Health Services,2019,INJ037,"COMPLICATION OF OTHER SURGICAL OR MEDICAL CARE, INJURY, INITIAL ENCOUNTER",MST007,HIP ARTHROPLASTY,792,EXTENSIVE OR PROCEDURES FOR OTHER COMPLICATIONS OF TREATMENT,21,"INJURIES, POISONINGS AND TOXIC EFFECTS OF DRUGS",2,Moderate,Minor,Surgical,Medicaid,Medicaid,Self-Pay,,,false,49527.03,11841.14
New York City,Kings,7002053,001304,NYU Langone Hospital-Brooklyn,50 to 69,112,M,Other Race,Spanish/Hispanic,3,Emergency,Home or Self Care,2019,INJ022,"POISONING BY DRUGS, INITIAL ENCOUNTER",CAR004,PERCUTANEOUS CORONARY INTERVENTIONS (PCI),792,EXTENSIVE OR PROCEDURES FOR OTHER COMPLICATIONS OF TREATMENT,21,"INJURIES, POISONINGS AND TOXIC EFFECTS OF DRUGS",4,Extreme,Extreme,Surgical,Medicare,,,,,true,183824.76,37915.3
New York City,Manhattan,7002054,001458,New York-Presbyterian Hospital - New York Weill Cornell Center,70 or Older,105,M,White,Not Span/Hispanic,8,Emergency,Home w/ Home Health Services,2019,INJ037,"COMPLICATION OF OTHER SURGICAL OR MEDICAL CARE, INJURY, INITIAL ENCOUNTER",MST030,"MUSCULOSKELETAL PROCEDURES, NEC",792,EXTENSIVE OR PROCEDURES FOR OTHER COMPLICATIONS OF TREATMENT,21,"INJURIES, POISONINGS AND TOXIC EFFECTS OF DRUGS",3,Major,Major,Surgical,Medicare,Medicare,Self-Pay,,,true,118150.16,29699.49
New York City,Kings,7001021,001306,New York - Presbyterian Brooklyn Methodist Hospital,70 or Older,112,F,White,Spanish/Hispanic,5,Emergency,Home w/ Home Health Services,2019,INJ037,"COMPLICATION OF OTHER SURGICAL OR MEDICAL CARE, INJURY, INITIAL ENCOUNTER",GIS009,COLECTOMY,792,EXTENSIVE OR PROCEDURES FOR OTHER COMPLICATIONS OF TREATMENT,21,"INJURIES, POISONINGS AND TOXIC EFFECTS OF DRUGS",2,Moderate,Minor,Surgical,Medicare,Medicare,Self-Pay,,,false,53530.68,21389.23
New York City,Manhattan,7002017,001450,Lenox Hill Hospital,30 to 49,,M,White,Not Span/Hispanic,11,Urgent,Home or Self Care,2019,INJ037,"COMPLICATION OF OTHER SURGICAL OR MEDICAL CARE, INJURY, INITIAL ENCOUNTER",RES008,"LUNG, PLEURA, OR DIAPHRAGM RESECTION (OPEN AND THORACOSCOPIC)",792,EXTENSIVE OR PROCEDURES FOR OTHER COMPLICATIONS OF TREATMENT,21,"INJURIES, POISONINGS AND TOXIC EFFECTS OF DRUGS",2,Moderate,Minor,Surgical,Medicaid,Medicaid,,,,false,178048.93,40061.13
Hudson Valley,Westchester,5904001,001072,Montefiore New Rochelle Hospital,50 to 69,,F,White,Not Span/Hispanic,21,Emergency,Inpatient Rehabilitation Facility,2019,DIG024,POSTPROCEDURAL OR POSTOPERATIVE DIGESTIVE SYSTEM COMPLICATION,CAR012,VESSEL REPAIR AND REPLACEMENT,792,EXTENSIVE OR PROCEDURES FOR OTHER COMPLICATIONS OF TREATMENT,21,"INJURIES, POISONINGS AND TOXIC EFFECTS OF DRUGS",4,Extreme,Major,Surgical,Blue Cross/Blue Shield,Self-Pay,,,,true,203460.12,56536.79
New York City,Manhattan,7002053,001463,NYU Langone Hospitals,50 to 69,103,M,White,Not Span/Hispanic,15,Elective,Inpatient Rehabilitation Facility,2019,INJ036,"COMPLICATION OF TRANSPLANTED ORGANS OR TISSUE, INITIAL ENCOUNTER",MST019,"MUSCLE, TENDON, BURSA, AND LIGAMENT EXCISION",792,EXTENSIVE OR PROCEDURES FOR OTHER COMPLICATIONS OF TREATMENT,21,"INJURIES, POISONINGS AND TOXIC EFFECTS OF DRUGS",4,Extreme,Extreme,Surgical,Medicare,Medicare,,,,false,352672.19,85678.64
Long Island,Suffolk,5154000,000924,South Shore University Hospital,50 to 69,117,F,Other Race,Not Span/Hispanic,8,Urgent,Home or Self Care,2019,RSP017,POSTPROCEDURAL OR POSTOPERATIVE RESPIRATORY SYSTEM COMPLICATION,MST018,BONE EXCISION,792,EXTENSIVE OR PROCEDURES FOR OTHER COMPLICATIONS OF TREATMENT,21,"INJURIES, POISONINGS AND TOXIC EFFECTS OF DRUGS",2,Moderate,Minor,Surgical,Blue Cross/Blue Shield,,,,,false,119879.04,33281.31