Hospital Service Area,Hospital County,Operating Certificate Number,Permanent Facility Id,Facility Name,Age Group,Zip Code - 3 digits,Gender,Race,Ethnicity,Length of Stay,Type of Admission,Patient Disposition,Discharge Year,CCS Diagnosis Code,CCS Diagnosis Description,CCS Procedure Code,CCS Procedure Description,APR DRG Code,APR DRG Description,APR MDC Code,APR MDC Description,APR Severity of Illness Code,APR Severity of Illness Description,APR Risk of Mortality,APR Medical Surgical Description,Payment Typology 1,Payment Typology 2,Payment Typology 3,Birth Weight,Abortion Edit Indicator,Emergency Department Indicator,Total Charges,Total Costs
New York City,Manhattan,7002053,001463,NYU Langone Hospitals,70 or Older,113,M,White,Not Span/Hispanic,15,Emergency,Home w/ Home Health Services,2020,DIG024,POSTPROCEDURAL OR POSTOPERATIVE DIGESTIVE SYSTEM COMPLICATION,GIS009,COLECTOMY,792,EXTENSIVE OR PROCEDURES FOR OTHER COMPLICATIONS OF TREATMENT,21,"INJURIES, POISONINGS AND TOXIC EFFECTS OF DRUGS",4,Extreme,Extreme,Surgical,Medicare,Medicaid,,,,Y,396410.8,116543.46
New York City,Manhattan,7002053,001463,NYU Langone Hospitals,70 or Older,117,M,White,Not Span/Hispanic,4,Elective,Home w/ Home Health Services,2020,INJ037,"COMPLICATION OF OTHER SURGICAL OR MEDICAL CARE, INJURY, INITIAL ENCOUNTER",GIS018,ILEOSTOMY AND COLOSTOMY,792,EXTENSIVE OR PROCEDURES FOR OTHER COMPLICATIONS OF TREATMENT,21,"INJURIES, POISONINGS AND TOXIC EFFECTS OF DRUGS",1,Minor,Minor,Surgical,Medicare,Blue Cross/Blue Shield,,,,N,290704.97,48337.77
New York City,Manhattan,7002053,001463,NYU Langone Hospitals,0 to 17,100,M,White,Not Span/Hispanic,1,Elective,Home or Self Care,2020,INJ037,"COMPLICATION OF OTHER SURGICAL OR MEDICAL CARE, INJURY, INITIAL ENCOUNTER",CNS014,"CNS PROCEDURES, NEC",792,EXTENSIVE OR PROCEDURES FOR OTHER COMPLICATIONS OF TREATMENT,21,"INJURIES, POISONINGS AND TOXIC EFFECTS OF DRUGS",2,Moderate,Moderate,Surgical,Private Health Insurance,,,,,N,48377.03,11117.37
New York City,Manhattan,7002053,001463,NYU Langone Hospitals,18 to 29,114,M,White,Not Span/Hispanic,4,Elective,Inpatient Rehabilitation Facility,2020,MUS037,POSTPROCEDURAL OR POSTOPERATIVE MUSCULOSKELETAL SYSTEM COMPLICATION,MST010,FEMUR FIXATION,792,EXTENSIVE OR PROCEDURES FOR OTHER COMPLICATIONS OF TREATMENT,21,"INJURIES, POISONINGS AND TOXIC EFFECTS OF DRUGS",2,Moderate,Minor,Surgical,Medicaid,,,,,N,226218.11,40233.79
New York City,Manhattan,7002053,001463,NYU Langone Hospitals,70 or Older,100,M,White,Spanish/Hispanic,14,Elective,Inpatient Rehabilitation Facility,2020,INJ037,"COMPLICATION OF OTHER SURGICAL OR MEDICAL CARE, INJURY, INITIAL ENCOUNTER",MST018,BONE EXCISION,792,EXTENSIVE OR PROCEDURES FOR OTHER COMPLICATIONS OF TREATMENT,21,"INJURIES, POISONINGS AND TOXIC EFFECTS OF DRUGS",3,Major,Moderate,Surgical,Medicare,Private Health Insurance,,,,N,640468.56,153264.73
New York City,Manhattan,7002053,001463,NYU Langone Hospitals,30 to 49,104,M,Other Race,Not Span/Hispanic,19,Emergency,Home w/ Home Health Services,2020,INJ021,"EFFECT OF OTHER EXTERNAL CAUSES, INITIAL ENCOUNTER",MST023,TOE AND MID FOOT AMPUTATION,792,EXTENSIVE OR PROCEDURES FOR OTHER COMPLICATIONS OF TREATMENT,21,"INJURIES, POISONINGS AND TOXIC EFFECTS OF DRUGS",3,Major,Minor,Surgical,Medicaid,,,,,Y,262673.98,69667.74
New York City,Manhattan,7002053,001463,NYU Langone Hospitals,0 to 17,OOS,M,White,Not Span/Hispanic,1,Emergency,Home or Self Care,2020,INJ037,"COMPLICATION OF OTHER SURGICAL OR MEDICAL CARE, INJURY, INITIAL ENCOUNTER",CNS013,SPINAL EPIDURAL CATHETER PLACEMENT,792,EXTENSIVE OR PROCEDURES FOR OTHER COMPLICATIONS OF TREATMENT,21,"INJURIES, POISONINGS AND TOXIC EFFECTS OF DRUGS",2,Moderate,Minor,Surgical,Blue Cross/Blue Shield,,,,,Y,54239.78,9557.93
New York City,Manhattan,7002053,001463,NYU Langone Hospitals,50 to 69,111,F,White,Not Span/Hispanic,6,Elective,Home w/ Home Health Services,2020,INJ037,"COMPLICATION OF OTHER SURGICAL OR MEDICAL CARE, INJURY, INITIAL ENCOUNTER",FRS007,FEMALE GENITAL TRACT REPAIR (EXCLUDING VULVA),792,EXTENSIVE OR PROCEDURES FOR OTHER COMPLICATIONS OF TREATMENT,21,"INJURIES, POISONINGS AND TOXIC EFFECTS OF DRUGS",2,Moderate,Minor,Surgical,Private Health Insurance,,,,,N,203402.66,38391.35
New York City,Manhattan,7002053,001463,NYU Langone Hospitals,70 or Older,100,F,White,Spanish/Hispanic,7,Urgent,Hospice - Medical Facility,2020,CIR038,POSTPROCEDURAL OR POSTOPERATIVE CIRCULATORY SYSTEM COMPLICATION,HEP001,LIVER BIOPSY,792,EXTENSIVE OR PROCEDURES FOR OTHER COMPLICATIONS OF TREATMENT,21,"INJURIES, POISONINGS AND TOXIC EFFECTS OF DRUGS",4,Extreme,Extreme,Surgical,Medicare,Medicaid,,,,N,288093.26,67650.69
New York City,Manhattan,7002053,001463,NYU Langone Hospitals,50 to 69,112,M,White,Not Span/Hispanic,6,Emergency,Home or Self Care,2020,INJ037,"COMPLICATION OF OTHER SURGICAL OR MEDICAL CARE, INJURY, INITIAL ENCOUNTER",RES008,"LUNG, PLEURA, OR DIAPHRAGM RESECTION (OPEN AND THORACOSCOPIC)",792,EXTENSIVE OR PROCEDURES FOR OTHER COMPLICATIONS OF TREATMENT,21,"INJURIES, POISONINGS AND TOXIC EFFECTS OF DRUGS",3,Major,Moderate,Surgical,Medicare,Blue Cross/Blue Shield,,,,Y,136916.58,30887.95
New York City,Manhattan,7002053,001463,NYU Langone Hospitals,30 to 49,112,M,White,Not Span/Hispanic,3,Emergency,Home w/ Home Health Services,2020,INJ037,"COMPLICATION OF OTHER SURGICAL OR MEDICAL CARE, INJURY, INITIAL ENCOUNTER",CNS007,CNS EXCISION PROCEDURES,792,EXTENSIVE OR PROCEDURES FOR OTHER COMPLICATIONS OF TREATMENT,21,"INJURIES, POISONINGS AND TOXIC EFFECTS OF DRUGS",2,Moderate,Moderate,Surgical,Medicaid,,,,,N,113336.83,27868.07
New York City,Manhattan,7002053,001463,NYU Langone Hospitals,50 to 69,112,F,White,Not Span/Hispanic,14,Emergency,Home w/ Home Health Services,2020,INJ037,"COMPLICATION OF OTHER SURGICAL OR MEDICAL CARE, INJURY, INITIAL ENCOUNTER",GIS009,COLECTOMY,792,EXTENSIVE OR PROCEDURES FOR OTHER COMPLICATIONS OF TREATMENT,21,"INJURIES, POISONINGS AND TOXIC EFFECTS OF DRUGS",4,Extreme,Major,Surgical,Private Health Insurance,Blue Cross/Blue Shield,Medicare,,,Y,295558.22,67581.08
New York City,Manhattan,7002053,001463,NYU Langone Hospitals,18 to 29,112,M,White,Unknown,6,Emergency,Home or Self Care,2020,INJ037,"COMPLICATION OF OTHER SURGICAL OR MEDICAL CARE, INJURY, INITIAL ENCOUNTER",CNS013,SPINAL EPIDURAL CATHETER PLACEMENT,792,EXTENSIVE OR PROCEDURES FOR OTHER COMPLICATIONS OF TREATMENT,21,"INJURIES, POISONINGS AND TOXIC EFFECTS OF DRUGS",4,Extreme,Major,Surgical,Medicaid,,,,,Y,170579.77,48883.99
New York City,Manhattan,7002053,001463,NYU Langone Hospitals,30 to 49,OOS,F,White,Not Span/Hispanic,8,Elective,Home w/ Home Health Services,2020,INJ037,"COMPLICATION OF OTHER SURGICAL OR MEDICAL CARE, INJURY, INITIAL ENCOUNTER",MST029,"MUSCULOSKELETAL DEVICE PROCEDURES, NEC",792,EXTENSIVE OR PROCEDURES FOR OTHER COMPLICATIONS OF TREATMENT,21,"INJURIES, POISONINGS AND TOXIC EFFECTS OF DRUGS",4,Extreme,Moderate,Surgical,Medicare,,,,,N,416994.23,73448.11
New York City,Manhattan,7002053,001463,NYU Langone Hospitals,70 or Older,OOS,F,White,Not Span/Hispanic,8,Elective,Home or Self Care,2020,INJ037,"COMPLICATION OF OTHER SURGICAL OR MEDICAL CARE, INJURY, INITIAL ENCOUNTER",GIS011,SMALL BOWEL RESECTION,792,EXTENSIVE OR PROCEDURES FOR OTHER COMPLICATIONS OF TREATMENT,21,"INJURIES, POISONINGS AND TOXIC EFFECTS OF DRUGS",3,Major,Moderate,Surgical,Blue Cross/Blue Shield,Medicare,,,,N,160215.08,42937.11
New York City,Manhattan,7002053,001463,NYU Langone Hospitals,18 to 29,104,F,Other Race,Spanish/Hispanic,16,Emergency,Skilled Nursing Home,2020,INJ037,"COMPLICATION OF OTHER SURGICAL OR MEDICAL CARE, INJURY, INITIAL ENCOUNTER",GIS018,ILEOSTOMY AND COLOSTOMY,792,EXTENSIVE OR PROCEDURES FOR OTHER COMPLICATIONS OF TREATMENT,21,"INJURIES, POISONINGS AND TOXIC EFFECTS OF DRUGS",4,Extreme,Major,Surgical,Medicaid,,,,,Y,317350.8,78307.39
New York City,Manhattan,7002053,001463,NYU Langone Hospitals,50 to 69,105,F,White,Not Span/Hispanic,1,Emergency,Home or Self Care,2020,DIG024,POSTPROCEDURAL OR POSTOPERATIVE DIGESTIVE SYSTEM COMPLICATION,CAR010,LIGATION AND EMBOLIZATION OF VESSELS,792,EXTENSIVE OR PROCEDURES FOR OTHER COMPLICATIONS OF TREATMENT,21,"INJURIES, POISONINGS AND TOXIC EFFECTS OF DRUGS",3,Major,Major,Surgical,Private Health Insurance,Medicare,,,,Y,123136.14,21655.5
New York City,Manhattan,7002053,001463,NYU Langone Hospitals,30 to 49,113,M,Other Race,Not Span/Hispanic,6,Emergency,Home or Self Care,2020,INJ037,"COMPLICATION OF OTHER SURGICAL OR MEDICAL CARE, INJURY, INITIAL ENCOUNTER",CAR010,LIGATION AND EMBOLIZATION OF VESSELS,792,EXTENSIVE OR PROCEDURES FOR OTHER COMPLICATIONS OF TREATMENT,21,"INJURIES, POISONINGS AND TOXIC EFFECTS OF DRUGS",4,Extreme,Major,Surgical,Medicaid,,,,,Y,192033.94,44104.29
New York City,Manhattan,7002053,001463,NYU Langone Hospitals,50 to 69,114,F,Other Race,Not Span/Hispanic,5,Elective,Home or Self Care,2020,INJ037,"COMPLICATION OF OTHER SURGICAL OR MEDICAL CARE, INJURY, INITIAL ENCOUNTER",CAR022,HEART VALVE REPLACEMENT AND OTHER VALVE PROCEDURES (NON-ENDOVASCULAR),792,EXTENSIVE OR PROCEDURES FOR OTHER COMPLICATIONS OF TREATMENT,21,"INJURIES, POISONINGS AND TOXIC EFFECTS OF DRUGS",3,Major,Major,Surgical,Medicaid,,,,,N,442887.84,83743.68
New York City,Manhattan,7002053,001463,NYU Langone Hospitals,50 to 69,100,F,White,Not Span/Hispanic,12,Emergency,Inpatient Rehabilitation Facility,2020,NVS021,POSTPROCEDURAL OR POSTOPERATIVE NERVOUS SYSTEM COMPLICATION,CNS004,INTRACRANIAL EPIDURAL AND SUBDURAL SPACE DRAINAGE,792,EXTENSIVE OR PROCEDURES FOR OTHER COMPLICATIONS OF TREATMENT,21,"INJURIES, POISONINGS AND TOXIC EFFECTS OF DRUGS",4,Extreme,Extreme,Surgical,Private Health Insurance,,,,,Y,342339.05,99696.61
New York City,Manhattan,7002053,001463,NYU Langone Hospitals,50 to 69,OOS,M,Other Race,Unknown,3,Emergency,Home or Self Care,2020,INJ022,"POISONING BY DRUGS, INITIAL ENCOUNTER",CAR004,PERCUTANEOUS CORONARY INTERVENTIONS (PCI),792,EXTENSIVE OR PROCEDURES FOR OTHER COMPLICATIONS OF TREATMENT,21,"INJURIES, POISONINGS AND TOXIC EFFECTS OF DRUGS",3,Major,Extreme,Surgical,Medicaid,,,,,Y,211776.15,40835.14
New York City,Manhattan,7002053,001463,NYU Langone Hospitals,70 or Older,112,M,White,Not Span/Hispanic,20,Emergency,Home w/ Home Health Services,2020,INJ037,"COMPLICATION OF OTHER SURGICAL OR MEDICAL CARE, INJURY, INITIAL ENCOUNTER",OTR004,ISOLATION PROCEDURES,792,EXTENSIVE OR PROCEDURES FOR OTHER COMPLICATIONS OF TREATMENT,21,"INJURIES, POISONINGS AND TOXIC EFFECTS OF DRUGS",4,Extreme,Extreme,Surgical,Medicare,,,,,Y,575043.55,150069.87
New York City,Manhattan,7002053,001463,NYU Langone Hospitals,50 to 69,115,F,Other Race,Not Span/Hispanic,2,Elective,Home w/ Home Health Services,2020,INJ037,"COMPLICATION OF OTHER SURGICAL OR MEDICAL CARE, INJURY, INITIAL ENCOUNTER",MST018,BONE EXCISION,792,EXTENSIVE OR PROCEDURES FOR OTHER COMPLICATIONS OF TREATMENT,21,"INJURIES, POISONINGS AND TOXIC EFFECTS OF DRUGS",3,Major,Moderate,Surgical,Blue Cross/Blue Shield,Medicare,,,,N,85635.55,17881.2
New York City,Manhattan,7002053,001463,NYU Langone Hospitals,50 to 69,113,F,Other Race,Not Span/Hispanic,2,Elective,Home w/ Home Health Services,2020,INJ037,"COMPLICATION OF OTHER SURGICAL OR MEDICAL CARE, INJURY, INITIAL ENCOUNTER",SKB007,SKIN GRAFT,792,EXTENSIVE OR PROCEDURES FOR OTHER COMPLICATIONS OF TREATMENT,21,"INJURIES, POISONINGS AND TOXIC EFFECTS OF DRUGS",2,Moderate,Moderate,Surgical,Medicare,Medicaid,,,,N,103527.24,19730.78
New York City,Manhattan,7002053,001463,NYU Langone Hospitals,70 or Older,OOS,M,White,Unknown,7,Elective,Home w/ Home Health Services,2020,INJ037,"COMPLICATION OF OTHER SURGICAL OR MEDICAL CARE, INJURY, INITIAL ENCOUNTER",GIS013,PROCTECTOMY OR ANAL RESECTION,792,EXTENSIVE OR PROCEDURES FOR OTHER COMPLICATIONS OF TREATMENT,21,"INJURIES, POISONINGS AND TOXIC EFFECTS OF DRUGS",2,Moderate,Minor,Surgical,Medicare,Medicare,,,,N,280059.84,59646.53
New York City,Manhattan,7002053,001463,NYU Langone Hospitals,50 to 69,OOS,M,White,Not Span/Hispanic,18,Emergency,Inpatient Rehabilitation Facility,2020,INJ037,"COMPLICATION OF OTHER SURGICAL OR MEDICAL CARE, INJURY, INITIAL ENCOUNTER",MST024,BELOW KNEE AMPUTATION,792,EXTENSIVE OR PROCEDURES FOR OTHER COMPLICATIONS OF TREATMENT,21,"INJURIES, POISONINGS AND TOXIC EFFECTS OF DRUGS",3,Major,Major,Surgical,Medicaid,,,,,N,455082.33,116888.38
New York City,Manhattan,7002053,001463,NYU Langone Hospitals,70 or Older,OOS,F,White,Not Span/Hispanic,26,Elective,Home w/ Home Health Services,2020,INJ037,"COMPLICATION OF OTHER SURGICAL OR MEDICAL CARE, INJURY, INITIAL ENCOUNTER",GIS018,ILEOSTOMY AND COLOSTOMY,792,EXTENSIVE OR PROCEDURES FOR OTHER COMPLICATIONS OF TREATMENT,21,"INJURIES, POISONINGS AND TOXIC EFFECTS OF DRUGS",4,Extreme,Extreme,Surgical,Medicare,Blue Cross/Blue Shield,,,,N,911281.37,218584.08
New York City,Manhattan,7002053,001463,NYU Langone Hospitals,70 or Older,112,F,White,Not Span/Hispanic,5,Elective,Home w/ Home Health Services,2020,INJ036,"COMPLICATION OF TRANSPLANTED ORGANS OR TISSUE, INITIAL ENCOUNTER",SKB007,SKIN GRAFT,792,EXTENSIVE OR PROCEDURES FOR OTHER COMPLICATIONS OF TREATMENT,21,"INJURIES, POISONINGS AND TOXIC EFFECTS OF DRUGS",1,Minor,Minor,Surgical,Medicare,Blue Cross/Blue Shield,,,,N,223448.18,46816.21
New York City,Manhattan,7002053,001463,NYU Langone Hospitals,0 to 17,112,F,White,Not Span/Hispanic,4,Emergency,Home or Self Care,2020,INJ037,"COMPLICATION OF OTHER SURGICAL OR MEDICAL CARE, INJURY, INITIAL ENCOUNTER",CNS010,CEREBROSPINAL FLUID SHUNT PROCEDURES,792,EXTENSIVE OR PROCEDURES FOR OTHER COMPLICATIONS OF TREATMENT,21,"INJURIES, POISONINGS AND TOXIC EFFECTS OF DRUGS",3,Major,Moderate,Surgical,Blue Cross/Blue Shield,Medicaid,,,,Y,131553.11,27282.52
New York City,Manhattan,7002053,001463,NYU Langone Hospitals,18 to 29,109,F,White,Not Span/Hispanic,2,Emergency,Home or Self Care,2020,INJ037,"COMPLICATION OF OTHER SURGICAL OR MEDICAL CARE, INJURY, INITIAL ENCOUNTER",CNS014,"CNS PROCEDURES, NEC",792,EXTENSIVE OR PROCEDURES FOR OTHER COMPLICATIONS OF TREATMENT,21,"INJURIES, POISONINGS AND TOXIC EFFECTS OF DRUGS",1,Minor,Minor,Surgical,Medicaid,,,,,Y,79811.71,14819.48
New York City,Manhattan,7002053,001463,NYU Langone Hospitals,70 or Older,100,M,White,Not Span/Hispanic,6,Emergency,Home or Self Care,2020,DIG024,POSTPROCEDURAL OR POSTOPERATIVE DIGESTIVE SYSTEM COMPLICATION,CAR010,LIGATION AND EMBOLIZATION OF VESSELS,792,EXTENSIVE OR PROCEDURES FOR OTHER COMPLICATIONS OF TREATMENT,21,"INJURIES, POISONINGS AND TOXIC EFFECTS OF DRUGS",3,Major,Major,Surgical,Private Health Insurance,,,,,Y,351830.16,73626.75
New York City,Manhattan,7002053,001463,NYU Langone Hospitals,0 to 17,109,M,White,Not Span/Hispanic,7,Elective,Home w/ Home Health Services,2020,INJ037,"COMPLICATION OF OTHER SURGICAL OR MEDICAL CARE, INJURY, INITIAL ENCOUNTER",GIS025,OTHER GI SYSTEM DEVICE PROCEDURES,792,EXTENSIVE OR PROCEDURES FOR OTHER COMPLICATIONS OF TREATMENT,21,"INJURIES, POISONINGS AND TOXIC EFFECTS OF DRUGS",1,Minor,Minor,Surgical,Medicare,,,,,N,151907.9,33557.14
New York City,Manhattan,7002053,001463,NYU Langone Hospitals,70 or Older,112,M,Black/African American,Not Span/Hispanic,48,Elective,Skilled Nursing Home,2020,INJ037,"COMPLICATION OF OTHER SURGICAL OR MEDICAL CARE, INJURY, INITIAL ENCOUNTER",URN009,CYSTECTOMY (INCLUDING FULGURATION) AND URETHRECTOMY,792,EXTENSIVE OR PROCEDURES FOR OTHER COMPLICATIONS OF TREATMENT,21,"INJURIES, POISONINGS AND TOXIC EFFECTS OF DRUGS",4,Extreme,Extreme,Surgical,Medicare,Medicaid,,,,N,1472701.48,355429.13
New York City,Manhattan,7002053,001463,NYU Langone Hospitals,70 or Older,100,M,White,Not Span/Hispanic,8,Emergency,Home w/ Home Health Services,2020,INJ037,"COMPLICATION OF OTHER SURGICAL OR MEDICAL CARE, INJURY, INITIAL ENCOUNTER",RES001,BRONCHOSCOPY (DIAGNOSTIC),792,EXTENSIVE OR PROCEDURES FOR OTHER COMPLICATIONS OF TREATMENT,21,"INJURIES, POISONINGS AND TOXIC EFFECTS OF DRUGS",4,Extreme,Major,Surgical,Medicare,Medicare,,,,Y,310818.58,72794.88
New York City,Manhattan,7002053,001463,NYU Langone Hospitals,18 to 29,100,F,Other Race,Not Span/Hispanic,5,Emergency,Home or Self Care,2020,NVS021,POSTPROCEDURAL OR POSTOPERATIVE NERVOUS SYSTEM COMPLICATION,CNS004,INTRACRANIAL EPIDURAL AND SUBDURAL SPACE DRAINAGE,792,EXTENSIVE OR PROCEDURES FOR OTHER COMPLICATIONS OF TREATMENT,21,"INJURIES, POISONINGS AND TOXIC EFFECTS OF DRUGS",2,Moderate,Moderate,Surgical,Blue Cross/Blue Shield,,,,,Y,225771.93,46797.42
New York City,Manhattan,7002053,001463,NYU Langone Hospitals,70 or Older,105,F,White,Not Span/Hispanic,14,Elective,Home w/ Home Health Services,2020,INJ037,"COMPLICATION OF OTHER SURGICAL OR MEDICAL CARE, INJURY, INITIAL ENCOUNTER",GIS018,ILEOSTOMY AND COLOSTOMY,792,EXTENSIVE OR PROCEDURES FOR OTHER COMPLICATIONS OF TREATMENT,21,"INJURIES, POISONINGS AND TOXIC EFFECTS OF DRUGS",3,Major,Moderate,Surgical,Medicare,,,,,N,457250.21,103489.1
New York City,Manhattan,7002053,001463,NYU Langone Hospitals,30 to 49,OOS,M,White,Unknown,1,Elective,Home or Self Care,2020,GEN026,POSTPROCEDURAL OR POSTOPERATIVE GENITOURINARY SYSTEM COMPLICATION,URN010,URINARY DIVERSION WITH ANASTOMOSIS OR OSTOMY,792,EXTENSIVE OR PROCEDURES FOR OTHER COMPLICATIONS OF TREATMENT,21,"INJURIES, POISONINGS AND TOXIC EFFECTS OF DRUGS",2,Moderate,Minor,Surgical,Blue Cross/Blue Shield,,,,,N,168970.62,25916.67
New York City,Manhattan,7002053,001463,NYU Langone Hospitals,50 to 69,112,F,Black/African American,Not Span/Hispanic,2,Elective,Home or Self Care,2020,INJ037,"COMPLICATION OF OTHER SURGICAL OR MEDICAL CARE, INJURY, INITIAL ENCOUNTER",CAR014,PERIPHERAL ARTERIAL BYPASS PROCEDURES,792,EXTENSIVE OR PROCEDURES FOR OTHER COMPLICATIONS OF TREATMENT,21,"INJURIES, POISONINGS AND TOXIC EFFECTS OF DRUGS",2,Moderate,Minor,Surgical,Medicaid,,,,,N,136357.54,24658.71
New York City,Manhattan,7002053,001463,NYU Langone Hospitals,50 to 69,100,F,Black/African American,Not Span/Hispanic,48,Emergency,Skilled Nursing Home,2020,INJ022,"POISONING BY DRUGS, INITIAL ENCOUNTER",GIS019,GASTRO-JEJUNAL BYPASS (INCLUDING BARIATRIC),792,EXTENSIVE OR PROCEDURES FOR OTHER COMPLICATIONS OF TREATMENT,21,"INJURIES, POISONINGS AND TOXIC EFFECTS OF DRUGS",4,Extreme,Extreme,Surgical,Medicaid,,,,,Y,1444134.35,346671.46
New York City,Manhattan,7002053,001463,NYU Langone Hospitals,50 to 69,119,M,Other Race,Not Span/Hispanic,4,Elective,Home or Self Care,2020,INJ037,"COMPLICATION OF OTHER SURGICAL OR MEDICAL CARE, INJURY, INITIAL ENCOUNTER",GNR006,"CHEST WALL PROCEDURES, NEC",792,EXTENSIVE OR PROCEDURES FOR OTHER COMPLICATIONS OF TREATMENT,21,"INJURIES, POISONINGS AND TOXIC EFFECTS OF DRUGS",2,Moderate,Major,Surgical,Medicaid,,,,,N,180946.63,35551.13
New York City,Manhattan,7002053,001463,NYU Langone Hospitals,70 or Older,101,F,White,Not Span/Hispanic,35,Emergency,Inpatient Rehabilitation Facility,2020,DIG024,POSTPROCEDURAL OR POSTOPERATIVE DIGESTIVE SYSTEM COMPLICATION,GIS011,SMALL BOWEL RESECTION,792,EXTENSIVE OR PROCEDURES FOR OTHER COMPLICATIONS OF TREATMENT,21,"INJURIES, POISONINGS AND TOXIC EFFECTS OF DRUGS",4,Extreme,Extreme,Surgical,Medicare,Blue Cross/Blue Shield,,,,Y,770165.28,217789.13
New York City,Manhattan,7002053,001463,NYU Langone Hospitals,70 or Older,100,M,Black/African American,Not Span/Hispanic,5,Emergency,Home w/ Home Health Services,2020,NVS021,POSTPROCEDURAL OR POSTOPERATIVE NERVOUS SYSTEM COMPLICATION,MST013,SPINE FUSION,792,EXTENSIVE OR PROCEDURES FOR OTHER COMPLICATIONS OF TREATMENT,21,"INJURIES, POISONINGS AND TOXIC EFFECTS OF DRUGS",2,Moderate,Moderate,Surgical,Medicare,Medicare,,,,Y,146016.95,35155.78
New York City,Manhattan,7002053,001463,NYU Langone Hospitals,50 to 69,103,F,White,Not Span/Hispanic,10,Emergency,Home or Self Care,2020,DIG024,POSTPROCEDURAL OR POSTOPERATIVE DIGESTIVE SYSTEM COMPLICATION,GIS009,COLECTOMY,792,EXTENSIVE OR PROCEDURES FOR OTHER COMPLICATIONS OF TREATMENT,21,"INJURIES, POISONINGS AND TOXIC EFFECTS OF DRUGS",4,Extreme,Major,Surgical,Private Health Insurance,,,,,Y,231931.68,63181.51
New York City,Manhattan,7002053,001463,NYU Langone Hospitals,30 to 49,117,M,White,Not Span/Hispanic,2,Elective,Home or Self Care,2020,INJ037,"COMPLICATION OF OTHER SURGICAL OR MEDICAL CARE, INJURY, INITIAL ENCOUNTER",MST012,BONE FIXATION (EXCLUDING EXTREMITIES),792,EXTENSIVE OR PROCEDURES FOR OTHER COMPLICATIONS OF TREATMENT,21,"INJURIES, POISONINGS AND TOXIC EFFECTS OF DRUGS",1,Minor,Minor,Surgical,Medicare,,,,,N,281437.89,45200.88
New York City,Manhattan,7002053,001463,NYU Langone Hospitals,50 to 69,117,F,White,Not Span/Hispanic,4,Emergency,Home w/ Home Health Services,2020,INJ037,"COMPLICATION OF OTHER SURGICAL OR MEDICAL CARE, INJURY, INITIAL ENCOUNTER",CNS013,SPINAL EPIDURAL CATHETER PLACEMENT,792,EXTENSIVE OR PROCEDURES FOR OTHER COMPLICATIONS OF TREATMENT,21,"INJURIES, POISONINGS AND TOXIC EFFECTS OF DRUGS",2,Moderate,Moderate,Surgical,Medicare,Private Health Insurance,,,,N,402849.24,72340.65
New York City,Manhattan,7002053,001463,NYU Langone Hospitals,70 or Older,100,F,White,Not Span/Hispanic,1,Elective,Home or Self Care,2020,INJ037,"COMPLICATION OF OTHER SURGICAL OR MEDICAL CARE, INJURY, INITIAL ENCOUNTER",MST028,"SUBCUTANEOUS TISSUE AND FASCIA PROCEDURES, NEC",792,EXTENSIVE OR PROCEDURES FOR OTHER COMPLICATIONS OF TREATMENT,21,"INJURIES, POISONINGS AND TOXIC EFFECTS OF DRUGS",2,Moderate,Moderate,Surgical,Medicare,Blue Cross/Blue Shield,,,,N,69955.98,12883.64
New York City,Manhattan,7002053,001463,NYU Langone Hospitals,30 to 49,113,M,White,Not Span/Hispanic,11,Elective,Expired,2020,GEN026,POSTPROCEDURAL OR POSTOPERATIVE GENITOURINARY SYSTEM COMPLICATION,URN002,KIDNEY AND OTHER URINARY TRACT BIOPSY (NON-ENDOSCOPIC),792,EXTENSIVE OR PROCEDURES FOR OTHER COMPLICATIONS OF TREATMENT,21,"INJURIES, POISONINGS AND TOXIC EFFECTS OF DRUGS",4,Extreme,Extreme,Surgical,Medicaid,,,,,N,577604.65,121292.81
New York City,Manhattan,7002053,001463,NYU Langone Hospitals,70 or Older,OOS,M,White,Not Span/Hispanic,2,Elective,Home or Self Care,2020,INJ037,"COMPLICATION OF OTHER SURGICAL OR MEDICAL CARE, INJURY, INITIAL ENCOUNTER",CNS014,"CNS PROCEDURES, NEC",792,EXTENSIVE OR PROCEDURES FOR OTHER COMPLICATIONS OF TREATMENT,21,"INJURIES, POISONINGS AND TOXIC EFFECTS OF DRUGS",1,Minor,Minor,Surgical,Medicare,Medicare,,,,N,126814.05,23983.04
New York City,Manhattan,7002053,001463,NYU Langone Hospitals,0 to 17,112,M,White,Spanish/Hispanic,1,Elective,Home or Self Care,2020,INJ037,"COMPLICATION OF OTHER SURGICAL OR MEDICAL CARE, INJURY, INITIAL ENCOUNTER",MST028,"SUBCUTANEOUS TISSUE AND FASCIA PROCEDURES, NEC",792,EXTENSIVE OR PROCEDURES FOR OTHER COMPLICATIONS OF TREATMENT,21,"INJURIES, POISONINGS AND TOXIC EFFECTS OF DRUGS",3,Major,Moderate,Surgical,Private Health Insurance,Medicaid,,,,N,179800.92,30309.3
