Hospital Service Area,Hospital County,Operating Certificate Number,Permanent Facility Id,Facility Name,Age Group,Zip Code - 3 digits,Gender,Race,Ethnicity,Length of Stay,Type of Admission,Patient Disposition,Discharge Year,CCS Diagnosis Code,CCS Diagnosis Description,CCS Procedure Code,CCS Procedure Description,APR DRG Code,APR DRG Description,APR MDC Code,APR MDC Description,APR Severity of Illness Code,APR Severity of Illness Description,APR Risk of Mortality,APR Medical Surgical Description,Payment Typology 1,Payment Typology 2,Payment Typology 3,Birth Weight,Abortion Edit Indicator,Emergency Department Indicator,Total Charges,Total Costs
New York City,Manhattan,7002053,001463,NYU Langone Hospitals,70 or Older,115,F,White,Not Span/Hispanic,2,Emergency,Home w/ Home Health Services,2019,INJ037,"COMPLICATION OF OTHER SURGICAL OR MEDICAL CARE, INJURY, INITIAL ENCOUNTER",GNR005,CONTROL OF BLEEDING (NON-ENDOSCOPIC),793,MODERATELY EXTENSIVE OR PROCEDURES FOR OTHER COMPLICATIONS OF TREATMENT,21,"INJURIES, POISONINGS AND TOXIC EFFECTS OF DRUGS",2,Moderate,Moderate,Surgical,Medicare,Private Health Insurance,,,,true,42779.89,15275.22
New York City,Manhattan,7002053,001463,NYU Langone Hospitals,70 or Older,109,M,White,Not Span/Hispanic,2,Elective,Home w/ Home Health Services,2019,INJ037,"COMPLICATION OF OTHER SURGICAL OR MEDICAL CARE, INJURY, INITIAL ENCOUNTER",URN007,URINARY TRACT REPAIR,793,MODERATELY EXTENSIVE OR PROCEDURES FOR OTHER COMPLICATIONS OF TREATMENT,21,"INJURIES, POISONINGS AND TOXIC EFFECTS OF DRUGS",1,Minor,Minor,Surgical,Medicare,Private Health Insurance,,,,false,108189.43,20370
New York City,Manhattan,7002053,001463,NYU Langone Hospitals,18 to 29,OOS,M,White,Not Span/Hispanic,7,Emergency,Home w/ Home Health Services,2019,DIG024,POSTPROCEDURAL OR POSTOPERATIVE DIGESTIVE SYSTEM COMPLICATION,GIS024,OTHER PERITONEAL CAVITY PROCEDURES,793,MODERATELY EXTENSIVE OR PROCEDURES FOR OTHER COMPLICATIONS OF TREATMENT,21,"INJURIES, POISONINGS AND TOXIC EFFECTS OF DRUGS",3,Major,Moderate,Surgical,Private Health Insurance,,,,,true,115872.9,32170.35
New York City,Manhattan,7002053,001463,NYU Langone Hospitals,50 to 69,112,M,Black/African American,Not Span/Hispanic,6,Emergency,Home w/ Home Health Services,2019,INJ037,"COMPLICATION OF OTHER SURGICAL OR MEDICAL CARE, INJURY, INITIAL ENCOUNTER",GNR002,ABDOMINAL WALL REPAIR (INCLUDING HERNIA),793,MODERATELY EXTENSIVE OR PROCEDURES FOR OTHER COMPLICATIONS OF TREATMENT,21,"INJURIES, POISONINGS AND TOXIC EFFECTS OF DRUGS",3,Major,Moderate,Surgical,Private Health Insurance,,,,,false,144957.67,30162.68
New York City,Manhattan,7002053,001463,NYU Langone Hospitals,50 to 69,113,F,Other Race,Not Span/Hispanic,5,Emergency,Home w/ Home Health Services,2019,SKN006,POSTPROCEDURAL OR POSTOPERATIVE SKIN COMPLICATION,MST005,INCISION AND DRAINAGE OF SUBCUTANEOUS TISSUE AND FASCIA,793,MODERATELY EXTENSIVE OR PROCEDURES FOR OTHER COMPLICATIONS OF TREATMENT,21,"INJURIES, POISONINGS AND TOXIC EFFECTS OF DRUGS",2,Moderate,Minor,Surgical,Medicaid,,,,,true,133467.32,32390.49
New York City,Manhattan,7002053,001463,NYU Langone Hospitals,50 to 69,112,F,White,Not Span/Hispanic,4,Emergency,Home w/ Home Health Services,2019,CIR038,POSTPROCEDURAL OR POSTOPERATIVE CIRCULATORY SYSTEM COMPLICATION,MST028,"SUBCUTANEOUS TISSUE AND FASCIA PROCEDURES, NEC",793,MODERATELY EXTENSIVE OR PROCEDURES FOR OTHER COMPLICATIONS OF TREATMENT,21,"INJURIES, POISONINGS AND TOXIC EFFECTS OF DRUGS",2,Moderate,Major,Surgical,Medicaid,,,,,true,98916.43,22681.64
New York City,Manhattan,7002053,001463,NYU Langone Hospitals,50 to 69,111,M,White,Not Span/Hispanic,1,Emergency,Home or Self Care,2019,RSP017,POSTPROCEDURAL OR POSTOPERATIVE RESPIRATORY SYSTEM COMPLICATION,GNR004,ENDOSCOPIC CONTROL OF BLEEDING,793,MODERATELY EXTENSIVE OR PROCEDURES FOR OTHER COMPLICATIONS OF TREATMENT,21,"INJURIES, POISONINGS AND TOXIC EFFECTS OF DRUGS",1,Minor,Minor,Surgical,Private Health Insurance,,,,,true,60280.74,18359.86
New York City,Manhattan,7002053,001463,NYU Langone Hospitals,50 to 69,100,F,White,Not Span/Hispanic,7,Emergency,Home or Self Care,2019,INJ037,"COMPLICATION OF OTHER SURGICAL OR MEDICAL CARE, INJURY, INITIAL ENCOUNTER",MST005,INCISION AND DRAINAGE OF SUBCUTANEOUS TISSUE AND FASCIA,793,MODERATELY EXTENSIVE OR PROCEDURES FOR OTHER COMPLICATIONS OF TREATMENT,21,"INJURIES, POISONINGS AND TOXIC EFFECTS OF DRUGS",2,Moderate,Moderate,Surgical,Medicare,Medicare,,,,true,91826.84,29735.44
New York City,Manhattan,7002053,001463,NYU Langone Hospitals,50 to 69,100,M,White,Not Span/Hispanic,1,Elective,Home or Self Care,2019,INJ037,"COMPLICATION OF OTHER SURGICAL OR MEDICAL CARE, INJURY, INITIAL ENCOUNTER",LYM011,"LYMPHATIC PROCEDURES, NEC",793,MODERATELY EXTENSIVE OR PROCEDURES FOR OTHER COMPLICATIONS OF TREATMENT,21,"INJURIES, POISONINGS AND TOXIC EFFECTS OF DRUGS",2,Moderate,Minor,Surgical,Private Health Insurance,,,,,false,60535.39,11251.75
New York City,Manhattan,7002053,001463,NYU Langone Hospitals,70 or Older,100,F,White,Not Span/Hispanic,1,Elective,Home or Self Care,2019,INJ037,"COMPLICATION OF OTHER SURGICAL OR MEDICAL CARE, INJURY, INITIAL ENCOUNTER",MST020,SUBCUTANEOUS TISSUE AND FASCIA EXCISION,793,MODERATELY EXTENSIVE OR PROCEDURES FOR OTHER COMPLICATIONS OF TREATMENT,21,"INJURIES, POISONINGS AND TOXIC EFFECTS OF DRUGS",2,Moderate,Moderate,Surgical,Medicaid,,,,,false,43818.73,11435.32
New York City,Manhattan,7002053,001463,NYU Langone Hospitals,30 to 49,,F,Other Race,Spanish/Hispanic,1,Elective,Home w/ Home Health Services,2019,MUS037,POSTPROCEDURAL OR POSTOPERATIVE MUSCULOSKELETAL SYSTEM COMPLICATION,GNR008,"ABDOMINAL WALL PROCEDURES, NEC",793,MODERATELY EXTENSIVE OR PROCEDURES FOR OTHER COMPLICATIONS OF TREATMENT,21,"INJURIES, POISONINGS AND TOXIC EFFECTS OF DRUGS",2,Moderate,Minor,Surgical,Medicaid,,,,,false,114702.51,19170.97
New York City,Manhattan,7002053,001463,NYU Langone Hospitals,30 to 49,113,F,Multi-racial,Spanish/Hispanic,2,Emergency,Home or Self Care,2019,INJ037,"COMPLICATION OF OTHER SURGICAL OR MEDICAL CARE, INJURY, INITIAL ENCOUNTER",MST028,"SUBCUTANEOUS TISSUE AND FASCIA PROCEDURES, NEC",793,MODERATELY EXTENSIVE OR PROCEDURES FOR OTHER COMPLICATIONS OF TREATMENT,21,"INJURIES, POISONINGS AND TOXIC EFFECTS OF DRUGS",2,Moderate,Minor,Surgical,Medicare,Medicaid,,,,true,83371.4,24763.86
New York City,Manhattan,7002053,001463,NYU Langone Hospitals,30 to 49,112,F,Black/African American,Not Span/Hispanic,2,Elective,Home w/ Home Health Services,2019,CIR038,POSTPROCEDURAL OR POSTOPERATIVE CIRCULATORY SYSTEM COMPLICATION,CAR010,LIGATION AND EMBOLIZATION OF VESSELS,793,MODERATELY EXTENSIVE OR PROCEDURES FOR OTHER COMPLICATIONS OF TREATMENT,21,"INJURIES, POISONINGS AND TOXIC EFFECTS OF DRUGS",2,Moderate,Minor,Surgical,Private Health Insurance,,,,,false,136563.74,26881.6
New York City,Manhattan,7002053,001463,NYU Langone Hospitals,18 to 29,112,M,Multi-racial,Not Span/Hispanic,4,Emergency,Home or Self Care,2019,RSP017,POSTPROCEDURAL OR POSTOPERATIVE RESPIRATORY SYSTEM COMPLICATION,GNR005,CONTROL OF BLEEDING (NON-ENDOSCOPIC),793,MODERATELY EXTENSIVE OR PROCEDURES FOR OTHER COMPLICATIONS OF TREATMENT,21,"INJURIES, POISONINGS AND TOXIC EFFECTS OF DRUGS",2,Moderate,Minor,Surgical,Private Health Insurance,,,,,true,76211.98,20228.97
New York City,Manhattan,7002053,001463,NYU Langone Hospitals,50 to 69,117,M,White,Not Span/Hispanic,2,Emergency,Home or Self Care,2019,MUS037,POSTPROCEDURAL OR POSTOPERATIVE MUSCULOSKELETAL SYSTEM COMPLICATION,CNS008,SPINAL CORD DECOMPRESSION,793,MODERATELY EXTENSIVE OR PROCEDURES FOR OTHER COMPLICATIONS OF TREATMENT,21,"INJURIES, POISONINGS AND TOXIC EFFECTS OF DRUGS",2,Moderate,Minor,Surgical,Blue Cross/Blue Shield,,,,,true,69461.59,13833.62
New York City,Manhattan,7002053,001463,NYU Langone Hospitals,50 to 69,112,F,Black/African American,Not Span/Hispanic,4,Elective,Skilled Nursing Home,2019,INJ037,"COMPLICATION OF OTHER SURGICAL OR MEDICAL CARE, INJURY, INITIAL ENCOUNTER",SKB008,SKIN EXCISION AND DEBRIDEMENT,793,MODERATELY EXTENSIVE OR PROCEDURES FOR OTHER COMPLICATIONS OF TREATMENT,21,"INJURIES, POISONINGS AND TOXIC EFFECTS OF DRUGS",3,Major,Moderate,Surgical,Medicare,Medicaid,,,,false,94318.74,22871.49
New York City,Manhattan,7002053,001463,NYU Langone Hospitals,70 or Older,OOS,F,White,Not Span/Hispanic,3,Emergency,Home or Self Care,2019,INJ037,"COMPLICATION OF OTHER SURGICAL OR MEDICAL CARE, INJURY, INITIAL ENCOUNTER",GIS024,OTHER PERITONEAL CAVITY PROCEDURES,793,MODERATELY EXTENSIVE OR PROCEDURES FOR OTHER COMPLICATIONS OF TREATMENT,21,"INJURIES, POISONINGS AND TOXIC EFFECTS OF DRUGS",2,Moderate,Moderate,Surgical,Medicare,Blue Cross/Blue Shield,,,,true,56760.71,15554.64
New York City,Manhattan,7002053,001463,NYU Langone Hospitals,50 to 69,113,M,Other Race,Not Span/Hispanic,5,Elective,Home w/ Home Health Services,2019,INJ037,"COMPLICATION OF OTHER SURGICAL OR MEDICAL CARE, INJURY, INITIAL ENCOUNTER",ENT003,ENT DIAGNOSTIC PROCEDURES (NON-ENDOSCOPIC),793,MODERATELY EXTENSIVE OR PROCEDURES FOR OTHER COMPLICATIONS OF TREATMENT,21,"INJURIES, POISONINGS AND TOXIC EFFECTS OF DRUGS",2,Moderate,Minor,Surgical,Medicaid,,,,,false,135863.57,29165.79
New York City,Manhattan,7002053,001463,NYU Langone Hospitals,30 to 49,112,M,Multi-racial,Spanish/Hispanic,3,Emergency,Home w/ Home Health Services,2019,INJ037,"COMPLICATION OF OTHER SURGICAL OR MEDICAL CARE, INJURY, INITIAL ENCOUNTER",CAR017,PERICARDIAL PROCEDURES,793,MODERATELY EXTENSIVE OR PROCEDURES FOR OTHER COMPLICATIONS OF TREATMENT,21,"INJURIES, POISONINGS AND TOXIC EFFECTS OF DRUGS",3,Major,Major,Surgical,Medicaid,,,,,true,80741.47,18666.54
New York City,Manhattan,7002053,001463,NYU Langone Hospitals,50 to 69,113,M,White,Not Span/Hispanic,4,Elective,Home or Self Care,2019,INJ037,"COMPLICATION OF OTHER SURGICAL OR MEDICAL CARE, INJURY, INITIAL ENCOUNTER",GNR002,ABDOMINAL WALL REPAIR (INCLUDING HERNIA),793,MODERATELY EXTENSIVE OR PROCEDURES FOR OTHER COMPLICATIONS OF TREATMENT,21,"INJURIES, POISONINGS AND TOXIC EFFECTS OF DRUGS",2,Moderate,Minor,Surgical,Private Health Insurance,Medicare,,,,false,151736.81,24094.36
New York City,Manhattan,7002053,001463,NYU Langone Hospitals,50 to 69,103,F,White,Not Span/Hispanic,17,Emergency,Home w/ Home Health Services,2019,INJ037,"COMPLICATION OF OTHER SURGICAL OR MEDICAL CARE, INJURY, INITIAL ENCOUNTER",CAR028,INFERIOR VENA CAVA (IVC) FILTER PROCEDURES,793,MODERATELY EXTENSIVE OR PROCEDURES FOR OTHER COMPLICATIONS OF TREATMENT,21,"INJURIES, POISONINGS AND TOXIC EFFECTS OF DRUGS",3,Major,Moderate,Surgical,Blue Cross/Blue Shield,,,,,true,337517.75,88369.49
New York City,Manhattan,7002053,001463,NYU Langone Hospitals,30 to 49,100,M,Black/African American,Not Span/Hispanic,6,Emergency,Home or Self Care,2019,INJ037,"COMPLICATION OF OTHER SURGICAL OR MEDICAL CARE, INJURY, INITIAL ENCOUNTER",MST028,"SUBCUTANEOUS TISSUE AND FASCIA PROCEDURES, NEC",793,MODERATELY EXTENSIVE OR PROCEDURES FOR OTHER COMPLICATIONS OF TREATMENT,21,"INJURIES, POISONINGS AND TOXIC EFFECTS OF DRUGS",3,Major,Moderate,Surgical,Medicaid,,,,,false,47383.38,21080.25
New York City,Manhattan,7002053,001463,NYU Langone Hospitals,18 to 29,116,F,Black/African American,Unknown,1,Emergency,Home or Self Care,2019,SKN006,POSTPROCEDURAL OR POSTOPERATIVE SKIN COMPLICATION,MST028,"SUBCUTANEOUS TISSUE AND FASCIA PROCEDURES, NEC",793,MODERATELY EXTENSIVE OR PROCEDURES FOR OTHER COMPLICATIONS OF TREATMENT,21,"INJURIES, POISONINGS AND TOXIC EFFECTS OF DRUGS",2,Moderate,Minor,Surgical,Medicaid,,,,,true,48975.72,9641.04
New York City,Manhattan,7002053,001463,NYU Langone Hospitals,70 or Older,101,M,White,Not Span/Hispanic,5,Emergency,Home or Self Care,2019,CIR038,POSTPROCEDURAL OR POSTOPERATIVE CIRCULATORY SYSTEM COMPLICATION,GNR007,"MEDIASTINAL PROCEDURES, NEC",793,MODERATELY EXTENSIVE OR PROCEDURES FOR OTHER COMPLICATIONS OF TREATMENT,21,"INJURIES, POISONINGS AND TOXIC EFFECTS OF DRUGS",4,Extreme,Extreme,Surgical,Medicare,Blue Cross/Blue Shield,,,,true,168348.21,43101.19
New York City,Manhattan,7002053,001463,NYU Langone Hospitals,18 to 29,112,F,Black/African American,Not Span/Hispanic,1,Emergency,Home or Self Care,2019,MUS037,POSTPROCEDURAL OR POSTOPERATIVE MUSCULOSKELETAL SYSTEM COMPLICATION,MST030,"MUSCULOSKELETAL PROCEDURES, NEC",793,MODERATELY EXTENSIVE OR PROCEDURES FOR OTHER COMPLICATIONS OF TREATMENT,21,"INJURIES, POISONINGS AND TOXIC EFFECTS OF DRUGS",1,Minor,Minor,Surgical,Private Health Insurance,,,,,true,40525.72,8393.68
New York City,Manhattan,7002053,001463,NYU Langone Hospitals,50 to 69,100,F,White,Not Span/Hispanic,1,Elective,Home w/ Home Health Services,2019,SKN006,POSTPROCEDURAL OR POSTOPERATIVE SKIN COMPLICATION,MST019,"MUSCLE, TENDON, BURSA, AND LIGAMENT EXCISION",793,MODERATELY EXTENSIVE OR PROCEDURES FOR OTHER COMPLICATIONS OF TREATMENT,21,"INJURIES, POISONINGS AND TOXIC EFFECTS OF DRUGS",2,Moderate,Minor,Surgical,Medicare,Medicaid,,,,false,101467.49,17092.67
New York City,Manhattan,7002053,001463,NYU Langone Hospitals,18 to 29,OOS,M,White,Not Span/Hispanic,9,Emergency,Home w/ Home Health Services,2019,INJ037,"COMPLICATION OF OTHER SURGICAL OR MEDICAL CARE, INJURY, INITIAL ENCOUNTER",GIS024,OTHER PERITONEAL CAVITY PROCEDURES,793,MODERATELY EXTENSIVE OR PROCEDURES FOR OTHER COMPLICATIONS OF TREATMENT,21,"INJURIES, POISONINGS AND TOXIC EFFECTS OF DRUGS",4,Extreme,Moderate,Surgical,Blue Cross/Blue Shield,,,,,true,164889.97,44146.9
New York City,Manhattan,7002053,001463,NYU Langone Hospitals,50 to 69,OOS,M,White,Not Span/Hispanic,2,Elective,Home or Self Care,2019,INJ037,"COMPLICATION OF OTHER SURGICAL OR MEDICAL CARE, INJURY, INITIAL ENCOUNTER",ENP003,PARATHYROIDECTOMY,793,MODERATELY EXTENSIVE OR PROCEDURES FOR OTHER COMPLICATIONS OF TREATMENT,21,"INJURIES, POISONINGS AND TOXIC EFFECTS OF DRUGS",3,Major,Major,Surgical,Medicare,,,,,false,112739.84,23635.32
New York City,Manhattan,7002053,001463,NYU Langone Hospitals,50 to 69,112,M,Black/African American,Not Span/Hispanic,2,Elective,Home or Self Care,2019,INJ037,"COMPLICATION OF OTHER SURGICAL OR MEDICAL CARE, INJURY, INITIAL ENCOUNTER",SKB007,SKIN GRAFT,793,MODERATELY EXTENSIVE OR PROCEDURES FOR OTHER COMPLICATIONS OF TREATMENT,21,"INJURIES, POISONINGS AND TOXIC EFFECTS OF DRUGS",3,Major,Major,Surgical,Blue Cross/Blue Shield,,,,,false,62654.42,15457.35
New York City,Manhattan,7002053,001463,NYU Langone Hospitals,30 to 49,111,F,Other Race,Spanish/Hispanic,2,Elective,Home w/ Home Health Services,2019,CIR038,POSTPROCEDURAL OR POSTOPERATIVE CIRCULATORY SYSTEM COMPLICATION,CAR008,ANGIOPLASTY AND RELATED VESSEL PROCEDURES (ENDOVASCULAR; EXCLUDING CAROTID),793,MODERATELY EXTENSIVE OR PROCEDURES FOR OTHER COMPLICATIONS OF TREATMENT,21,"INJURIES, POISONINGS AND TOXIC EFFECTS OF DRUGS",3,Major,Major,Surgical,Private Health Insurance,,,,,false,79627.55,16325.47
New York City,Manhattan,7002053,001463,NYU Langone Hospitals,30 to 49,OOS,F,Black/African American,Not Span/Hispanic,6,Emergency,Home or Self Care,2019,DIG024,POSTPROCEDURAL OR POSTOPERATIVE DIGESTIVE SYSTEM COMPLICATION,GIS024,OTHER PERITONEAL CAVITY PROCEDURES,793,MODERATELY EXTENSIVE OR PROCEDURES FOR OTHER COMPLICATIONS OF TREATMENT,21,"INJURIES, POISONINGS AND TOXIC EFFECTS OF DRUGS",2,Moderate,Minor,Surgical,Private Health Insurance,,,,,true,185146.37,37420.16
New York City,Manhattan,7002053,001463,NYU Langone Hospitals,30 to 49,100,M,White,Not Span/Hispanic,1,Emergency,Short-term Hospital,2019,INJ037,"COMPLICATION OF OTHER SURGICAL OR MEDICAL CARE, INJURY, INITIAL ENCOUNTER",MST020,SUBCUTANEOUS TISSUE AND FASCIA EXCISION,793,MODERATELY EXTENSIVE OR PROCEDURES FOR OTHER COMPLICATIONS OF TREATMENT,21,"INJURIES, POISONINGS AND TOXIC EFFECTS OF DRUGS",2,Moderate,Minor,Surgical,Medicaid,,,,,true,48391.29,8730.7
New York City,Manhattan,7002053,001463,NYU Langone Hospitals,50 to 69,112,F,White,Not Span/Hispanic,16,Emergency,Skilled Nursing Home,2019,INJ036,"COMPLICATION OF TRANSPLANTED ORGANS OR TISSUE, INITIAL ENCOUNTER",MST019,"MUSCLE, TENDON, BURSA, AND LIGAMENT EXCISION",793,MODERATELY EXTENSIVE OR PROCEDURES FOR OTHER COMPLICATIONS OF TREATMENT,21,"INJURIES, POISONINGS AND TOXIC EFFECTS OF DRUGS",2,Moderate,Minor,Surgical,Medicare,Blue Cross/Blue Shield,,,,true,221217.86,76234.35
New York City,Manhattan,7002053,001463,NYU Langone Hospitals,30 to 49,117,F,Other Race,Spanish/Hispanic,13,Emergency,Home w/ Home Health Services,2019,INJ037,"COMPLICATION OF OTHER SURGICAL OR MEDICAL CARE, INJURY, INITIAL ENCOUNTER",MST020,SUBCUTANEOUS TISSUE AND FASCIA EXCISION,793,MODERATELY EXTENSIVE OR PROCEDURES FOR OTHER COMPLICATIONS OF TREATMENT,21,"INJURIES, POISONINGS AND TOXIC EFFECTS OF DRUGS",2,Moderate,Minor,Surgical,Medicaid,,,,,true,205266.02,60035.67
New York City,Manhattan,7002053,001463,NYU Langone Hospitals,50 to 69,100,M,White,Not Span/Hispanic,14,Emergency,Home w/ Home Health Services,2019,INJ037,"COMPLICATION OF OTHER SURGICAL OR MEDICAL CARE, INJURY, INITIAL ENCOUNTER",CAR008,ANGIOPLASTY AND RELATED VESSEL PROCEDURES (ENDOVASCULAR; EXCLUDING CAROTID),793,MODERATELY EXTENSIVE OR PROCEDURES FOR OTHER COMPLICATIONS OF TREATMENT,21,"INJURIES, POISONINGS AND TOXIC EFFECTS OF DRUGS",3,Major,Major,Surgical,Private Health Insurance,,,,,true,396137.22,79127.24
New York City,Manhattan,7002053,001463,NYU Langone Hospitals,50 to 69,112,F,Black/African American,Not Span/Hispanic,4,Emergency,Home or Self Care,2019,INJ037,"COMPLICATION OF OTHER SURGICAL OR MEDICAL CARE, INJURY, INITIAL ENCOUNTER",MST028,"SUBCUTANEOUS TISSUE AND FASCIA PROCEDURES, NEC",793,MODERATELY EXTENSIVE OR PROCEDURES FOR OTHER COMPLICATIONS OF TREATMENT,21,"INJURIES, POISONINGS AND TOXIC EFFECTS OF DRUGS",2,Moderate,Minor,Surgical,Medicaid,,,,,false,70552.14,17928.92
New York City,Manhattan,7002053,001463,NYU Langone Hospitals,18 to 29,112,M,White,Not Span/Hispanic,1,Emergency,Home or Self Care,2019,SKN006,POSTPROCEDURAL OR POSTOPERATIVE SKIN COMPLICATION,MST028,"SUBCUTANEOUS TISSUE AND FASCIA PROCEDURES, NEC",793,MODERATELY EXTENSIVE OR PROCEDURES FOR OTHER COMPLICATIONS OF TREATMENT,21,"INJURIES, POISONINGS AND TOXIC EFFECTS OF DRUGS",1,Minor,Minor,Surgical,Private Health Insurance,,,,,true,67596.87,12312.87
New York City,Manhattan,7002053,001463,NYU Langone Hospitals,30 to 49,104,F,Black/African American,Not Span/Hispanic,1,Emergency,Home or Self Care,2019,GEN026,POSTPROCEDURAL OR POSTOPERATIVE GENITOURINARY SYSTEM COMPLICATION,GNR004,ENDOSCOPIC CONTROL OF BLEEDING,793,MODERATELY EXTENSIVE OR PROCEDURES FOR OTHER COMPLICATIONS OF TREATMENT,21,"INJURIES, POISONINGS AND TOXIC EFFECTS OF DRUGS",2,Moderate,Minor,Surgical,Private Health Insurance,,,,,true,41093.48,8207.53
New York City,Manhattan,7002053,001463,NYU Langone Hospitals,70 or Older,116,M,White,Not Span/Hispanic,9,Emergency,Home w/ Home Health Services,2019,INJ037,"COMPLICATION OF OTHER SURGICAL OR MEDICAL CARE, INJURY, INITIAL ENCOUNTER",MST020,SUBCUTANEOUS TISSUE AND FASCIA EXCISION,793,MODERATELY EXTENSIVE OR PROCEDURES FOR OTHER COMPLICATIONS OF TREATMENT,21,"INJURIES, POISONINGS AND TOXIC EFFECTS OF DRUGS",3,Major,Moderate,Surgical,Private Health Insurance,,,,,true,124699.47,36922.63
New York City,Manhattan,7002053,001463,NYU Langone Hospitals,70 or Older,103,M,White,Not Span/Hispanic,2,Elective,Home w/ Home Health Services,2019,INJ037,"COMPLICATION OF OTHER SURGICAL OR MEDICAL CARE, INJURY, INITIAL ENCOUNTER",URN007,URINARY TRACT REPAIR,793,MODERATELY EXTENSIVE OR PROCEDURES FOR OTHER COMPLICATIONS OF TREATMENT,21,"INJURIES, POISONINGS AND TOXIC EFFECTS OF DRUGS",1,Minor,Minor,Surgical,Medicare,Blue Cross/Blue Shield,,,,false,260956.91,41486.15
New York City,Manhattan,7002053,001463,NYU Langone Hospitals,50 to 69,103,F,Other Race,Spanish/Hispanic,37,Emergency,Inpatient Rehabilitation Facility,2019,INJ037,"COMPLICATION OF OTHER SURGICAL OR MEDICAL CARE, INJURY, INITIAL ENCOUNTER",HEP001,LIVER BIOPSY,793,MODERATELY EXTENSIVE OR PROCEDURES FOR OTHER COMPLICATIONS OF TREATMENT,21,"INJURIES, POISONINGS AND TOXIC EFFECTS OF DRUGS",4,Extreme,Extreme,Surgical,Private Health Insurance,,,,,false,779331.97,193877.77
New York City,Manhattan,7002053,001463,NYU Langone Hospitals,70 or Older,112,F,White,Not Span/Hispanic,7,Elective,Inpatient Rehabilitation Facility,2019,INJ037,"COMPLICATION OF OTHER SURGICAL OR MEDICAL CARE, INJURY, INITIAL ENCOUNTER",MST030,"MUSCULOSKELETAL PROCEDURES, NEC",793,MODERATELY EXTENSIVE OR PROCEDURES FOR OTHER COMPLICATIONS OF TREATMENT,21,"INJURIES, POISONINGS AND TOXIC EFFECTS OF DRUGS",3,Major,Major,Surgical,Blue Cross/Blue Shield,Private Health Insurance,Medicare,,,false,143367.43,33916.28
New York City,Manhattan,7002053,001463,NYU Langone Hospitals,30 to 49,104,M,Black/African American,Not Span/Hispanic,1,Elective,Home or Self Care,2019,INJ037,"COMPLICATION OF OTHER SURGICAL OR MEDICAL CARE, INJURY, INITIAL ENCOUNTER",URN003,URETER AND OTHER URINARY TRACT DILATION,793,MODERATELY EXTENSIVE OR PROCEDURES FOR OTHER COMPLICATIONS OF TREATMENT,21,"INJURIES, POISONINGS AND TOXIC EFFECTS OF DRUGS",3,Major,Major,Surgical,Private Health Insurance,,,,,false,100036.48,14880.01
New York City,Manhattan,7002053,001463,NYU Langone Hospitals,50 to 69,103,F,White,Not Span/Hispanic,17,Emergency,Skilled Nursing Home,2019,INJ037,"COMPLICATION OF OTHER SURGICAL OR MEDICAL CARE, INJURY, INITIAL ENCOUNTER",MST030,"MUSCULOSKELETAL PROCEDURES, NEC",793,MODERATELY EXTENSIVE OR PROCEDURES FOR OTHER COMPLICATIONS OF TREATMENT,21,"INJURIES, POISONINGS AND TOXIC EFFECTS OF DRUGS",3,Major,Major,Surgical,Medicare,,,,,true,371156.23,90448.72
New York City,Manhattan,7002053,001463,NYU Langone Hospitals,18 to 29,100,M,White,Not Span/Hispanic,1,Emergency,Home or Self Care,2019,RSP017,POSTPROCEDURAL OR POSTOPERATIVE RESPIRATORY SYSTEM COMPLICATION,GNR004,ENDOSCOPIC CONTROL OF BLEEDING,793,MODERATELY EXTENSIVE OR PROCEDURES FOR OTHER COMPLICATIONS OF TREATMENT,21,"INJURIES, POISONINGS AND TOXIC EFFECTS OF DRUGS",1,Minor,Minor,Surgical,Private Health Insurance,,,,,true,21089.25,8443.96
New York City,Manhattan,7002053,001463,NYU Langone Hospitals,70 or Older,OOS,M,White,Not Span/Hispanic,5,Emergency,Home w/ Home Health Services,2019,INJ037,"COMPLICATION OF OTHER SURGICAL OR MEDICAL CARE, INJURY, INITIAL ENCOUNTER",MST019,"MUSCLE, TENDON, BURSA, AND LIGAMENT EXCISION",793,MODERATELY EXTENSIVE OR PROCEDURES FOR OTHER COMPLICATIONS OF TREATMENT,21,"INJURIES, POISONINGS AND TOXIC EFFECTS OF DRUGS",2,Moderate,Minor,Surgical,Medicare,Medicare,,,,true,125726.53,28374.52
New York City,Manhattan,7002053,001463,NYU Langone Hospitals,30 to 49,115,F,Other Race,Not Span/Hispanic,1,Elective,Home or Self Care,2019,GEN026,POSTPROCEDURAL OR POSTOPERATIVE GENITOURINARY SYSTEM COMPLICATION,FRS010,FEMALE UPPER GENITAL TRACT EXCISION,793,MODERATELY EXTENSIVE OR PROCEDURES FOR OTHER COMPLICATIONS OF TREATMENT,21,"INJURIES, POISONINGS AND TOXIC EFFECTS OF DRUGS",1,Minor,Minor,Surgical,Private Health Insurance,,,,,false,133611.06,21832.35
New York City,Manhattan,7002053,001463,NYU Langone Hospitals,50 to 69,OOS,M,White,Not Span/Hispanic,5,Emergency,Home or Self Care,2019,INJ037,"COMPLICATION OF OTHER SURGICAL OR MEDICAL CARE, INJURY, INITIAL ENCOUNTER",MST005,INCISION AND DRAINAGE OF SUBCUTANEOUS TISSUE AND FASCIA,793,MODERATELY EXTENSIVE OR PROCEDURES FOR OTHER COMPLICATIONS OF TREATMENT,21,"INJURIES, POISONINGS AND TOXIC EFFECTS OF DRUGS",2,Moderate,Moderate,Surgical,Private Health Insurance,,,,,true,72332.3,22042.11
New York City,Manhattan,7002053,001463,NYU Langone Hospitals,50 to 69,OOS,M,White,Not Span/Hispanic,3,Emergency,Home or Self Care,2019,MUS037,POSTPROCEDURAL OR POSTOPERATIVE MUSCULOSKELETAL SYSTEM COMPLICATION,MST019,"MUSCLE, TENDON, BURSA, AND LIGAMENT EXCISION",793,MODERATELY EXTENSIVE OR PROCEDURES FOR OTHER COMPLICATIONS OF TREATMENT,21,"INJURIES, POISONINGS AND TOXIC EFFECTS OF DRUGS",1,Minor,Minor,Surgical,Medicare,Medicare,,,,true,99725.74,27321.17