Hospital Service Area,Hospital County,Operating Certificate Number,Permanent Facility Id,Facility Name,Age Group,Zip Code - 3 digits,Gender,Race,Ethnicity,Length of Stay,Type of Admission,Patient Disposition,Discharge Year,CCS Diagnosis Code,CCS Diagnosis Description,CCS Procedure Code,CCS Procedure Description,APR DRG Code,APR DRG Description,APR MDC Code,APR MDC Description,APR Severity of Illness Code,APR Severity of Illness Description,APR Risk of Mortality,APR Medical Surgical Description,Payment Typology 1,Payment Typology 2,Payment Typology 3,Birth Weight,Abortion Edit Indicator,Emergency Department Indicator,Total Charges,Total Costs
New York City,Kings,7002053,001304,NYU Langone Hospital-Brooklyn,50 to 69,112,F,White,Not Span/Hispanic,6,Emergency,Home w/ Home Health Services,2020,SKN006,POSTPROCEDURAL OR POSTOPERATIVE SKIN COMPLICATION,MST028,"SUBCUTANEOUS TISSUE AND FASCIA PROCEDURES, NEC",793,MODERATELY EXTENSIVE OR PROCEDURES FOR OTHER COMPLICATIONS OF TREATMENT,21,"INJURIES, POISONINGS AND TOXIC EFFECTS OF DRUGS",2,Moderate,Minor,Surgical,Medicaid,Medicaid,,,,Y,132863.3,30101.29
New York City,Kings,7002053,001304,NYU Langone Hospital-Brooklyn,50 to 69,112,M,White,Not Span/Hispanic,15,Emergency,Home w/ Home Health Services,2020,INJ037,"COMPLICATION OF OTHER SURGICAL OR MEDICAL CARE, INJURY, INITIAL ENCOUNTER",MST030,"MUSCULOSKELETAL PROCEDURES, NEC",793,MODERATELY EXTENSIVE OR PROCEDURES FOR OTHER COMPLICATIONS OF TREATMENT,21,"INJURIES, POISONINGS AND TOXIC EFFECTS OF DRUGS",4,Extreme,Major,Surgical,Medicaid,,,,,Y,347566.45,91674.9
New York City,Kings,7002053,001304,NYU Langone Hospital-Brooklyn,50 to 69,112,M,Other Race,Not Span/Hispanic,6,Emergency,Home or Self Care,2020,INJ037,"COMPLICATION OF OTHER SURGICAL OR MEDICAL CARE, INJURY, INITIAL ENCOUNTER",HEP006,CHOLECYSTECTOMY,793,MODERATELY EXTENSIVE OR PROCEDURES FOR OTHER COMPLICATIONS OF TREATMENT,21,"INJURIES, POISONINGS AND TOXIC EFFECTS OF DRUGS",3,Major,Moderate,Surgical,Medicaid,,,,,Y,192498.53,36220.98
New York City,Kings,7002053,001304,NYU Langone Hospital-Brooklyn,70 or Older,112,F,White,Spanish/Hispanic,3,Emergency,Home w/ Home Health Services,2020,DIG024,POSTPROCEDURAL OR POSTOPERATIVE DIGESTIVE SYSTEM COMPLICATION,GIS005,EXPLORATION OF PERITONEAL CAVITY,793,MODERATELY EXTENSIVE OR PROCEDURES FOR OTHER COMPLICATIONS OF TREATMENT,21,"INJURIES, POISONINGS AND TOXIC EFFECTS OF DRUGS",2,Moderate,Major,Surgical,Medicare,Medicaid,,,,Y,98017.13,26123.74
New York City,Kings,7002053,001304,NYU Langone Hospital-Brooklyn,50 to 69,112,M,White,Not Span/Hispanic,9,Emergency,Left Against Medical Advice,2020,INJ022,"POISONING BY DRUGS, INITIAL ENCOUNTER",MST028,"SUBCUTANEOUS TISSUE AND FASCIA PROCEDURES, NEC",793,MODERATELY EXTENSIVE OR PROCEDURES FOR OTHER COMPLICATIONS OF TREATMENT,21,"INJURIES, POISONINGS AND TOXIC EFFECTS OF DRUGS",4,Extreme,Major,Surgical,Medicare,Medicaid,,,,Y,223334.59,56943.1
New York City,Kings,7002053,001304,NYU Langone Hospital-Brooklyn,70 or Older,112,F,White,Not Span/Hispanic,15,Emergency,Inpatient Rehabilitation Facility,2020,MUS037,POSTPROCEDURAL OR POSTOPERATIVE MUSCULOSKELETAL SYSTEM COMPLICATION,MST004,INCISION AND DRAINAGE OF MUSCULOSKELETAL TISSUE AND JOINTS,793,MODERATELY EXTENSIVE OR PROCEDURES FOR OTHER COMPLICATIONS OF TREATMENT,21,"INJURIES, POISONINGS AND TOXIC EFFECTS OF DRUGS",2,Moderate,Major,Surgical,Medicare,Medicaid,,,,Y,255811.39,83012.27
New York City,Kings,7002053,001304,NYU Langone Hospital-Brooklyn,50 to 69,112,F,White,Not Span/Hispanic,9,Emergency,Home w/ Home Health Services,2020,SKN006,POSTPROCEDURAL OR POSTOPERATIVE SKIN COMPLICATION,MST020,SUBCUTANEOUS TISSUE AND FASCIA EXCISION,793,MODERATELY EXTENSIVE OR PROCEDURES FOR OTHER COMPLICATIONS OF TREATMENT,21,"INJURIES, POISONINGS AND TOXIC EFFECTS OF DRUGS",2,Moderate,Moderate,Surgical,Medicare,,,,,Y,170815.19,52217.74
New York City,Kings,7002053,001304,NYU Langone Hospital-Brooklyn,50 to 69,112,F,Black/African American,Not Span/Hispanic,7,Emergency,Skilled Nursing Home,2020,MUS037,POSTPROCEDURAL OR POSTOPERATIVE MUSCULOSKELETAL SYSTEM COMPLICATION,MST019,"MUSCLE, TENDON, BURSA, AND LIGAMENT EXCISION",793,MODERATELY EXTENSIVE OR PROCEDURES FOR OTHER COMPLICATIONS OF TREATMENT,21,"INJURIES, POISONINGS AND TOXIC EFFECTS OF DRUGS",2,Moderate,Moderate,Surgical,Medicare,Blue Cross/Blue Shield,,,,Y,188831.64,47397.54
New York City,Kings,7002053,001304,NYU Langone Hospital-Brooklyn,70 or Older,112,M,Other Race,Not Span/Hispanic,1,Elective,Home w/ Home Health Services,2020,CIR038,POSTPROCEDURAL OR POSTOPERATIVE CIRCULATORY SYSTEM COMPLICATION,CAR015,PERIPHERAL ARTERIOVENOUS FISTULA AND SHUNT PROCEDURES,793,MODERATELY EXTENSIVE OR PROCEDURES FOR OTHER COMPLICATIONS OF TREATMENT,21,"INJURIES, POISONINGS AND TOXIC EFFECTS OF DRUGS",3,Major,Major,Surgical,Medicare,Medicaid,,,,N,136804.88,19305.03
New York City,Kings,7002053,001304,NYU Langone Hospital-Brooklyn,70 or Older,112,M,White,Not Span/Hispanic,2,Emergency,Home or Self Care,2020,GEN026,POSTPROCEDURAL OR POSTOPERATIVE GENITOURINARY SYSTEM COMPLICATION,GNR004,ENDOSCOPIC CONTROL OF BLEEDING,793,MODERATELY EXTENSIVE OR PROCEDURES FOR OTHER COMPLICATIONS OF TREATMENT,21,"INJURIES, POISONINGS AND TOXIC EFFECTS OF DRUGS",2,Moderate,Minor,Surgical,Blue Cross/Blue Shield,,,,,Y,58710.42,14399.88
New York City,Kings,7002053,001304,NYU Langone Hospital-Brooklyn,50 to 69,103,M,Black/African American,Not Span/Hispanic,6,Urgent,Skilled Nursing Home,2020,INJ037,"COMPLICATION OF OTHER SURGICAL OR MEDICAL CARE, INJURY, INITIAL ENCOUNTER",MST028,"SUBCUTANEOUS TISSUE AND FASCIA PROCEDURES, NEC",793,MODERATELY EXTENSIVE OR PROCEDURES FOR OTHER COMPLICATIONS OF TREATMENT,21,"INJURIES, POISONINGS AND TOXIC EFFECTS OF DRUGS",3,Major,Major,Surgical,Medicare,Medicaid,,,,N,172426.55,53946.21
New York City,Kings,7002053,001304,NYU Langone Hospital-Brooklyn,50 to 69,112,F,Other Race,Not Span/Hispanic,1,Emergency,Home or Self Care,2020,MUS037,POSTPROCEDURAL OR POSTOPERATIVE MUSCULOSKELETAL SYSTEM COMPLICATION,MST030,"MUSCULOSKELETAL PROCEDURES, NEC",793,MODERATELY EXTENSIVE OR PROCEDURES FOR OTHER COMPLICATIONS OF TREATMENT,21,"INJURIES, POISONINGS AND TOXIC EFFECTS OF DRUGS",2,Moderate,Moderate,Surgical,Blue Cross/Blue Shield,,,,,Y,63134.66,11664.82
New York City,Kings,7002053,001304,NYU Langone Hospital-Brooklyn,70 or Older,100,M,Other Race,Not Span/Hispanic,3,Emergency,Skilled Nursing Home,2020,CIR038,POSTPROCEDURAL OR POSTOPERATIVE CIRCULATORY SYSTEM COMPLICATION,CAR012,VESSEL REPAIR AND REPLACEMENT,793,MODERATELY EXTENSIVE OR PROCEDURES FOR OTHER COMPLICATIONS OF TREATMENT,21,"INJURIES, POISONINGS AND TOXIC EFFECTS OF DRUGS",2,Moderate,Minor,Surgical,Medicare,Blue Cross/Blue Shield,,,,Y,114578.29,23898.07
