Hospital Service Area,Hospital County,Operating Certificate Number,Permanent Facility Id,Facility Name,Age Group,Zip Code - 3 digits,Gender,Race,Ethnicity,Length of Stay,Type of Admission,Patient Disposition,Discharge Year,CCS Diagnosis Code,CCS Diagnosis Description,CCS Procedure Code,CCS Procedure Description,APR DRG Code,APR DRG Description,APR MDC Code,APR MDC Description,APR Severity of Illness Code,APR Severity of Illness Description,APR Risk of Mortality,APR Medical Surgical Description,Payment Typology 1,Payment Typology 2,Payment Typology 3,Birth Weight,Abortion Edit Indicator,Emergency Department Indicator,Total Charges,Total Costs
New York City,Manhattan,7002001,001438,Bellevue Hospital Center,50 to 69,100,M,Black/African American,Not Span/Hispanic,43,Emergency,Home or Self Care,2020,INJ037,"COMPLICATION OF OTHER SURGICAL OR MEDICAL CARE, INJURY, INITIAL ENCOUNTER",MST018,BONE EXCISION,793,MODERATELY EXTENSIVE OR PROCEDURES FOR OTHER COMPLICATIONS OF TREATMENT,21,"INJURIES, POISONINGS AND TOXIC EFFECTS OF DRUGS",3,Major,Extreme,Surgical,Medicaid,,,,,Y,332338.4,191122.5
New York City,Manhattan,7002001,001438,Bellevue Hospital Center,30 to 49,100,M,White,Not Span/Hispanic,11,Emergency,Skilled Nursing Home,2020,INJ037,"COMPLICATION OF OTHER SURGICAL OR MEDICAL CARE, INJURY, INITIAL ENCOUNTER",MST020,SUBCUTANEOUS TISSUE AND FASCIA EXCISION,793,MODERATELY EXTENSIVE OR PROCEDURES FOR OTHER COMPLICATIONS OF TREATMENT,21,"INJURIES, POISONINGS AND TOXIC EFFECTS OF DRUGS",3,Major,Major,Surgical,Private Health Insurance,Medicaid,,,,Y,98846.93,56845.29
New York City,Manhattan,7002001,001438,Bellevue Hospital Center,18 to 29,114,M,Black/African American,Not Span/Hispanic,18,Elective,Home or Self Care,2020,INJ037,"COMPLICATION OF OTHER SURGICAL OR MEDICAL CARE, INJURY, INITIAL ENCOUNTER",MST005,INCISION AND DRAINAGE OF SUBCUTANEOUS TISSUE AND FASCIA,793,MODERATELY EXTENSIVE OR PROCEDURES FOR OTHER COMPLICATIONS OF TREATMENT,21,"INJURIES, POISONINGS AND TOXIC EFFECTS OF DRUGS",3,Major,Minor,Surgical,Self-Pay,,,,,N,241965.14,139150.28
New York City,Manhattan,7002001,001438,Bellevue Hospital Center,30 to 49,112,M,Other Race,Unknown,12,Emergency,Court/Law Enforcement,2020,INJ037,"COMPLICATION OF OTHER SURGICAL OR MEDICAL CARE, INJURY, INITIAL ENCOUNTER",SKB007,SKIN GRAFT,793,MODERATELY EXTENSIVE OR PROCEDURES FOR OTHER COMPLICATIONS OF TREATMENT,21,"INJURIES, POISONINGS AND TOXIC EFFECTS OF DRUGS",2,Moderate,Minor,Surgical,Medicaid,,,,,Y,106300.24,61131.57
New York City,Manhattan,7002001,001438,Bellevue Hospital Center,30 to 49,112,M,Other Race,Unknown,3,Emergency,Court/Law Enforcement,2020,SKN006,POSTPROCEDURAL OR POSTOPERATIVE SKIN COMPLICATION,MST019,"MUSCLE, TENDON, BURSA, AND LIGAMENT EXCISION",793,MODERATELY EXTENSIVE OR PROCEDURES FOR OTHER COMPLICATIONS OF TREATMENT,21,"INJURIES, POISONINGS AND TOXIC EFFECTS OF DRUGS",2,Moderate,Minor,Surgical,Medicaid,,,,,Y,20616.83,11856.41
New York City,Manhattan,7002001,001438,Bellevue Hospital Center,18 to 29,104,M,Black/African American,Not Span/Hispanic,2,Emergency,Home or Self Care,2020,INJ022,"POISONING BY DRUGS, INITIAL ENCOUNTER",MST030,"MUSCULOSKELETAL PROCEDURES, NEC",793,MODERATELY EXTENSIVE OR PROCEDURES FOR OTHER COMPLICATIONS OF TREATMENT,21,"INJURIES, POISONINGS AND TOXIC EFFECTS OF DRUGS",2,Moderate,Minor,Surgical,Medicaid,,,,,Y,16591.03,9541.24
New York City,Manhattan,7002001,001438,Bellevue Hospital Center,18 to 29,,F,Other Race,Spanish/Hispanic,1,Elective,Home or Self Care,2020,INJ036,"COMPLICATION OF TRANSPLANTED ORGANS OR TISSUE, INITIAL ENCOUNTER",SKB007,SKIN GRAFT,793,MODERATELY EXTENSIVE OR PROCEDURES FOR OTHER COMPLICATIONS OF TREATMENT,21,"INJURIES, POISONINGS AND TOXIC EFFECTS OF DRUGS",2,Moderate,Moderate,Surgical,Miscellaneous/Other,Private Health Insurance,,,,N,29904.07,17197.35
New York City,Manhattan,7002001,001438,Bellevue Hospital Center,30 to 49,113,F,Other Race,Spanish/Hispanic,1,Elective,Home or Self Care,2020,INJ037,"COMPLICATION OF OTHER SURGICAL OR MEDICAL CARE, INJURY, INITIAL ENCOUNTER",MST020,SUBCUTANEOUS TISSUE AND FASCIA EXCISION,793,MODERATELY EXTENSIVE OR PROCEDURES FOR OTHER COMPLICATIONS OF TREATMENT,21,"INJURIES, POISONINGS AND TOXIC EFFECTS OF DRUGS",2,Moderate,Minor,Surgical,Medicaid,,,,,N,18079.81,10397.41
New York City,Manhattan,7002001,001438,Bellevue Hospital Center,50 to 69,112,F,Other Race,Spanish/Hispanic,5,Elective,Home or Self Care,2020,INJ037,"COMPLICATION OF OTHER SURGICAL OR MEDICAL CARE, INJURY, INITIAL ENCOUNTER",MST014,JOINT FUSION (EXCLUDING SPINE),793,MODERATELY EXTENSIVE OR PROCEDURES FOR OTHER COMPLICATIONS OF TREATMENT,21,"INJURIES, POISONINGS AND TOXIC EFFECTS OF DRUGS",3,Major,Extreme,Surgical,Medicaid,,,,,N,76115.51,43772.81
New York City,Manhattan,7002001,001438,Bellevue Hospital Center,50 to 69,112,M,Other Race,Spanish/Hispanic,7,Emergency,Home or Self Care,2020,INJ037,"COMPLICATION OF OTHER SURGICAL OR MEDICAL CARE, INJURY, INITIAL ENCOUNTER",SKB007,SKIN GRAFT,793,MODERATELY EXTENSIVE OR PROCEDURES FOR OTHER COMPLICATIONS OF TREATMENT,21,"INJURIES, POISONINGS AND TOXIC EFFECTS OF DRUGS",1,Minor,Minor,Surgical,Medicaid,,,,,Y,93244.38,53623.35
New York City,Manhattan,7002001,001438,Bellevue Hospital Center,30 to 49,104,F,Multi-racial,Not Span/Hispanic,3,Emergency,Home or Self Care,2020,INJ037,"COMPLICATION OF OTHER SURGICAL OR MEDICAL CARE, INJURY, INITIAL ENCOUNTER",MST030,"MUSCULOSKELETAL PROCEDURES, NEC",793,MODERATELY EXTENSIVE OR PROCEDURES FOR OTHER COMPLICATIONS OF TREATMENT,21,"INJURIES, POISONINGS AND TOXIC EFFECTS OF DRUGS",1,Minor,Minor,Surgical,Medicare,Medicaid,,,,Y,31697.2,18228.55
New York City,Manhattan,7002001,001438,Bellevue Hospital Center,50 to 69,104,M,Black/African American,Not Span/Hispanic,80,Emergency,Inpatient Rehabilitation Facility,2020,INJ037,"COMPLICATION OF OTHER SURGICAL OR MEDICAL CARE, INJURY, INITIAL ENCOUNTER",SKB007,SKIN GRAFT,793,MODERATELY EXTENSIVE OR PROCEDURES FOR OTHER COMPLICATIONS OF TREATMENT,21,"INJURIES, POISONINGS AND TOXIC EFFECTS OF DRUGS",4,Extreme,Extreme,Surgical,Medicare,Medicaid,,,,Y,794948.1,457161.93
