Hospital Service Area,Hospital County,Operating Certificate Number,Permanent Facility Id,Facility Name,Age Group,Zip Code - 3 digits,Gender,Race,Ethnicity,Length of Stay,Type of Admission,Patient Disposition,Discharge Year,CCS Diagnosis Code,CCS Diagnosis Description,CCS Procedure Code,CCS Procedure Description,APR DRG Code,APR DRG Description,APR MDC Code,APR MDC Description,APR Severity of Illness Code,APR Severity of Illness Description,APR Risk of Mortality,APR Medical Surgical Description,Payment Typology 1,Payment Typology 2,Payment Typology 3,Birth Weight,Abortion Edit Indicator,Emergency Department Indicator,Total Charges,Total Costs
New York City,Bronx,7000006,001169,Montefiore Medical Center - Henry & Lucy Moses Div,70 or Older,104,F,Other Race,Unknown,19,Elective,Home or Self Care,2020,NEO058,NON-HODGKIN LYMPHOMA,ADM011,"ADMINISTRATION AND TRANSFUSION OF BONE MARROW, STEM CELLS, PANCREATIC ISLET CELLS, AND T-CELLS",008,AUTOLOGOUS BONE MARROW TRANSPLANT OR T-CELL IMMUNOTHERAPY,17,"MYELOPROLIFERATIVE DISEASES AND DISORDERS, AND POORLY DIFFERENTIATED NEOPLASM",3,Major,Moderate,Surgical,Medicare,Medicaid,,,,N,474914.03,77263.4
New York City,Bronx,7000006,001169,Montefiore Medical Center - Henry & Lucy Moses Div,70 or Older,104,F,Black/African American,Not Span/Hispanic,16,Emergency,Home or Self Care,2020,NEO065,MULTIPLE MYELOMA,ADM011,"ADMINISTRATION AND TRANSFUSION OF BONE MARROW, STEM CELLS, PANCREATIC ISLET CELLS, AND T-CELLS",008,AUTOLOGOUS BONE MARROW TRANSPLANT OR T-CELL IMMUNOTHERAPY,17,"MYELOPROLIFERATIVE DISEASES AND DISORDERS, AND POORLY DIFFERENTIATED NEOPLASM",2,Moderate,Moderate,Surgical,Medicare,,,,,N,327882.96,58604.63
New York City,Bronx,7000006,001169,Montefiore Medical Center - Henry & Lucy Moses Div,0 to 17,104,F,Black/African American,Not Span/Hispanic,44,Emergency,Home or Self Care,2020,FAC006,ENCOUNTER FOR ANTINEOPLASTIC THERAPIES,ADM011,"ADMINISTRATION AND TRANSFUSION OF BONE MARROW, STEM CELLS, PANCREATIC ISLET CELLS, AND T-CELLS",008,AUTOLOGOUS BONE MARROW TRANSPLANT OR T-CELL IMMUNOTHERAPY,17,"MYELOPROLIFERATIVE DISEASES AND DISORDERS, AND POORLY DIFFERENTIATED NEOPLASM",3,Major,Major,Surgical,Medicaid,,,,,N,714508.94,154775.89
New York City,Manhattan,7002024,001456,Mount Sinai Hospital,50 to 69,117,M,White,Not Span/Hispanic,29,Elective,Home or Self Care,2020,NEO065,MULTIPLE MYELOMA,ADM011,"ADMINISTRATION AND TRANSFUSION OF BONE MARROW, STEM CELLS, PANCREATIC ISLET CELLS, AND T-CELLS",008,AUTOLOGOUS BONE MARROW TRANSPLANT OR T-CELL IMMUNOTHERAPY,17,"MYELOPROLIFERATIVE DISEASES AND DISORDERS, AND POORLY DIFFERENTIATED NEOPLASM",3,Major,Major,Surgical,Blue Cross/Blue Shield,Self-Pay,,,,N,425723.74,112896.44
New York City,Manhattan,7002024,001456,Mount Sinai Hospital,70 or Older,OOS,M,Other Race,Not Span/Hispanic,15,Elective,Home or Self Care,2020,NEO065,MULTIPLE MYELOMA,ADM011,"ADMINISTRATION AND TRANSFUSION OF BONE MARROW, STEM CELLS, PANCREATIC ISLET CELLS, AND T-CELLS",008,AUTOLOGOUS BONE MARROW TRANSPLANT OR T-CELL IMMUNOTHERAPY,17,"MYELOPROLIFERATIVE DISEASES AND DISORDERS, AND POORLY DIFFERENTIATED NEOPLASM",2,Moderate,Minor,Surgical,Medicare,Medicare,Self-Pay,,,N,215757.8,57711.17
New York City,Bronx,7000006,001169,Montefiore Medical Center - Henry & Lucy Moses Div,70 or Older,104,M,Other Race,Not Span/Hispanic,16,Emergency,Home or Self Care,2020,NEO065,MULTIPLE MYELOMA,ADM011,"ADMINISTRATION AND TRANSFUSION OF BONE MARROW, STEM CELLS, PANCREATIC ISLET CELLS, AND T-CELLS",008,AUTOLOGOUS BONE MARROW TRANSPLANT OR T-CELL IMMUNOTHERAPY,17,"MYELOPROLIFERATIVE DISEASES AND DISORDERS, AND POORLY DIFFERENTIATED NEOPLASM",2,Moderate,Major,Surgical,Medicare,Private Health Insurance,,,,N,381048.07,66808.56
New York City,Manhattan,7002054,001464,New York-Presbyterian Hospital - Columbia Presbyterian Center,70 or Older,105,M,White,Not Span/Hispanic,16,Elective,Home or Self Care,2020,NEO065,MULTIPLE MYELOMA,ADM011,"ADMINISTRATION AND TRANSFUSION OF BONE MARROW, STEM CELLS, PANCREATIC ISLET CELLS, AND T-CELLS",008,AUTOLOGOUS BONE MARROW TRANSPLANT OR T-CELL IMMUNOTHERAPY,17,"MYELOPROLIFERATIVE DISEASES AND DISORDERS, AND POORLY DIFFERENTIATED NEOPLASM",2,Moderate,Minor,Surgical,Private Health Insurance,Medicare,Self-Pay,,,N,212406.8,53838.32
New York City,Manhattan,7002054,001458,New York-Presbyterian Hospital - New York Weill Cornell Center,70 or Older,112,F,Other Race,Spanish/Hispanic,22,Elective,Home w/ Home Health Services,2020,NEO058,NON-HODGKIN LYMPHOMA,ADM012,CHEMOTHERAPY,008,AUTOLOGOUS BONE MARROW TRANSPLANT OR T-CELL IMMUNOTHERAPY,17,"MYELOPROLIFERATIVE DISEASES AND DISORDERS, AND POORLY DIFFERENTIATED NEOPLASM",3,Major,Major,Surgical,Medicare,Medicaid,Self-Pay,,,N,1657042.66,729313.7
New York City,Manhattan,7002054,001458,New York-Presbyterian Hospital - New York Weill Cornell Center,50 to 69,100,F,Other Race,Not Span/Hispanic,15,Elective,Home or Self Care,2020,NEO065,MULTIPLE MYELOMA,ADM011,"ADMINISTRATION AND TRANSFUSION OF BONE MARROW, STEM CELLS, PANCREATIC ISLET CELLS, AND T-CELLS",008,AUTOLOGOUS BONE MARROW TRANSPLANT OR T-CELL IMMUNOTHERAPY,17,"MYELOPROLIFERATIVE DISEASES AND DISORDERS, AND POORLY DIFFERENTIATED NEOPLASM",2,Moderate,Moderate,Surgical,Private Health Insurance,,,,,N,200545.72,52342.21
New York City,Manhattan,7002054,001458,New York-Presbyterian Hospital - New York Weill Cornell Center,70 or Older,113,M,White,Not Span/Hispanic,26,Elective,Home or Self Care,2020,FAC006,ENCOUNTER FOR ANTINEOPLASTIC THERAPIES,ADM012,CHEMOTHERAPY,008,AUTOLOGOUS BONE MARROW TRANSPLANT OR T-CELL IMMUNOTHERAPY,17,"MYELOPROLIFERATIVE DISEASES AND DISORDERS, AND POORLY DIFFERENTIATED NEOPLASM",3,Major,Moderate,Surgical,Medicaid,Self-Pay,,,,N,1729966.1,747413.03
New York City,Manhattan,7002024,001456,Mount Sinai Hospital,50 to 69,115,F,Other Race,Not Span/Hispanic,21,Elective,Home w/ Home Health Services,2020,NEO065,MULTIPLE MYELOMA,ADM011,"ADMINISTRATION AND TRANSFUSION OF BONE MARROW, STEM CELLS, PANCREATIC ISLET CELLS, AND T-CELLS",008,AUTOLOGOUS BONE MARROW TRANSPLANT OR T-CELL IMMUNOTHERAPY,17,"MYELOPROLIFERATIVE DISEASES AND DISORDERS, AND POORLY DIFFERENTIATED NEOPLASM",3,Major,Minor,Surgical,Private Health Insurance,Self-Pay,Private Health Insurance,,,N,303969.94,78661.83
New York City,Bronx,7000006,001169,Montefiore Medical Center - Henry & Lucy Moses Div,50 to 69,109,F,White,Not Span/Hispanic,21,Emergency,Home or Self Care,2020,NEO065,MULTIPLE MYELOMA,ADM011,"ADMINISTRATION AND TRANSFUSION OF BONE MARROW, STEM CELLS, PANCREATIC ISLET CELLS, AND T-CELLS",008,AUTOLOGOUS BONE MARROW TRANSPLANT OR T-CELL IMMUNOTHERAPY,17,"MYELOPROLIFERATIVE DISEASES AND DISORDERS, AND POORLY DIFFERENTIATED NEOPLASM",3,Major,Moderate,Surgical,Medicare,,,,,N,511901.25,88557.54
New York City,Manhattan,7002024,001456,Mount Sinai Hospital,50 to 69,113,M,Other Race,Not Span/Hispanic,18,Elective,Home or Self Care,2020,NEO065,MULTIPLE MYELOMA,ADM012,CHEMOTHERAPY,008,AUTOLOGOUS BONE MARROW TRANSPLANT OR T-CELL IMMUNOTHERAPY,17,"MYELOPROLIFERATIVE DISEASES AND DISORDERS, AND POORLY DIFFERENTIATED NEOPLASM",4,Extreme,Major,Surgical,Self-Pay,Self-Pay,,,,N,310191.1,81368
New York City,Bronx,7000006,001169,Montefiore Medical Center - Henry & Lucy Moses Div,50 to 69,104,M,Other Race,Spanish/Hispanic,24,Elective,Home w/ Home Health Services,2020,NEO065,MULTIPLE MYELOMA,ADM011,"ADMINISTRATION AND TRANSFUSION OF BONE MARROW, STEM CELLS, PANCREATIC ISLET CELLS, AND T-CELLS",008,AUTOLOGOUS BONE MARROW TRANSPLANT OR T-CELL IMMUNOTHERAPY,17,"MYELOPROLIFERATIVE DISEASES AND DISORDERS, AND POORLY DIFFERENTIATED NEOPLASM",3,Major,Major,Surgical,Private Health Insurance,,,,,N,493656.59,86242.91
New York City,Bronx,7000006,001169,Montefiore Medical Center - Henry & Lucy Moses Div,50 to 69,104,F,Other Race,Spanish/Hispanic,21,Elective,Home or Self Care,2020,NEO058,NON-HODGKIN LYMPHOMA,ADM011,"ADMINISTRATION AND TRANSFUSION OF BONE MARROW, STEM CELLS, PANCREATIC ISLET CELLS, AND T-CELLS",008,AUTOLOGOUS BONE MARROW TRANSPLANT OR T-CELL IMMUNOTHERAPY,17,"MYELOPROLIFERATIVE DISEASES AND DISORDERS, AND POORLY DIFFERENTIATED NEOPLASM",3,Major,Moderate,Surgical,Medicare,Medicaid,,,,N,712771.14,107309.38
Finger Lakes,Monroe,2701005,000413,Strong Memorial Hospital,50 to 69,146,M,White,Not Span/Hispanic,13,Elective,Home or Self Care,2020,END016,OTHER SPECIFIED AND UNSPECIFIED NUTRITIONAL AND METABOLIC DISORDERS,ADM011,"ADMINISTRATION AND TRANSFUSION OF BONE MARROW, STEM CELLS, PANCREATIC ISLET CELLS, AND T-CELLS",008,AUTOLOGOUS BONE MARROW TRANSPLANT OR T-CELL IMMUNOTHERAPY,08,DISEASES AND DISORDERS OF THE MUSCULOSKELETAL SYSTEM AND CONNECTIVE TISSUE,2,Moderate,Major,Surgical,Medicare,,,,,N,112607.61,50569.54
Finger Lakes,Monroe,2701005,000413,Strong Memorial Hospital,50 to 69,144,M,White,Not Span/Hispanic,16,Elective,Home w/ Home Health Services,2020,FAC006,ENCOUNTER FOR ANTINEOPLASTIC THERAPIES,ADM012,CHEMOTHERAPY,008,AUTOLOGOUS BONE MARROW TRANSPLANT OR T-CELL IMMUNOTHERAPY,17,"MYELOPROLIFERATIVE DISEASES AND DISORDERS, AND POORLY DIFFERENTIATED NEOPLASM",4,Extreme,Major,Surgical,Private Health Insurance,,,,,N,905563.57,400069.67
Finger Lakes,Monroe,2701005,000413,Strong Memorial Hospital,18 to 29,,M,Black/African American,Not Span/Hispanic,11,Elective,Home or Self Care,2020,NEO058,NON-HODGKIN LYMPHOMA,ADM011,"ADMINISTRATION AND TRANSFUSION OF BONE MARROW, STEM CELLS, PANCREATIC ISLET CELLS, AND T-CELLS",008,AUTOLOGOUS BONE MARROW TRANSPLANT OR T-CELL IMMUNOTHERAPY,17,"MYELOPROLIFERATIVE DISEASES AND DISORDERS, AND POORLY DIFFERENTIATED NEOPLASM",3,Major,Moderate,Surgical,Medicaid,,,,,N,74643.06,33335.71
Finger Lakes,Monroe,2701005,000413,Strong Memorial Hospital,50 to 69,133,M,White,Not Span/Hispanic,19,Elective,Home or Self Care,2020,NEO058,NON-HODGKIN LYMPHOMA,ADM011,"ADMINISTRATION AND TRANSFUSION OF BONE MARROW, STEM CELLS, PANCREATIC ISLET CELLS, AND T-CELLS",008,AUTOLOGOUS BONE MARROW TRANSPLANT OR T-CELL IMMUNOTHERAPY,17,"MYELOPROLIFERATIVE DISEASES AND DISORDERS, AND POORLY DIFFERENTIATED NEOPLASM",3,Major,Minor,Surgical,Medicare,Federal/State/Local/VA,,,,N,161573.98,70736.95
Finger Lakes,Monroe,2701005,000413,Strong Memorial Hospital,50 to 69,137,F,White,Not Span/Hispanic,13,Elective,Home or Self Care,2020,NEO065,MULTIPLE MYELOMA,ADM011,"ADMINISTRATION AND TRANSFUSION OF BONE MARROW, STEM CELLS, PANCREATIC ISLET CELLS, AND T-CELLS",008,AUTOLOGOUS BONE MARROW TRANSPLANT OR T-CELL IMMUNOTHERAPY,17,"MYELOPROLIFERATIVE DISEASES AND DISORDERS, AND POORLY DIFFERENTIATED NEOPLASM",3,Major,Moderate,Surgical,Blue Cross/Blue Shield,,,,,N,88207.2,40351.38
New York City,Bronx,7000006,001169,Montefiore Medical Center - Henry & Lucy Moses Div,50 to 69,104,F,Other Race,Spanish/Hispanic,21,Elective,Home or Self Care,2020,NEO065,MULTIPLE MYELOMA,ADM011,"ADMINISTRATION AND TRANSFUSION OF BONE MARROW, STEM CELLS, PANCREATIC ISLET CELLS, AND T-CELLS",008,AUTOLOGOUS BONE MARROW TRANSPLANT OR T-CELL IMMUNOTHERAPY,17,"MYELOPROLIFERATIVE DISEASES AND DISORDERS, AND POORLY DIFFERENTIATED NEOPLASM",4,Extreme,Major,Surgical,Medicare,Medicaid,,,,N,513467.47,88616.43
Finger Lakes,Monroe,2701005,000413,Strong Memorial Hospital,50 to 69,146,F,White,Not Span/Hispanic,12,Elective,Home or Self Care,2020,NEO065,MULTIPLE MYELOMA,ADM011,"ADMINISTRATION AND TRANSFUSION OF BONE MARROW, STEM CELLS, PANCREATIC ISLET CELLS, AND T-CELLS",008,AUTOLOGOUS BONE MARROW TRANSPLANT OR T-CELL IMMUNOTHERAPY,17,"MYELOPROLIFERATIVE DISEASES AND DISORDERS, AND POORLY DIFFERENTIATED NEOPLASM",3,Major,Minor,Surgical,Medicare,,,,,N,96971.52,43744
Finger Lakes,Monroe,2701005,000413,Strong Memorial Hospital,50 to 69,146,M,Black/African American,Not Span/Hispanic,13,Elective,Home w/ Home Health Services,2020,NEO065,MULTIPLE MYELOMA,ADM011,"ADMINISTRATION AND TRANSFUSION OF BONE MARROW, STEM CELLS, PANCREATIC ISLET CELLS, AND T-CELLS",008,AUTOLOGOUS BONE MARROW TRANSPLANT OR T-CELL IMMUNOTHERAPY,17,"MYELOPROLIFERATIVE DISEASES AND DISORDERS, AND POORLY DIFFERENTIATED NEOPLASM",3,Major,Minor,Surgical,Medicaid,,,,,N,96787.06,42567.79
Finger Lakes,Monroe,2701005,000413,Strong Memorial Hospital,18 to 29,144,M,White,Not Span/Hispanic,15,Elective,Home w/ Home Health Services,2020,NEO011,CARDIAC CANCERS,ADM011,"ADMINISTRATION AND TRANSFUSION OF BONE MARROW, STEM CELLS, PANCREATIC ISLET CELLS, AND T-CELLS",008,AUTOLOGOUS BONE MARROW TRANSPLANT OR T-CELL IMMUNOTHERAPY,04,DISEASES AND DISORDERS OF THE RESPIRATORY SYSTEM,3,Major,Moderate,Surgical,Private Health Insurance,,,,,N,123249.32,51070.97
Finger Lakes,Monroe,2701005,000413,Strong Memorial Hospital,18 to 29,144,M,White,Not Span/Hispanic,11,Elective,Home w/ Home Health Services,2020,NEO040,MALE REPRODUCTIVE SYSTEM CANCERS - TESTIS,ADM011,"ADMINISTRATION AND TRANSFUSION OF BONE MARROW, STEM CELLS, PANCREATIC ISLET CELLS, AND T-CELLS",008,AUTOLOGOUS BONE MARROW TRANSPLANT OR T-CELL IMMUNOTHERAPY,12,DISEASES AND DISORDERS OF THE MALE REPRODUCTIVE SYSTEM,3,Major,Major,Surgical,Medicare,Medicaid,,,,N,83310.77,35066.22
Finger Lakes,Monroe,2701005,000413,Strong Memorial Hospital,50 to 69,145,M,White,Not Span/Hispanic,15,Elective,Home w/ Home Health Services,2020,FAC006,ENCOUNTER FOR ANTINEOPLASTIC THERAPIES,ADM012,CHEMOTHERAPY,008,AUTOLOGOUS BONE MARROW TRANSPLANT OR T-CELL IMMUNOTHERAPY,17,"MYELOPROLIFERATIVE DISEASES AND DISORDERS, AND POORLY DIFFERENTIATED NEOPLASM",4,Extreme,Major,Surgical,Medicare,Private Health Insurance,,,,N,910969.23,401628.09
New York City,Bronx,7000006,001169,Montefiore Medical Center - Henry & Lucy Moses Div,70 or Older,105,F,Other Race,Unknown,25,Elective,Home w/ Home Health Services,2020,NEO058,NON-HODGKIN LYMPHOMA,ADM011,"ADMINISTRATION AND TRANSFUSION OF BONE MARROW, STEM CELLS, PANCREATIC ISLET CELLS, AND T-CELLS",008,AUTOLOGOUS BONE MARROW TRANSPLANT OR T-CELL IMMUNOTHERAPY,17,"MYELOPROLIFERATIVE DISEASES AND DISORDERS, AND POORLY DIFFERENTIATED NEOPLASM",2,Moderate,Minor,Surgical,Medicare,Private Health Insurance,,,,N,663497.62,110375.65
New York City,Manhattan,7002024,001456,Mount Sinai Hospital,50 to 69,114,F,Black/African American,Not Span/Hispanic,17,Elective,Home or Self Care,2020,NEO065,MULTIPLE MYELOMA,ADM011,"ADMINISTRATION AND TRANSFUSION OF BONE MARROW, STEM CELLS, PANCREATIC ISLET CELLS, AND T-CELLS",008,AUTOLOGOUS BONE MARROW TRANSPLANT OR T-CELL IMMUNOTHERAPY,17,"MYELOPROLIFERATIVE DISEASES AND DISORDERS, AND POORLY DIFFERENTIATED NEOPLASM",3,Major,Moderate,Surgical,Private Health Insurance,Self-Pay,,,,N,210191.07,55995.6
New York City,Manhattan,7002024,001456,Mount Sinai Hospital,50 to 69,117,F,Other Race,Spanish/Hispanic,18,Elective,Home or Self Care,2020,NEO058,NON-HODGKIN LYMPHOMA,ADM011,"ADMINISTRATION AND TRANSFUSION OF BONE MARROW, STEM CELLS, PANCREATIC ISLET CELLS, AND T-CELLS",008,AUTOLOGOUS BONE MARROW TRANSPLANT OR T-CELL IMMUNOTHERAPY,17,"MYELOPROLIFERATIVE DISEASES AND DISORDERS, AND POORLY DIFFERENTIATED NEOPLASM",2,Moderate,Moderate,Surgical,Blue Cross/Blue Shield,Self-Pay,,,,N,282864.3,86914.54
New York City,Manhattan,7002053,001463,NYU Langone Hospitals,50 to 69,112,F,White,Not Span/Hispanic,13,Elective,Home or Self Care,2020,NEO065,MULTIPLE MYELOMA,ADM011,"ADMINISTRATION AND TRANSFUSION OF BONE MARROW, STEM CELLS, PANCREATIC ISLET CELLS, AND T-CELLS",008,AUTOLOGOUS BONE MARROW TRANSPLANT OR T-CELL IMMUNOTHERAPY,17,"MYELOPROLIFERATIVE DISEASES AND DISORDERS, AND POORLY DIFFERENTIATED NEOPLASM",2,Moderate,Moderate,Surgical,Blue Cross/Blue Shield,,,,,N,272222.96,54941.08
New York City,Manhattan,7002053,001463,NYU Langone Hospitals,50 to 69,117,F,White,Not Span/Hispanic,15,Elective,Home or Self Care,2020,NEO065,MULTIPLE MYELOMA,ADM011,"ADMINISTRATION AND TRANSFUSION OF BONE MARROW, STEM CELLS, PANCREATIC ISLET CELLS, AND T-CELLS",008,AUTOLOGOUS BONE MARROW TRANSPLANT OR T-CELL IMMUNOTHERAPY,17,"MYELOPROLIFERATIVE DISEASES AND DISORDERS, AND POORLY DIFFERENTIATED NEOPLASM",3,Major,Minor,Surgical,Medicare,,,,,N,329574.41,65832.83
New York City,Manhattan,7002053,001463,NYU Langone Hospitals,50 to 69,113,F,White,Not Span/Hispanic,22,Elective,Home or Self Care,2020,NEO058,NON-HODGKIN LYMPHOMA,ADM011,"ADMINISTRATION AND TRANSFUSION OF BONE MARROW, STEM CELLS, PANCREATIC ISLET CELLS, AND T-CELLS",008,AUTOLOGOUS BONE MARROW TRANSPLANT OR T-CELL IMMUNOTHERAPY,17,"MYELOPROLIFERATIVE DISEASES AND DISORDERS, AND POORLY DIFFERENTIATED NEOPLASM",3,Major,Moderate,Surgical,Medicare,Private Health Insurance,,,,N,718671.33,108849.13
New York City,Manhattan,7002053,001463,NYU Langone Hospitals,70 or Older,100,M,White,Not Span/Hispanic,18,Elective,Home or Self Care,2020,NEO058,NON-HODGKIN LYMPHOMA,ADM012,CHEMOTHERAPY,008,AUTOLOGOUS BONE MARROW TRANSPLANT OR T-CELL IMMUNOTHERAPY,17,"MYELOPROLIFERATIVE DISEASES AND DISORDERS, AND POORLY DIFFERENTIATED NEOPLASM",2,Moderate,Moderate,Surgical,Private Health Insurance,Medicare,,,,N,648183.74,89463.54
New York City,Manhattan,7002024,001456,Mount Sinai Hospital,50 to 69,100,F,Other Race,Spanish/Hispanic,15,Elective,Home or Self Care,2020,FAC006,ENCOUNTER FOR ANTINEOPLASTIC THERAPIES,ADM011,"ADMINISTRATION AND TRANSFUSION OF BONE MARROW, STEM CELLS, PANCREATIC ISLET CELLS, AND T-CELLS",008,AUTOLOGOUS BONE MARROW TRANSPLANT OR T-CELL IMMUNOTHERAPY,17,"MYELOPROLIFERATIVE DISEASES AND DISORDERS, AND POORLY DIFFERENTIATED NEOPLASM",3,Major,Moderate,Surgical,Blue Cross/Blue Shield,Self-Pay,,,,N,192130.6,52132.69
New York City,Bronx,7000006,001169,Montefiore Medical Center - Henry & Lucy Moses Div,50 to 69,104,M,Other Race,Unknown,10,Elective,Home or Self Care,2020,NEO058,NON-HODGKIN LYMPHOMA,ADM012,CHEMOTHERAPY,008,AUTOLOGOUS BONE MARROW TRANSPLANT OR T-CELL IMMUNOTHERAPY,17,"MYELOPROLIFERATIVE DISEASES AND DISORDERS, AND POORLY DIFFERENTIATED NEOPLASM",3,Major,Minor,Surgical,Medicare,,,,,N,2738640.79,572617.17
New York City,Bronx,7000006,001169,Montefiore Medical Center - Henry & Lucy Moses Div,50 to 69,104,M,White,Spanish/Hispanic,17,Elective,Home or Self Care,2020,NEO065,MULTIPLE MYELOMA,ADM011,"ADMINISTRATION AND TRANSFUSION OF BONE MARROW, STEM CELLS, PANCREATIC ISLET CELLS, AND T-CELLS",008,AUTOLOGOUS BONE MARROW TRANSPLANT OR T-CELL IMMUNOTHERAPY,17,"MYELOPROLIFERATIVE DISEASES AND DISORDERS, AND POORLY DIFFERENTIATED NEOPLASM",3,Major,Major,Surgical,Medicare,,,,,N,376796.39,65946.03
New York City,Manhattan,7002054,001464,New York-Presbyterian Hospital - Columbia Presbyterian Center,70 or Older,117,M,White,Not Span/Hispanic,21,Elective,Home w/ Home Health Services,2020,NEO058,NON-HODGKIN LYMPHOMA,ADM011,"ADMINISTRATION AND TRANSFUSION OF BONE MARROW, STEM CELLS, PANCREATIC ISLET CELLS, AND T-CELLS",008,AUTOLOGOUS BONE MARROW TRANSPLANT OR T-CELL IMMUNOTHERAPY,17,"MYELOPROLIFERATIVE DISEASES AND DISORDERS, AND POORLY DIFFERENTIATED NEOPLASM",3,Major,Major,Surgical,Medicare,Blue Cross/Blue Shield,Self-Pay,,,N,364495.28,100780
New York City,Manhattan,7002054,001464,New York-Presbyterian Hospital - Columbia Presbyterian Center,50 to 69,103,F,White,Not Span/Hispanic,20,Urgent,Home or Self Care,2020,NEO065,MULTIPLE MYELOMA,CAR024,VENOUS AND ARTERIAL CATHETER PLACEMENT,008,AUTOLOGOUS BONE MARROW TRANSPLANT OR T-CELL IMMUNOTHERAPY,17,"MYELOPROLIFERATIVE DISEASES AND DISORDERS, AND POORLY DIFFERENTIATED NEOPLASM",3,Major,Major,Surgical,Self-Pay,Self-Pay,,,,N,314551.88,75128.01
New York City,Manhattan,7002054,001458,New York-Presbyterian Hospital - New York Weill Cornell Center,18 to 29,105,M,Other Race,Not Span/Hispanic,21,Elective,Home or Self Care,2020,NEO057,HODGKIN LYMPHOMA,ADM011,"ADMINISTRATION AND TRANSFUSION OF BONE MARROW, STEM CELLS, PANCREATIC ISLET CELLS, AND T-CELLS",008,AUTOLOGOUS BONE MARROW TRANSPLANT OR T-CELL IMMUNOTHERAPY,17,"MYELOPROLIFERATIVE DISEASES AND DISORDERS, AND POORLY DIFFERENTIATED NEOPLASM",3,Major,Moderate,Surgical,Private Health Insurance,,,,,N,370757.59,97768.19
New York City,Manhattan,7002053,001463,NYU Langone Hospitals,30 to 49,101,F,Other Race,Not Span/Hispanic,15,Elective,Home w/ Home Health Services,2020,NEO065,MULTIPLE MYELOMA,ADM011,"ADMINISTRATION AND TRANSFUSION OF BONE MARROW, STEM CELLS, PANCREATIC ISLET CELLS, AND T-CELLS",008,AUTOLOGOUS BONE MARROW TRANSPLANT OR T-CELL IMMUNOTHERAPY,17,"MYELOPROLIFERATIVE DISEASES AND DISORDERS, AND POORLY DIFFERENTIATED NEOPLASM",3,Major,Major,Surgical,Medicaid,,,,,N,297672.38,61579.52
New York City,Manhattan,7002024,001456,Mount Sinai Hospital,50 to 69,100,M,White,Not Span/Hispanic,22,Elective,Home or Self Care,2020,NEO065,MULTIPLE MYELOMA,ADM011,"ADMINISTRATION AND TRANSFUSION OF BONE MARROW, STEM CELLS, PANCREATIC ISLET CELLS, AND T-CELLS",008,AUTOLOGOUS BONE MARROW TRANSPLANT OR T-CELL IMMUNOTHERAPY,17,"MYELOPROLIFERATIVE DISEASES AND DISORDERS, AND POORLY DIFFERENTIATED NEOPLASM",3,Major,Major,Surgical,Private Health Insurance,Self-Pay,,,,N,270004.19,71603.63
New York City,Manhattan,7002054,001458,New York-Presbyterian Hospital - New York Weill Cornell Center,50 to 69,113,M,Other Race,Spanish/Hispanic,27,Emergency,Home or Self Care,2020,NEO058,NON-HODGKIN LYMPHOMA,ADM011,"ADMINISTRATION AND TRANSFUSION OF BONE MARROW, STEM CELLS, PANCREATIC ISLET CELLS, AND T-CELLS",008,AUTOLOGOUS BONE MARROW TRANSPLANT OR T-CELL IMMUNOTHERAPY,17,"MYELOPROLIFERATIVE DISEASES AND DISORDERS, AND POORLY DIFFERENTIATED NEOPLASM",4,Extreme,Major,Surgical,"Managed Care, Unspecified",Medicaid,Self-Pay,,,N,621596.67,190179.21
New York City,Manhattan,7002054,001458,New York-Presbyterian Hospital - New York Weill Cornell Center,50 to 69,115,M,White,Not Span/Hispanic,19,Elective,Home or Self Care,2020,NEO058,NON-HODGKIN LYMPHOMA,ADM011,"ADMINISTRATION AND TRANSFUSION OF BONE MARROW, STEM CELLS, PANCREATIC ISLET CELLS, AND T-CELLS",008,AUTOLOGOUS BONE MARROW TRANSPLANT OR T-CELL IMMUNOTHERAPY,17,"MYELOPROLIFERATIVE DISEASES AND DISORDERS, AND POORLY DIFFERENTIATED NEOPLASM",3,Major,Moderate,Surgical,Private Health Insurance,Self-Pay,,,,N,482135.78,161371.71
New York City,Manhattan,7002054,001458,New York-Presbyterian Hospital - New York Weill Cornell Center,50 to 69,112,M,Other Race,Not Span/Hispanic,18,Elective,Home or Self Care,2020,NEO058,NON-HODGKIN LYMPHOMA,ADM011,"ADMINISTRATION AND TRANSFUSION OF BONE MARROW, STEM CELLS, PANCREATIC ISLET CELLS, AND T-CELLS",008,AUTOLOGOUS BONE MARROW TRANSPLANT OR T-CELL IMMUNOTHERAPY,17,"MYELOPROLIFERATIVE DISEASES AND DISORDERS, AND POORLY DIFFERENTIATED NEOPLASM",3,Major,Moderate,Surgical,Private Health Insurance,Medicaid,Self-Pay,,,N,420348.95,145911.5
New York City,Manhattan,7002054,001458,New York-Presbyterian Hospital - New York Weill Cornell Center,70 or Older,OOS,F,White,Not Span/Hispanic,23,Elective,Home w/ Home Health Services,2020,NEO058,NON-HODGKIN LYMPHOMA,ADM012,CHEMOTHERAPY,008,AUTOLOGOUS BONE MARROW TRANSPLANT OR T-CELL IMMUNOTHERAPY,17,"MYELOPROLIFERATIVE DISEASES AND DISORDERS, AND POORLY DIFFERENTIATED NEOPLASM",3,Major,Moderate,Surgical,Medicare,Private Health Insurance,Self-Pay,,,N,1671731.71,732385.74
New York City,Manhattan,7002054,001458,New York-Presbyterian Hospital - New York Weill Cornell Center,50 to 69,OOS,M,White,Not Span/Hispanic,18,Elective,Home or Self Care,2020,NEO058,NON-HODGKIN LYMPHOMA,ADM011,"ADMINISTRATION AND TRANSFUSION OF BONE MARROW, STEM CELLS, PANCREATIC ISLET CELLS, AND T-CELLS",008,AUTOLOGOUS BONE MARROW TRANSPLANT OR T-CELL IMMUNOTHERAPY,17,"MYELOPROLIFERATIVE DISEASES AND DISORDERS, AND POORLY DIFFERENTIATED NEOPLASM",3,Major,Major,Surgical,Private Health Insurance,Self-Pay,,,,N,415008.15,150596.28
New York City,Bronx,7000006,001169,Montefiore Medical Center - Henry & Lucy Moses Div,50 to 69,104,M,Black/African American,Unknown,18,Elective,Home or Self Care,2020,NEO065,MULTIPLE MYELOMA,ADM011,"ADMINISTRATION AND TRANSFUSION OF BONE MARROW, STEM CELLS, PANCREATIC ISLET CELLS, AND T-CELLS",008,AUTOLOGOUS BONE MARROW TRANSPLANT OR T-CELL IMMUNOTHERAPY,17,"MYELOPROLIFERATIVE DISEASES AND DISORDERS, AND POORLY DIFFERENTIATED NEOPLASM",3,Major,Major,Surgical,Medicaid,,,,,N,402464.3,71442.65