Hospital Service Area,Hospital County,Operating Certificate Number,Permanent Facility Id,Facility Name,Age Group,Zip Code - 3 digits,Gender,Race,Ethnicity,Length of Stay,Type of Admission,Patient Disposition,Discharge Year,CCS Diagnosis Code,CCS Diagnosis Description,CCS Procedure Code,CCS Procedure Description,APR DRG Code,APR DRG Description,APR MDC Code,APR MDC Description,APR Severity of Illness Code,APR Severity of Illness Description,APR Risk of Mortality,APR Medical Surgical Description,Payment Typology 1,Payment Typology 2,Payment Typology 3,Birth Weight,Abortion Edit Indicator,Emergency Department Indicator,Total Charges,Total Costs
New York City,Manhattan,7002024,001456,Mount Sinai Hospital,70 or Older,113,M,Other Race,Not Span/Hispanic,3,Urgent,Home w/ Home Health Services,2020,DIG024,POSTPROCEDURAL OR POSTOPERATIVE DIGESTIVE SYSTEM COMPLICATION,MAM015,"MEASUREMENT AND MONITORING, NEC",810,HEMORRHAGE OR HEMATOMA DUE TO COMPLICATION,21,"INJURIES, POISONINGS AND TOXIC EFFECTS OF DRUGS",4,Extreme,Extreme,Medical,Medicare,Medicare,Medicaid,,,N,34810.2,9177.36
New York City,Bronx,7000006,001169,Montefiore Medical Center - Henry & Lucy Moses Div,70 or Older,104,F,White,Not Span/Hispanic,3,Emergency,Skilled Nursing Home,2020,DIG024,POSTPROCEDURAL OR POSTOPERATIVE DIGESTIVE SYSTEM COMPLICATION,,,810,HEMORRHAGE OR HEMATOMA DUE TO COMPLICATION,21,"INJURIES, POISONINGS AND TOXIC EFFECTS OF DRUGS",2,Moderate,Minor,Medical,Medicare,Medicaid,,,,N,32875.77,6398.23
New York City,Bronx,7000006,001169,Montefiore Medical Center - Henry & Lucy Moses Div,0 to 17,127,M,White,Not Span/Hispanic,1,Emergency,Home or Self Care,2020,RSP017,POSTPROCEDURAL OR POSTOPERATIVE RESPIRATORY SYSTEM COMPLICATION,,,810,HEMORRHAGE OR HEMATOMA DUE TO COMPLICATION,21,"INJURIES, POISONINGS AND TOXIC EFFECTS OF DRUGS",1,Minor,Minor,Medical,Private Health Insurance,,,,,Y,13464,3402.53
Long Island,Nassau,2908000,000511,NYU Langone Hospital-Long Island,50 to 69,115,M,White,Not Span/Hispanic,3,Emergency,Home or Self Care,2020,DIG024,POSTPROCEDURAL OR POSTOPERATIVE DIGESTIVE SYSTEM COMPLICATION,ADM001,TRANSFUSION OF BLOOD AND BLOOD PRODUCTS,810,HEMORRHAGE OR HEMATOMA DUE TO COMPLICATION,21,"INJURIES, POISONINGS AND TOXIC EFFECTS OF DRUGS",2,Moderate,Moderate,Medical,Private Health Insurance,,,,,Y,61610.1,13857.53
Long Island,Nassau,2908000,000511,NYU Langone Hospital-Long Island,50 to 69,117,M,White,Not Span/Hispanic,1,Emergency,Home or Self Care,2020,DIG024,POSTPROCEDURAL OR POSTOPERATIVE DIGESTIVE SYSTEM COMPLICATION,GNR004,ENDOSCOPIC CONTROL OF BLEEDING,810,HEMORRHAGE OR HEMATOMA DUE TO COMPLICATION,21,"INJURIES, POISONINGS AND TOXIC EFFECTS OF DRUGS",1,Minor,Minor,Medical,Medicare,Medicare,,,,Y,55458.7,11165.21
New York City,Manhattan,7002054,001464,New York-Presbyterian Hospital - Columbia Presbyterian Center,70 or Older,100,F,Other Race,Not Span/Hispanic,9,Emergency,Home or Self Care,2020,DIG024,POSTPROCEDURAL OR POSTOPERATIVE DIGESTIVE SYSTEM COMPLICATION,CAR024,VENOUS AND ARTERIAL CATHETER PLACEMENT,810,HEMORRHAGE OR HEMATOMA DUE TO COMPLICATION,21,"INJURIES, POISONINGS AND TOXIC EFFECTS OF DRUGS",4,Extreme,Extreme,Medical,Medicare,Medicare,Medicaid,,,Y,190348.66,65922.68
New York City,Manhattan,7002054,001464,New York-Presbyterian Hospital - Columbia Presbyterian Center,30 to 49,115,F,White,Not Span/Hispanic,4,Urgent,Home or Self Care,2020,RSP017,POSTPROCEDURAL OR POSTOPERATIVE RESPIRATORY SYSTEM COMPLICATION,RES001,BRONCHOSCOPY (DIAGNOSTIC),810,HEMORRHAGE OR HEMATOMA DUE TO COMPLICATION,21,"INJURIES, POISONINGS AND TOXIC EFFECTS OF DRUGS",4,Extreme,Major,Medical,Blue Cross/Blue Shield,Self-Pay,,,,N,114475.98,40707.01
New York City,Queens,7003010,001637,New York - Presbyterian/Queens,50 to 69,113,M,White,Not Span/Hispanic,4,Emergency,Home w/ Home Health Services,2020,SKN006,POSTPROCEDURAL OR POSTOPERATIVE SKIN COMPLICATION,ESA003,MECHANICAL VENTILATION,810,HEMORRHAGE OR HEMATOMA DUE TO COMPLICATION,21,"INJURIES, POISONINGS AND TOXIC EFFECTS OF DRUGS",3,Major,Major,Medical,Medicare,Medicaid,Self-Pay,,,Y,59276.15,14608.19
New York City,Manhattan,7002024,001456,Mount Sinai Hospital,30 to 49,109,M,Other Race,Unknown,1,Urgent,Home or Self Care,2020,RSP017,POSTPROCEDURAL OR POSTOPERATIVE RESPIRATORY SYSTEM COMPLICATION,GNR004,ENDOSCOPIC CONTROL OF BLEEDING,810,HEMORRHAGE OR HEMATOMA DUE TO COMPLICATION,21,"INJURIES, POISONINGS AND TOXIC EFFECTS OF DRUGS",1,Minor,Minor,Medical,Private Health Insurance,Self-Pay,,,,N,27509.21,7431.61
New York City,Queens,7003010,001637,New York - Presbyterian/Queens,50 to 69,117,M,Other Race,Not Span/Hispanic,1,Emergency,Home or Self Care,2020,DIG024,POSTPROCEDURAL OR POSTOPERATIVE DIGESTIVE SYSTEM COMPLICATION,GNR004,ENDOSCOPIC CONTROL OF BLEEDING,810,HEMORRHAGE OR HEMATOMA DUE TO COMPLICATION,21,"INJURIES, POISONINGS AND TOXIC EFFECTS OF DRUGS",1,Minor,Minor,Medical,Private Health Insurance,Self-Pay,,,,Y,17211.89,5812.23
New York City,Queens,7003010,001637,New York - Presbyterian/Queens,30 to 49,113,M,Other Race,Not Span/Hispanic,4,Emergency,Home or Self Care,2020,DIG024,POSTPROCEDURAL OR POSTOPERATIVE DIGESTIVE SYSTEM COMPLICATION,GIS004,GI SYSTEM ENDOSCOPY WITHOUT BIOPSY (DIAGNOSTIC),810,HEMORRHAGE OR HEMATOMA DUE TO COMPLICATION,21,"INJURIES, POISONINGS AND TOXIC EFFECTS OF DRUGS",3,Major,Moderate,Medical,Private Health Insurance,Medicaid,Self-Pay,,,Y,40026.26,10272.81
New York City,Manhattan,7002053,001463,NYU Langone Hospitals,30 to 49,117,F,Black/African American,Not Span/Hispanic,2,Emergency,Home or Self Care,2020,DIG024,POSTPROCEDURAL OR POSTOPERATIVE DIGESTIVE SYSTEM COMPLICATION,,,810,HEMORRHAGE OR HEMATOMA DUE TO COMPLICATION,21,"INJURIES, POISONINGS AND TOXIC EFFECTS OF DRUGS",2,Moderate,Minor,Medical,Private Health Insurance,,,,,Y,32360.72,8586.62
New York City,Queens,7003010,001637,New York - Presbyterian/Queens,70 or Older,113,M,Other Race,Not Span/Hispanic,4,Emergency,Home or Self Care,2020,DIG024,POSTPROCEDURAL OR POSTOPERATIVE DIGESTIVE SYSTEM COMPLICATION,ADM001,TRANSFUSION OF BLOOD AND BLOOD PRODUCTS,810,HEMORRHAGE OR HEMATOMA DUE TO COMPLICATION,21,"INJURIES, POISONINGS AND TOXIC EFFECTS OF DRUGS",2,Moderate,Moderate,Medical,Medicare,Medicare,Self-Pay,,,Y,46744.1,9672.05
New York City,Manhattan,7002054,001458,New York-Presbyterian Hospital - New York Weill Cornell Center,18 to 29,112,F,Other Race,Spanish/Hispanic,2,Emergency,Home or Self Care,2020,NVS021,POSTPROCEDURAL OR POSTOPERATIVE NERVOUS SYSTEM COMPLICATION,IMG006,COMPUTERIZED TOMOGRAPHY (CT) WITH CONTRAST,810,HEMORRHAGE OR HEMATOMA DUE TO COMPLICATION,21,"INJURIES, POISONINGS AND TOXIC EFFECTS OF DRUGS",4,Extreme,Extreme,Medical,"Managed Care, Unspecified",Medicaid,Self-Pay,,,Y,49723.74,21926.38
New York City,Kings,7001021,001306,New York - Presbyterian Brooklyn Methodist Hospital,50 to 69,112,M,Black/African American,Not Span/Hispanic,3,Emergency,Home or Self Care,2020,DIG024,POSTPROCEDURAL OR POSTOPERATIVE DIGESTIVE SYSTEM COMPLICATION,ADM001,TRANSFUSION OF BLOOD AND BLOOD PRODUCTS,810,HEMORRHAGE OR HEMATOMA DUE TO COMPLICATION,21,"INJURIES, POISONINGS AND TOXIC EFFECTS OF DRUGS",2,Moderate,Moderate,Medical,Medicare,Medicaid,Self-Pay,,,Y,21088.3,5318.95
New York City,Kings,7001021,001306,New York - Presbyterian Brooklyn Methodist Hospital,30 to 49,113,F,White,Not Span/Hispanic,1,Emergency,Home or Self Care,2020,DIG024,POSTPROCEDURAL OR POSTOPERATIVE DIGESTIVE SYSTEM COMPLICATION,,,810,HEMORRHAGE OR HEMATOMA DUE TO COMPLICATION,21,"INJURIES, POISONINGS AND TOXIC EFFECTS OF DRUGS",2,Moderate,Minor,Medical,Medicare,Medicare,Medicaid,,,Y,7502.25,1982.9
New York City,Kings,7001021,001306,New York - Presbyterian Brooklyn Methodist Hospital,70 or Older,112,M,Black/African American,Not Span/Hispanic,2,Emergency,Home or Self Care,2020,GEN026,POSTPROCEDURAL OR POSTOPERATIVE GENITOURINARY SYSTEM COMPLICATION,ADM018,IRRIGATION (DIAGNOSTIC AND THERAPEUTIC),810,HEMORRHAGE OR HEMATOMA DUE TO COMPLICATION,21,"INJURIES, POISONINGS AND TOXIC EFFECTS OF DRUGS",2,Moderate,Minor,Medical,Blue Cross/Blue Shield,Medicare,Self-Pay,,,Y,15145.7,3627.59
New York City,Manhattan,7002024,001456,Mount Sinai Hospital,50 to 69,113,F,Other Race,Spanish/Hispanic,3,Emergency,Home or Self Care,2020,RSP017,POSTPROCEDURAL OR POSTOPERATIVE RESPIRATORY SYSTEM COMPLICATION,GNR004,ENDOSCOPIC CONTROL OF BLEEDING,810,HEMORRHAGE OR HEMATOMA DUE TO COMPLICATION,21,"INJURIES, POISONINGS AND TOXIC EFFECTS OF DRUGS",2,Moderate,Moderate,Medical,Private Health Insurance,Self-Pay,,,,Y,48079.92,13323.62
Western NY,Erie,1401005,000210,Erie County Medical Center,70 or Older,140,M,White,Not Span/Hispanic,8,Elective,Home w/ Home Health Services,2020,SKN006,POSTPROCEDURAL OR POSTOPERATIVE SKIN COMPLICATION,ADM001,TRANSFUSION OF BLOOD AND BLOOD PRODUCTS,810,HEMORRHAGE OR HEMATOMA DUE TO COMPLICATION,21,"INJURIES, POISONINGS AND TOXIC EFFECTS OF DRUGS",3,Major,Major,Medical,Medicare,Medicare,,,,N,43792.15,22829.54
New York City,Manhattan,7002032,001466,Mount Sinai West,50 to 69,OOS,M,Other Race,Not Span/Hispanic,18,Urgent,Home w/ Home Health Services,2020,DIG024,POSTPROCEDURAL OR POSTOPERATIVE DIGESTIVE SYSTEM COMPLICATION,CAR024,VENOUS AND ARTERIAL CATHETER PLACEMENT,810,HEMORRHAGE OR HEMATOMA DUE TO COMPLICATION,21,"INJURIES, POISONINGS AND TOXIC EFFECTS OF DRUGS",3,Major,Moderate,Medical,Federal/State/Local/VA,Blue Cross/Blue Shield,Self-Pay,,,N,340059.21,78673.62
New York City,Manhattan,7002024,001456,Mount Sinai Hospital,18 to 29,113,M,Other Race,Not Span/Hispanic,4,Elective,Home or Self Care,2020,DIG024,POSTPROCEDURAL OR POSTOPERATIVE DIGESTIVE SYSTEM COMPLICATION,HEP010,HEPATOBILIARY AND PANCREATIC DRAINAGE,810,HEMORRHAGE OR HEMATOMA DUE TO COMPLICATION,21,"INJURIES, POISONINGS AND TOXIC EFFECTS OF DRUGS",4,Extreme,Major,Medical,Medicaid,Self-Pay,,,,N,64120.66,15713.06
New York City,Manhattan,7002053,001463,NYU Langone Hospitals,30 to 49,100,F,Other Race,Not Span/Hispanic,1,Emergency,Home or Self Care,2020,DIG024,POSTPROCEDURAL OR POSTOPERATIVE DIGESTIVE SYSTEM COMPLICATION,GNR004,ENDOSCOPIC CONTROL OF BLEEDING,810,HEMORRHAGE OR HEMATOMA DUE TO COMPLICATION,21,"INJURIES, POISONINGS AND TOXIC EFFECTS OF DRUGS",1,Minor,Minor,Medical,Private Health Insurance,,,,,Y,47075.43,8395.89
New York City,Bronx,7000006,001168,Montefiore Medical Center-Wakefield Hospital,70 or Older,104,M,Black/African American,Not Span/Hispanic,4,Emergency,Home or Self Care,2020,GEN026,POSTPROCEDURAL OR POSTOPERATIVE GENITOURINARY SYSTEM COMPLICATION,ADM001,TRANSFUSION OF BLOOD AND BLOOD PRODUCTS,810,HEMORRHAGE OR HEMATOMA DUE TO COMPLICATION,21,"INJURIES, POISONINGS AND TOXIC EFFECTS OF DRUGS",2,Moderate,Moderate,Medical,Medicare,,,,,Y,53218.65,9651.02
New York City,Manhattan,7002053,001463,NYU Langone Hospitals,50 to 69,104,M,White,Not Span/Hispanic,1,Emergency,Home or Self Care,2020,DIG024,POSTPROCEDURAL OR POSTOPERATIVE DIGESTIVE SYSTEM COMPLICATION,GNR004,ENDOSCOPIC CONTROL OF BLEEDING,810,HEMORRHAGE OR HEMATOMA DUE TO COMPLICATION,21,"INJURIES, POISONINGS AND TOXIC EFFECTS OF DRUGS",2,Moderate,Major,Medical,Private Health Insurance,,,,,Y,48819.34,8433.58
New York City,Manhattan,7002024,001456,Mount Sinai Hospital,30 to 49,115,F,White,Not Span/Hispanic,1,Emergency,Home or Self Care,2020,DIG024,POSTPROCEDURAL OR POSTOPERATIVE DIGESTIVE SYSTEM COMPLICATION,GNR004,ENDOSCOPIC CONTROL OF BLEEDING,810,HEMORRHAGE OR HEMATOMA DUE TO COMPLICATION,21,"INJURIES, POISONINGS AND TOXIC EFFECTS OF DRUGS",2,Moderate,Minor,Medical,Private Health Insurance,Self-Pay,,,,Y,19971.6,5106.39
New York City,Manhattan,7002024,001456,Mount Sinai Hospital,30 to 49,112,F,Other Race,Unknown,1,Emergency,Home or Self Care,2020,GEN026,POSTPROCEDURAL OR POSTOPERATIVE GENITOURINARY SYSTEM COMPLICATION,MAM015,"MEASUREMENT AND MONITORING, NEC",810,HEMORRHAGE OR HEMATOMA DUE TO COMPLICATION,21,"INJURIES, POISONINGS AND TOXIC EFFECTS OF DRUGS",1,Minor,Minor,Medical,Private Health Insurance,Self-Pay,,,,Y,13573.71,3658.06
Finger Lakes,Monroe,2701005,000413,Strong Memorial Hospital,18 to 29,144,F,White,Not Span/Hispanic,3,Emergency,Home or Self Care,2020,SKN006,POSTPROCEDURAL OR POSTOPERATIVE SKIN COMPLICATION,,,810,HEMORRHAGE OR HEMATOMA DUE TO COMPLICATION,21,"INJURIES, POISONINGS AND TOXIC EFFECTS OF DRUGS",2,Moderate,Major,Medical,Medicaid,,,,,Y,9607.92,4499.97
Finger Lakes,Monroe,2701005,000413,Strong Memorial Hospital,50 to 69,146,F,Black/African American,Not Span/Hispanic,1,Emergency,Home w/ Home Health Services,2020,SKN006,POSTPROCEDURAL OR POSTOPERATIVE SKIN COMPLICATION,,,810,HEMORRHAGE OR HEMATOMA DUE TO COMPLICATION,21,"INJURIES, POISONINGS AND TOXIC EFFECTS OF DRUGS",1,Minor,Minor,Medical,Medicare,,,,,Y,5358.08,2177.63
New York City,Bronx,7000006,001169,Montefiore Medical Center - Henry & Lucy Moses Div,0 to 17,107,F,Other Race,Spanish/Hispanic,1,Emergency,Home or Self Care,2020,SKN006,POSTPROCEDURAL OR POSTOPERATIVE SKIN COMPLICATION,,,810,HEMORRHAGE OR HEMATOMA DUE TO COMPLICATION,21,"INJURIES, POISONINGS AND TOXIC EFFECTS OF DRUGS",2,Moderate,Moderate,Medical,Medicaid,,,,,Y,16277.98,3592.44
New York City,Bronx,7000006,001168,Montefiore Medical Center-Wakefield Hospital,70 or Older,104,M,Other Race,Spanish/Hispanic,1,Emergency,Home or Self Care,2020,DIG024,POSTPROCEDURAL OR POSTOPERATIVE DIGESTIVE SYSTEM COMPLICATION,ADM021,"ADMINISTRATION OF THERAPEUTIC SUBSTANCES, NEC",810,HEMORRHAGE OR HEMATOMA DUE TO COMPLICATION,21,"INJURIES, POISONINGS AND TOXIC EFFECTS OF DRUGS",2,Moderate,Moderate,Medical,Medicare,,,,,Y,16845.4,2812.71
Central NY,Cayuga,0501000,000085,Auburn Community Hospital,70 or Older,130,F,White,Not Span/Hispanic,5,Emergency,Home w/ Home Health Services,2020,DIG024,POSTPROCEDURAL OR POSTOPERATIVE DIGESTIVE SYSTEM COMPLICATION,ADM001,TRANSFUSION OF BLOOD AND BLOOD PRODUCTS,810,HEMORRHAGE OR HEMATOMA DUE TO COMPLICATION,21,"INJURIES, POISONINGS AND TOXIC EFFECTS OF DRUGS",2,Moderate,Moderate,Medical,Medicare,Private Health Insurance,,,,Y,26500.08,8575.91
Central NY,Cayuga,0501000,000085,Auburn Community Hospital,70 or Older,130,M,White,Not Span/Hispanic,11,Emergency,Home w/ Home Health Services,2020,GEN026,POSTPROCEDURAL OR POSTOPERATIVE GENITOURINARY SYSTEM COMPLICATION,ADM001,TRANSFUSION OF BLOOD AND BLOOD PRODUCTS,810,HEMORRHAGE OR HEMATOMA DUE TO COMPLICATION,21,"INJURIES, POISONINGS AND TOXIC EFFECTS OF DRUGS",2,Moderate,Moderate,Medical,Medicare,Blue Cross/Blue Shield,,,,Y,45260.55,14935
Central NY,Cayuga,0501000,000085,Auburn Community Hospital,70 or Older,130,F,White,Not Span/Hispanic,3,Emergency,Skilled Nursing Home,2020,SKN006,POSTPROCEDURAL OR POSTOPERATIVE SKIN COMPLICATION,,,810,HEMORRHAGE OR HEMATOMA DUE TO COMPLICATION,21,"INJURIES, POISONINGS AND TOXIC EFFECTS OF DRUGS",4,Extreme,Major,Medical,Medicare,Blue Cross/Blue Shield,,,,Y,17812.45,4143.72
New York City,Manhattan,7002002,001439,Mount Sinai Beth Israel,30 to 49,104,M,Other Race,Unknown,1,Emergency,Home or Self Care,2020,DIG024,POSTPROCEDURAL OR POSTOPERATIVE DIGESTIVE SYSTEM COMPLICATION,GNR004,ENDOSCOPIC CONTROL OF BLEEDING,810,HEMORRHAGE OR HEMATOMA DUE TO COMPLICATION,21,"INJURIES, POISONINGS AND TOXIC EFFECTS OF DRUGS",2,Moderate,Moderate,Medical,Medicaid,Medicaid,Self-Pay,,,Y,38429.84,7362.47
New York City,Manhattan,7002032,001469,Mount Sinai Morningside,50 to 69,100,F,Other Race,Spanish/Hispanic,6,Emergency,Home w/ Home Health Services,2020,SKN006,POSTPROCEDURAL OR POSTOPERATIVE SKIN COMPLICATION,ESA001,HEMODIALYSIS,810,HEMORRHAGE OR HEMATOMA DUE TO COMPLICATION,21,"INJURIES, POISONINGS AND TOXIC EFFECTS OF DRUGS",3,Major,Major,Medical,Private Health Insurance,Medicare,Self-Pay,,,Y,73180.76,17175.78
Capital/Adirond,Columbia,1001000,000146,Columbia Memorial Hospital,30 to 49,,M,Other Race,Unknown,4,Elective,Home or Self Care,2020,DIG024,POSTPROCEDURAL OR POSTOPERATIVE DIGESTIVE SYSTEM COMPLICATION,GNR004,ENDOSCOPIC CONTROL OF BLEEDING,810,HEMORRHAGE OR HEMATOMA DUE TO COMPLICATION,21,"INJURIES, POISONINGS AND TOXIC EFFECTS OF DRUGS",1,Minor,Minor,Medical,Private Health Insurance,,,,,Y,35390.51,19582.97
Central NY,Onondaga,3301008,000636,Crouse Hospital,50 to 69,130,F,White,Not Span/Hispanic,2,Urgent,Home or Self Care,2020,DIG024,POSTPROCEDURAL OR POSTOPERATIVE DIGESTIVE SYSTEM COMPLICATION,GNR004,ENDOSCOPIC CONTROL OF BLEEDING,810,HEMORRHAGE OR HEMATOMA DUE TO COMPLICATION,21,"INJURIES, POISONINGS AND TOXIC EFFECTS OF DRUGS",1,Minor,Minor,Medical,Medicare,Medicare,Blue Cross/Blue Shield,,,Y,13043.08,4785.54
Central NY,Onondaga,3301008,000636,Crouse Hospital,50 to 69,132,M,White,Not Span/Hispanic,3,Emergency,Home or Self Care,2020,DIG024,POSTPROCEDURAL OR POSTOPERATIVE DIGESTIVE SYSTEM COMPLICATION,GNR004,ENDOSCOPIC CONTROL OF BLEEDING,810,HEMORRHAGE OR HEMATOMA DUE TO COMPLICATION,21,"INJURIES, POISONINGS AND TOXIC EFFECTS OF DRUGS",1,Minor,Minor,Medical,Blue Cross/Blue Shield,,,,,Y,23901.66,7905.1
Western NY,Erie,1401014,003067,Millard Fillmore Suburban Hospital,70 or Older,142,M,Black/African American,Not Span/Hispanic,3,Emergency,Home or Self Care,2020,DIG024,POSTPROCEDURAL OR POSTOPERATIVE DIGESTIVE SYSTEM COMPLICATION,GNR004,ENDOSCOPIC CONTROL OF BLEEDING,810,HEMORRHAGE OR HEMATOMA DUE TO COMPLICATION,21,"INJURIES, POISONINGS AND TOXIC EFFECTS OF DRUGS",2,Moderate,Minor,Medical,Medicare,Self-Pay,,,,Y,13728.85,5970.33
Western NY,Erie,1401014,000207,Buffalo General Medical Center,70 or Older,140,M,White,Not Span/Hispanic,5,Emergency,Home or Self Care,2020,DIG024,POSTPROCEDURAL OR POSTOPERATIVE DIGESTIVE SYSTEM COMPLICATION,GIS004,GI SYSTEM ENDOSCOPY WITHOUT BIOPSY (DIAGNOSTIC),810,HEMORRHAGE OR HEMATOMA DUE TO COMPLICATION,21,"INJURIES, POISONINGS AND TOXIC EFFECTS OF DRUGS",1,Minor,Moderate,Medical,Medicare,Self-Pay,,,,Y,31662.51,11996.21
New York City,Bronx,7000006,001169,Montefiore Medical Center - Henry & Lucy Moses Div,0 to 17,104,M,Other Race,Spanish/Hispanic,3,Emergency,Home or Self Care,2020,RSP017,POSTPROCEDURAL OR POSTOPERATIVE RESPIRATORY SYSTEM COMPLICATION,,,810,HEMORRHAGE OR HEMATOMA DUE TO COMPLICATION,21,"INJURIES, POISONINGS AND TOXIC EFFECTS OF DRUGS",2,Moderate,Minor,Medical,Medicaid,,,,,Y,30971.78,7655.99
New York City,Manhattan,7002054,001464,New York-Presbyterian Hospital - Columbia Presbyterian Center,70 or Older,OOS,M,White,Not Span/Hispanic,5,Emergency,Home or Self Care,2020,DIG024,POSTPROCEDURAL OR POSTOPERATIVE DIGESTIVE SYSTEM COMPLICATION,GNR004,ENDOSCOPIC CONTROL OF BLEEDING,810,HEMORRHAGE OR HEMATOMA DUE TO COMPLICATION,21,"INJURIES, POISONINGS AND TOXIC EFFECTS OF DRUGS",3,Major,Major,Medical,Medicare,Blue Cross/Blue Shield,Self-Pay,,,Y,76371.71,17182.7
New York City,Queens,7003010,001637,New York - Presbyterian/Queens,50 to 69,113,M,Other Race,Not Span/Hispanic,6,Emergency,Skilled Nursing Home,2020,MUS037,POSTPROCEDURAL OR POSTOPERATIVE MUSCULOSKELETAL SYSTEM COMPLICATION,ADM001,TRANSFUSION OF BLOOD AND BLOOD PRODUCTS,810,HEMORRHAGE OR HEMATOMA DUE TO COMPLICATION,21,"INJURIES, POISONINGS AND TOXIC EFFECTS OF DRUGS",3,Major,Moderate,Medical,"Managed Care, Unspecified",Medicaid,Self-Pay,,,Y,58660.09,13370.79
New York City,Bronx,7000006,003058,Montefiore Med Center - Jack D Weiler Hosp of A Einstein College Div,70 or Older,104,M,Other Race,Spanish/Hispanic,1,Emergency,Home or Self Care,2020,DIG024,POSTPROCEDURAL OR POSTOPERATIVE DIGESTIVE SYSTEM COMPLICATION,,,810,HEMORRHAGE OR HEMATOMA DUE TO COMPLICATION,21,"INJURIES, POISONINGS AND TOXIC EFFECTS OF DRUGS",1,Minor,Minor,Medical,Medicare,,,,,Y,33719.75,3856.09
New York City,Manhattan,7002024,001456,Mount Sinai Hospital,30 to 49,116,M,Other Race,Spanish/Hispanic,3,Elective,Home or Self Care,2020,SKN006,POSTPROCEDURAL OR POSTOPERATIVE SKIN COMPLICATION,ADM001,TRANSFUSION OF BLOOD AND BLOOD PRODUCTS,810,HEMORRHAGE OR HEMATOMA DUE TO COMPLICATION,21,"INJURIES, POISONINGS AND TOXIC EFFECTS OF DRUGS",3,Major,Major,Medical,Medicaid,Medicaid,Self-Pay,,,N,43155.9,11541.98
New York City,Manhattan,7002054,001458,New York-Presbyterian Hospital - New York Weill Cornell Center,50 to 69,112,M,Other Race,Not Span/Hispanic,1,Emergency,Home or Self Care,2020,DIG024,POSTPROCEDURAL OR POSTOPERATIVE DIGESTIVE SYSTEM COMPLICATION,ADM001,TRANSFUSION OF BLOOD AND BLOOD PRODUCTS,810,HEMORRHAGE OR HEMATOMA DUE TO COMPLICATION,21,"INJURIES, POISONINGS AND TOXIC EFFECTS OF DRUGS",1,Minor,Minor,Medical,Private Health Insurance,Self-Pay,,,,Y,26769.59,6739.34
New York City,Manhattan,7002012,001447,Hospital for Special Surgery,70 or Older,OOS,F,White,Not Span/Hispanic,2,Urgent,Inpatient Rehabilitation Facility,2020,NVS021,POSTPROCEDURAL OR POSTOPERATIVE NERVOUS SYSTEM COMPLICATION,,,810,HEMORRHAGE OR HEMATOMA DUE TO COMPLICATION,21,"INJURIES, POISONINGS AND TOXIC EFFECTS OF DRUGS",2,Moderate,Minor,Medical,Medicare,Private Health Insurance,,,,N,21515,9707.49
New York City,Bronx,7000006,001169,Montefiore Medical Center - Henry & Lucy Moses Div,0 to 17,104,F,Other Race,Spanish/Hispanic,1,Emergency,Home or Self Care,2020,RSP017,POSTPROCEDURAL OR POSTOPERATIVE RESPIRATORY SYSTEM COMPLICATION,,,810,HEMORRHAGE OR HEMATOMA DUE TO COMPLICATION,21,"INJURIES, POISONINGS AND TOXIC EFFECTS OF DRUGS",1,Minor,Minor,Medical,Medicaid,,,,,Y,13132,3383.88
New York City,Bronx,7000006,001169,Montefiore Medical Center - Henry & Lucy Moses Div,0 to 17,107,F,Other Race,Not Span/Hispanic,1,Emergency,Home or Self Care,2020,RSP017,POSTPROCEDURAL OR POSTOPERATIVE RESPIRATORY SYSTEM COMPLICATION,,,810,HEMORRHAGE OR HEMATOMA DUE TO COMPLICATION,21,"INJURIES, POISONINGS AND TOXIC EFFECTS OF DRUGS",2,Moderate,Moderate,Medical,Medicaid,,,,,Y,15805.24,3585.43
Hudson Valley,Rockland,4329000,000779,Good Samaritan Hospital of Suffern,30 to 49,109,M,White,Not Span/Hispanic,3,Emergency,Home or Self Care,2020,DIG024,POSTPROCEDURAL OR POSTOPERATIVE DIGESTIVE SYSTEM COMPLICATION,GNR004,ENDOSCOPIC CONTROL OF BLEEDING,810,HEMORRHAGE OR HEMATOMA DUE TO COMPLICATION,21,"INJURIES, POISONINGS AND TOXIC EFFECTS OF DRUGS",1,Minor,Minor,Medical,Medicaid,,,,,Y,90111.68,18399.73
Finger Lakes,Monroe,2754001,000471,The Unity Hospital of Rochester,70 or Older,144,M,White,Not Span/Hispanic,8,Emergency,Home w/ Home Health Services,2020,GEN026,POSTPROCEDURAL OR POSTOPERATIVE GENITOURINARY SYSTEM COMPLICATION,CAR028,INFERIOR VENA CAVA (IVC) FILTER PROCEDURES,810,HEMORRHAGE OR HEMATOMA DUE TO COMPLICATION,21,"INJURIES, POISONINGS AND TOXIC EFFECTS OF DRUGS",2,Moderate,Major,Medical,Medicare,,,,,Y,39509.74,20943.66
New York City,Kings,7001020,001305,Maimonides Medical Center,70 or Older,112,F,White,Not Span/Hispanic,2,Emergency,Home or Self Care,2020,DIG024,POSTPROCEDURAL OR POSTOPERATIVE DIGESTIVE SYSTEM COMPLICATION,GIS007,GI SYSTEM DRAINAGE (EXCLUDING PARACENTESIS),810,HEMORRHAGE OR HEMATOMA DUE TO COMPLICATION,21,"INJURIES, POISONINGS AND TOXIC EFFECTS OF DRUGS",3,Major,Moderate,Medical,Medicaid,Self-Pay,,,,Y,52734.1,16694.73
New York City,Kings,7001020,001305,Maimonides Medical Center,30 to 49,112,F,Other Race,Not Span/Hispanic,2,Emergency,Home or Self Care,2020,RSP017,POSTPROCEDURAL OR POSTOPERATIVE RESPIRATORY SYSTEM COMPLICATION,ADM001,TRANSFUSION OF BLOOD AND BLOOD PRODUCTS,810,HEMORRHAGE OR HEMATOMA DUE TO COMPLICATION,21,"INJURIES, POISONINGS AND TOXIC EFFECTS OF DRUGS",2,Moderate,Moderate,Medical,Medicaid,Medicaid,Self-Pay,,,Y,29526,8115.23
Capital/Adirond,Montgomery,2801001,000484,St. Mary's Healthcare,70 or Older,120,F,White,Not Span/Hispanic,3,Emergency,Home or Self Care,2020,DIG024,POSTPROCEDURAL OR POSTOPERATIVE DIGESTIVE SYSTEM COMPLICATION,GIS004,GI SYSTEM ENDOSCOPY WITHOUT BIOPSY (DIAGNOSTIC),810,HEMORRHAGE OR HEMATOMA DUE TO COMPLICATION,21,"INJURIES, POISONINGS AND TOXIC EFFECTS OF DRUGS",2,Moderate,Major,Medical,Medicare,,,,,Y,20255.21,6984.64