Hospital Service Area,Hospital County,Operating Certificate Number,Permanent Facility Id,Facility Name,Age Group,Zip Code - 3 digits,Gender,Race,Ethnicity,Length of Stay,Type of Admission,Patient Disposition,Discharge Year,CCS Diagnosis Code,CCS Diagnosis Description,CCS Procedure Code,CCS Procedure Description,APR DRG Code,APR DRG Description,APR MDC Code,APR MDC Description,APR Severity of Illness Code,APR Severity of Illness Description,APR Risk of Mortality,APR Medical Surgical Description,Payment Typology 1,Payment Typology 2,Payment Typology 3,Birth Weight,Abortion Edit Indicator,Emergency Department Indicator,Total Charges,Total Costs
New York City,Kings,7002002,001324,Mount Sinai Brooklyn,30 to 49,112,F,White,Not Span/Hispanic,2,Emergency,Home or Self Care,2017,244,Other injuries and conditions due to external causes,193,DX ULTRASOUND HEART,811,Allergic reactions,21,"Poisonings, Toxic Effects, Other Injuries and Other Complications of Treatment",2,Moderate,Minor,Medical,Private Health Insurance,Medicaid,Self-Pay,,N,N,22292.51,2620.06
Hudson Valley,Orange,3523000,000699,Orange Regional Medical Center,18 to 29,109,F,Black/African American,Not Span/Hispanic,2,Emergency,Home or Self Care,2017,244,Other injuries and conditions due to external causes,000,NO PROC,811,Allergic reactions,21,"Poisonings, Toxic Effects, Other Injuries and Other Complications of Treatment",2,Moderate,Minor,Medical,Medicaid,,,,N,Y,6526.61,1556.90
New York City,Manhattan,7002032,001469,Mount Sinai St. Luke's,50 to 69,100,F,Black/African American,Not Span/Hispanic,4,Emergency,Home or Self Care,2017,244,Other injuries and conditions due to external causes,216,RESP INTUB/MECH VENTIL,811,Allergic reactions,21,"Poisonings, Toxic Effects, Other Injuries and Other Complications of Treatment",4,Extreme,Extreme,Medical,Medicaid,Medicaid,Self-Pay,,N,Y,57825.71,18357.82
Hudson Valley,Orange,3523000,000699,Orange Regional Medical Center,50 to 69,109,M,Black/African American,Not Span/Hispanic,1,Emergency,Home or Self Care,2017,244,Other injuries and conditions due to external causes,222,BLOOD TRANSFUSION,811,Allergic reactions,21,"Poisonings, Toxic Effects, Other Injuries and Other Complications of Treatment",2,Moderate,Moderate,Medical,Medicare,Medicaid,,,N,Y,12482.22,4723.21
New York City,Manhattan,7002054,001464,New York Presbyterian Hospital - Columbia Presbyterian Center,0 to 17,OOS,F,White,Not Span/Hispanic,2,Emergency,Home or Self Care,2017,238,Complications of surgical procedures or medical care,000,NO PROC,811,Allergic reactions,21,"Poisonings, Toxic Effects, Other Injuries and Other Complications of Treatment",3,Major,Moderate,Medical,Private Health Insurance,Self-Pay,,,N,N,17304.24,5491.70
New York City,Manhattan,7002054,001464,New York Presbyterian Hospital - Columbia Presbyterian Center,70 or Older,100,F,Other Race,Not Span/Hispanic,12,Emergency,Home w/ Home Health Services,2017,244,Other injuries and conditions due to external causes,031,DX PRCS ON NOSE & MOUTH,811,Allergic reactions,21,"Poisonings, Toxic Effects, Other Injuries and Other Complications of Treatment",3,Major,Major,Medical,Medicare,Medicare,Medicaid,,N,Y,111672.48,27394.91
New York City,Manhattan,7002054,001464,New York Presbyterian Hospital - Columbia Presbyterian Center,0 to 17,100,M,White,Not Span/Hispanic,1,Emergency,Home or Self Care,2017,253,Allergic reactions,000,NO PROC,811,Allergic reactions,21,"Poisonings, Toxic Effects, Other Injuries and Other Complications of Treatment",1,Minor,Minor,Medical,Private Health Insurance,Self-Pay,,,N,Y,10325.56,2708.88
Central NY,Onondaga,3301008,000636,Crouse Hospital,70 or Older,130,M,White,Not Span/Hispanic,18,Emergency,Home w/ Home Health Services,2017,244,Other injuries and conditions due to external causes,216,RESP INTUB/MECH VENTIL,811,Allergic reactions,21,"Poisonings, Toxic Effects, Other Injuries and Other Complications of Treatment",4,Extreme,Extreme,Medical,Medicare,,,,N,Y,106866.47,49814.95
Hudson Valley,Rockland,4329000,000779,Good Samaritan Hospital of Suffern,50 to 69,109,F,Black/African American,Not Span/Hispanic,13,Emergency,Inpatient Rehabilitation Facility,2017,253,Allergic reactions,216,RESP INTUB/MECH VENTIL,811,Allergic reactions,21,"Poisonings, Toxic Effects, Other Injuries and Other Complications of Treatment",4,Extreme,Extreme,Medical,Private Health Insurance,,,,N,Y,251846.47,61972.71
Hudson Valley,Rockland,4329000,000779,Good Samaritan Hospital of Suffern,30 to 49,OOS,M,Other Race,Not Span/Hispanic,1,Emergency,Home or Self Care,2017,253,Allergic reactions,000,NO PROC,811,Allergic reactions,21,"Poisonings, Toxic Effects, Other Injuries and Other Complications of Treatment",1,Minor,Minor,Medical,Self-Pay,,,,N,Y,15015.33,3501.39
Hudson Valley,Rockland,4329000,000779,Good Samaritan Hospital of Suffern,70 or Older,109,M,White,Not Span/Hispanic,1,Emergency,Home or Self Care,2017,253,Allergic reactions,000,NO PROC,811,Allergic reactions,21,"Poisonings, Toxic Effects, Other Injuries and Other Complications of Treatment",3,Major,Major,Medical,Medicare,,,,N,Y,30499.18,6608.79
New York City,Kings,7002053,001304,NYU Langone Hospital-Brooklyn,18 to 29,112,F,Other Race,Unknown,1,Emergency,Home or Self Care,2017,238,Complications of surgical procedures or medical care,000,NO PROC,811,Allergic reactions,21,"Poisonings, Toxic Effects, Other Injuries and Other Complications of Treatment",2,Moderate,Moderate,Medical,Medicaid,,,,N,Y,15792.72,3328.65
New York City,Manhattan,7002024,001456,Mount Sinai Hospital,70 or Older,100,F,Black/African American,Not Span/Hispanic,7,Emergency,Home w/ Home Health Services,2017,244,Other injuries and conditions due to external causes,031,DX PRCS ON NOSE & MOUTH,811,Allergic reactions,21,"Poisonings, Toxic Effects, Other Injuries and Other Complications of Treatment",3,Major,Moderate,Medical,Medicare,Medicaid,Self-Pay,,N,Y,67959.19,24670.07
Western NY,Niagara,1401014,000581,Degraff Memorial Hospital,70 or Older,141,F,White,Not Span/Hispanic,2,Emergency,Home w/ Home Health Services,2017,238,Complications of surgical procedures or medical care,054,OT VASC CATH; NOT HEART,811,Allergic reactions,21,"Poisonings, Toxic Effects, Other Injuries and Other Complications of Treatment",2,Moderate,Moderate,Medical,Medicare,Self-Pay,,,N,Y,22271.98,7908.73
Western NY,Erie,1401014,003067,Millard Fillmore Suburban Hospital,50 to 69,142,F,White,Not Span/Hispanic,2,Emergency,Home or Self Care,2017,244,Other injuries and conditions due to external causes,000,NO PROC,811,Allergic reactions,21,"Poisonings, Toxic Effects, Other Injuries and Other Complications of Treatment",3,Major,Major,Medical,Private Health Insurance,Self-Pay,,,N,Y,12533.11,5102.49
Western NY,Erie,1401014,003067,Millard Fillmore Suburban Hospital,50 to 69,140,M,White,Not Span/Hispanic,2,Emergency,Home or Self Care,2017,244,Other injuries and conditions due to external causes,222,BLOOD TRANSFUSION,811,Allergic reactions,21,"Poisonings, Toxic Effects, Other Injuries and Other Complications of Treatment",2,Moderate,Minor,Medical,Blue Cross/Blue Shield,Self-Pay,,,N,Y,14790.33,5660.84
Western NY,Erie,1401014,003067,Millard Fillmore Suburban Hospital,50 to 69,142,M,White,Not Span/Hispanic,1,Emergency,Home or Self Care,2017,244,Other injuries and conditions due to external causes,000,NO PROC,811,Allergic reactions,21,"Poisonings, Toxic Effects, Other Injuries and Other Complications of Treatment",1,Minor,Minor,Medical,Blue Cross/Blue Shield,Self-Pay,,,N,Y,8038.57,2921.22
Hudson Valley,Orange,3523000,000699,Orange Regional Medical Center,0 to 17,109,M,White,Not Span/Hispanic,1,Emergency,Home or Self Care,2017,253,Allergic reactions,000,NO PROC,811,Allergic reactions,21,"Poisonings, Toxic Effects, Other Injuries and Other Complications of Treatment",1,Minor,Minor,Medical,Medicaid,,,,N,Y,5803.46,1415.37
New York City,Kings,7001033,001315,Kingsbrook Jewish Medical Center,70 or Older,112,F,Black/African American,Not Span/Hispanic,3,Emergency,Home or Self Care,2017,244,Other injuries and conditions due to external causes,222,BLOOD TRANSFUSION,811,Allergic reactions,21,"Poisonings, Toxic Effects, Other Injuries and Other Complications of Treatment",3,Major,Moderate,Medical,Medicare,Medicare,Self-Pay,,N,Y,33068.00,8504.94
New York City,Kings,7001033,001315,Kingsbrook Jewish Medical Center,30 to 49,112,F,Black/African American,Not Span/Hispanic,2,Emergency,Home w/ Home Health Services,2017,244,Other injuries and conditions due to external causes,222,BLOOD TRANSFUSION,811,Allergic reactions,21,"Poisonings, Toxic Effects, Other Injuries and Other Complications of Treatment",3,Major,Major,Medical,Medicare,Medicare,Medicaid,,N,N,31910.52,6296.77
New York City,Richmond,7004003,001740,Staten Island University Hosp-North,30 to 49,103,M,White,Not Span/Hispanic,3,Emergency,Home or Self Care,2017,238,Complications of surgical procedures or medical care,000,NO PROC,811,Allergic reactions,21,"Poisonings, Toxic Effects, Other Injuries and Other Complications of Treatment",2,Moderate,Moderate,Medical,Miscellaneous/Other,,,,N,Y,25910.98,4622.61
New York City,Richmond,7004003,001740,Staten Island University Hosp-North,0 to 17,103,M,White,Not Span/Hispanic,1,Emergency,Home or Self Care,2017,238,Complications of surgical procedures or medical care,231,OTHER THERAPEUTIC PRCS,811,Allergic reactions,21,"Poisonings, Toxic Effects, Other Injuries and Other Complications of Treatment",2,Moderate,Minor,Medical,Blue Cross/Blue Shield,,,,N,Y,10526.09,2140.82
Long Island,Suffolk,5149001,000896,St Charles Hospital,50 to 69,117,F,Black/African American,Not Span/Hispanic,4,Emergency,Home w/ Home Health Services,2017,244,Other injuries and conditions due to external causes,222,BLOOD TRANSFUSION,811,Allergic reactions,21,"Poisonings, Toxic Effects, Other Injuries and Other Complications of Treatment",2,Moderate,Moderate,Medical,Blue Cross/Blue Shield,,,,N,Y,31346.00,6641.28
Long Island,Suffolk,5149001,000896,St Charles Hospital,50 to 69,117,F,Black/African American,Not Span/Hispanic,7,Emergency,Home w/ Home Health Services,2017,244,Other injuries and conditions due to external causes,000,NO PROC,811,Allergic reactions,21,"Poisonings, Toxic Effects, Other Injuries and Other Complications of Treatment",2,Moderate,Moderate,Medical,Blue Cross/Blue Shield,,,,N,Y,57353.00,9679.27
Long Island,Suffolk,5149001,000896,St Charles Hospital,0 to 17,117,M,White,Not Span/Hispanic,1,Emergency,Home or Self Care,2017,253,Allergic reactions,000,NO PROC,811,Allergic reactions,21,"Poisonings, Toxic Effects, Other Injuries and Other Complications of Treatment",1,Minor,Minor,Medical,Blue Cross/Blue Shield,,,,N,Y,10333.00,2006.47
Central NY,Jefferson,2201000,000367,Samaritan Medical Center,50 to 69,136,F,White,Not Span/Hispanic,1,Emergency,Left Against Medical Advice,2017,244,Other injuries and conditions due to external causes,222,BLOOD TRANSFUSION,811,Allergic reactions,21,"Poisonings, Toxic Effects, Other Injuries and Other Complications of Treatment",2,Moderate,Minor,Medical,Medicare,Medicaid,Self-Pay,,N,Y,4626.99,1304.52
Hudson Valley,Orange,3523000,000699,Orange Regional Medical Center,50 to 69,109,M,Other Race,Not Span/Hispanic,3,Emergency,Home or Self Care,2017,253,Allergic reactions,000,NO PROC,811,Allergic reactions,21,"Poisonings, Toxic Effects, Other Injuries and Other Complications of Treatment",3,Major,Major,Medical,Medicare,,,,N,Y,30330.61,12423.38
New York City,Manhattan,7002024,001456,Mount Sinai Hospital,18 to 29,112,F,Other Race,Not Span/Hispanic,3,Emergency,Home or Self Care,2017,244,Other injuries and conditions due to external causes,000,NO PROC,811,Allergic reactions,21,"Poisonings, Toxic Effects, Other Injuries and Other Complications of Treatment",2,Moderate,Moderate,Medical,Medicare,Self-Pay,,,N,Y,31927.43,10253.23
Long Island,Nassau,2952006,000551,St. Joseph Hospital,70 or Older,118,F,White,Not Span/Hispanic,2,Emergency,Home or Self Care,2017,244,Other injuries and conditions due to external causes,000,NO PROC,811,Allergic reactions,21,"Poisonings, Toxic Effects, Other Injuries and Other Complications of Treatment",2,Moderate,Moderate,Medical,Medicare,Blue Cross/Blue Shield,,,N,Y,16679.82,3563.09
Long Island,Nassau,2952006,000551,St. Joseph Hospital,70 or Older,117,F,White,Spanish/Hispanic,7,Emergency,Home w/ Home Health Services,2017,244,Other injuries and conditions due to external causes,231,OTHER THERAPEUTIC PRCS,811,Allergic reactions,21,"Poisonings, Toxic Effects, Other Injuries and Other Complications of Treatment",3,Major,Extreme,Medical,Medicare,Medicare,,,N,Y,54980.63,11677.19
Long Island,Suffolk,5154001,000925,Good Samaritan Hospital Medical Center,50 to 69,117,F,White,Not Span/Hispanic,5,Emergency,Home or Self Care,2017,244,Other injuries and conditions due to external causes,000,NO PROC,811,Allergic reactions,21,"Poisonings, Toxic Effects, Other Injuries and Other Complications of Treatment",2,Moderate,Minor,Medical,Medicare,Medicare,Medicaid,,N,Y,48955.00,10893.46
Long Island,Suffolk,5154001,000925,Good Samaritan Hospital Medical Center,50 to 69,117,M,Other Race,Spanish/Hispanic,2,Emergency,Home or Self Care,2017,244,Other injuries and conditions due to external causes,000,NO PROC,811,Allergic reactions,21,"Poisonings, Toxic Effects, Other Injuries and Other Complications of Treatment",1,Minor,Minor,Medical,Medicaid,Medicaid,,,N,Y,16655.00,2889.00
Long Island,Suffolk,5154001,000925,Good Samaritan Hospital Medical Center,70 or Older,117,F,White,Not Span/Hispanic,3,Elective,Home or Self Care,2017,244,Other injuries and conditions due to external causes,222,BLOOD TRANSFUSION,811,Allergic reactions,21,"Poisonings, Toxic Effects, Other Injuries and Other Complications of Treatment",3,Major,Major,Medical,Medicare,Medicare,,,N,N,62678.00,10776.14
Long Island,Suffolk,5157003,000943,St Catherine of Siena Hospital,50 to 69,117,M,White,Not Span/Hispanic,1,Emergency,Left Against Medical Advice,2017,244,Other injuries and conditions due to external causes,000,NO PROC,811,Allergic reactions,21,"Poisonings, Toxic Effects, Other Injuries and Other Complications of Treatment",1,Minor,Minor,Medical,Blue Cross/Blue Shield,,,,N,Y,7984.00,1555.40
Capital/Adirond,Columbia,1001000,000146,Columbia Memorial Hospital,50 to 69,124,F,White,Not Span/Hispanic,1,Emergency,Home or Self Care,2017,244,Other injuries and conditions due to external causes,000,NO PROC,811,Allergic reactions,21,"Poisonings, Toxic Effects, Other Injuries and Other Complications of Treatment",2,Moderate,Minor,Medical,Medicare,,,,N,Y,5066.91,2032.83
Hudson Valley,Rockland,4324000,000776,Nyack Hospital,50 to 69,109,M,White,Not Span/Hispanic,4,Emergency,Home or Self Care,2017,238,Complications of surgical procedures or medical care,216,RESP INTUB/MECH VENTIL,811,Allergic reactions,21,"Poisonings, Toxic Effects, Other Injuries and Other Complications of Treatment",4,Extreme,Extreme,Medical,Medicaid,,,,N,Y,73856.48,13680.17
New York City,Kings,7001021,001306,New York - Presbyterian Brooklyn Methodist Hospital,18 to 29,112,M,Black/African American,Not Span/Hispanic,1,Emergency,Home or Self Care,2017,253,Allergic reactions,000,NO PROC,811,Allergic reactions,21,"Poisonings, Toxic Effects, Other Injuries and Other Complications of Treatment",2,Moderate,Minor,Medical,Medicaid,Medicaid,Self-Pay,,N,Y,12681.50,6202.11
New York City,Kings,7001021,001306,New York - Presbyterian Brooklyn Methodist Hospital,70 or Older,112,F,Black/African American,Not Span/Hispanic,2,Emergency,Home or Self Care,2017,244,Other injuries and conditions due to external causes,031,DX PRCS ON NOSE & MOUTH,811,Allergic reactions,21,"Poisonings, Toxic Effects, Other Injuries and Other Complications of Treatment",3,Major,Moderate,Medical,Medicare,Medicare,Self-Pay,,N,Y,12301.64,3680.97
New York City,Kings,7001035,001318,Wyckoff Heights Medical Center,70 or Older,113,F,White,Not Span/Hispanic,2,Emergency,Home or Self Care,2017,253,Allergic reactions,000,NO PROC,811,Allergic reactions,21,"Poisonings, Toxic Effects, Other Injuries and Other Complications of Treatment",3,Major,Major,Medical,Medicare,Miscellaneous/Other,Self-Pay,,N,Y,16550.19,7016.56
New York City,Kings,7001035,001318,Wyckoff Heights Medical Center,50 to 69,112,F,Other Race,Not Span/Hispanic,1,Emergency,Home or Self Care,2017,253,Allergic reactions,000,NO PROC,811,Allergic reactions,21,"Poisonings, Toxic Effects, Other Injuries and Other Complications of Treatment",1,Minor,Minor,Medical,Medicaid,Miscellaneous/Other,Self-Pay,,N,N,4049.35,2503.21
New York City,Kings,7002002,001324,Mount Sinai Brooklyn,70 or Older,112,M,Other Race,Not Span/Hispanic,1,Emergency,Home or Self Care,2017,244,Other injuries and conditions due to external causes,183,ROUTINE CHEST X-RAY,811,Allergic reactions,21,"Poisonings, Toxic Effects, Other Injuries and Other Complications of Treatment",1,Minor,Minor,Medical,Medicare,Miscellaneous/Other,Medicaid,,N,N,15958.95,2163.96
New York City,Manhattan,7002024,001456,Mount Sinai Hospital,0 to 17,104,F,Black/African American,Not Span/Hispanic,1,Emergency,Home or Self Care,2017,238,Complications of surgical procedures or medical care,000,NO PROC,811,Allergic reactions,21,"Poisonings, Toxic Effects, Other Injuries and Other Complications of Treatment",1,Minor,Minor,Medical,Blue Cross/Blue Shield,Medicaid,Self-Pay,,N,Y,9392.05,6058.28
New York City,Manhattan,7002054,001458,New York Presbyterian Hospital - New York Weill Cornell Center,0 to 17,100,M,Black/African American,Not Span/Hispanic,1,Elective,Home or Self Care,2017,253,Allergic reactions,041,OT NON-OR THER PRC RESP,811,Allergic reactions,21,"Poisonings, Toxic Effects, Other Injuries and Other Complications of Treatment",2,Moderate,Minor,Medical,Blue Cross/Blue Shield,Self-Pay,,,N,N,20283.67,11841.88
New York City,Manhattan,7002054,003975,New York Presbyterian Hospital - Allen Hospital,50 to 69,104,F,Black/African American,Spanish/Hispanic,1,Emergency,Home or Self Care,2017,244,Other injuries and conditions due to external causes,000,NO PROC,811,Allergic reactions,21,"Poisonings, Toxic Effects, Other Injuries and Other Complications of Treatment",1,Minor,Moderate,Medical,Medicare,Medicare,Self-Pay,,N,Y,11311.20,2959.99
Hudson Valley,Sullivan,5263000,000971,Catskill Regional Medical Center,50 to 69,127,M,Black/African American,Not Span/Hispanic,1,Emergency,Home or Self Care,2017,244,Other injuries and conditions due to external causes,000,NO PROC,811,Allergic reactions,21,"Poisonings, Toxic Effects, Other Injuries and Other Complications of Treatment",1,Minor,Minor,Medical,Medicare,,,,N,Y,7572.61,1966.58
New York City,Kings,7001009,001294,Coney Island Hospital,50 to 69,112,M,Black/African American,Not Span/Hispanic,4,Emergency,Home or Self Care,2017,244,Other injuries and conditions due to external causes,216,RESP INTUB/MECH VENTIL,811,Allergic reactions,21,"Poisonings, Toxic Effects, Other Injuries and Other Complications of Treatment",4,Extreme,Major,Medical,Medicaid,Medicaid,,,N,Y,33509.92,16449.05
New York City,Kings,7001016,001301,Kings County Hospital Center,0 to 17,114,F,Black/African American,Not Span/Hispanic,1,Emergency,Home or Self Care,2017,253,Allergic reactions,231,OTHER THERAPEUTIC PRCS,811,Allergic reactions,21,"Poisonings, Toxic Effects, Other Injuries and Other Complications of Treatment",1,Minor,Minor,Medical,Medicaid,Medicaid,,,N,Y,6891.52,4142.33
New York City,Manhattan,7002024,001456,Mount Sinai Hospital,50 to 69,112,F,White,Not Span/Hispanic,1,Emergency,Home or Self Care,2017,253,Allergic reactions,000,NO PROC,811,Allergic reactions,21,"Poisonings, Toxic Effects, Other Injuries and Other Complications of Treatment",1,Minor,Minor,Medical,Private Health Insurance,Self-Pay,,,N,Y,10805.95,3728.99
New York City,Manhattan,7002032,001469,Mount Sinai St. Luke's,70 or Older,100,M,Black/African American,Not Span/Hispanic,4,Emergency,Home or Self Care,2017,244,Other injuries and conditions due to external causes,216,RESP INTUB/MECH VENTIL,811,Allergic reactions,21,"Poisonings, Toxic Effects, Other Injuries and Other Complications of Treatment",2,Moderate,Moderate,Medical,Medicare,Medicare,Self-Pay,,N,Y,60500.74,19606.66
Long Island,Suffolk,5151001,000245,University Hospital,0 to 17,117,F,White,Not Span/Hispanic,1,Urgent,Home or Self Care,2017,253,Allergic reactions,000,NO PROC,811,Allergic reactions,21,"Poisonings, Toxic Effects, Other Injuries and Other Complications of Treatment",2,Moderate,Minor,Medical,Medicaid,,,,N,N,5831.59,1812.82
Long Island,Suffolk,5151001,000245,University Hospital,0 to 17,117,F,White,Spanish/Hispanic,2,Emergency,Home or Self Care,2017,253,Allergic reactions,000,NO PROC,811,Allergic reactions,21,"Poisonings, Toxic Effects, Other Injuries and Other Complications of Treatment",1,Minor,Minor,Medical,Private Health Insurance,,,,N,N,12451.41,3892.90
Long Island,Nassau,2952005,000552,Plainview Hospital,50 to 69,118,M,White,Not Span/Hispanic,1,Emergency,Home or Self Care,2017,244,Other injuries and conditions due to external causes,000,NO PROC,811,Allergic reactions,21,"Poisonings, Toxic Effects, Other Injuries and Other Complications of Treatment",1,Minor,Minor,Medical,Blue Cross/Blue Shield,,,,N,Y,15828.35,5355.04
Long Island,Suffolk,5123000,000885,Brookhaven Memorial Hospital Medical Center Inc,50 to 69,119,F,Black/African American,Not Span/Hispanic,14,Emergency,Home w/ Home Health Services,2017,253,Allergic reactions,000,NO PROC,811,Allergic reactions,21,"Poisonings, Toxic Effects, Other Injuries and Other Complications of Treatment",3,Major,Major,Medical,Medicare,Medicare,Medicaid,,N,Y,100626.45,19371.87
Long Island,Suffolk,5149001,000896,St Charles Hospital,70 or Older,117,F,White,Not Span/Hispanic,2,Emergency,Home or Self Care,2017,244,Other injuries and conditions due to external causes,000,NO PROC,811,Allergic reactions,21,"Poisonings, Toxic Effects, Other Injuries and Other Complications of Treatment",2,Moderate,Moderate,Medical,Medicare,Blue Cross/Blue Shield,,,N,Y,23160.00,4626.41
Long Island,Suffolk,5149001,000896,St Charles Hospital,30 to 49,119,F,Black/African American,Not Span/Hispanic,4,Emergency,Home or Self Care,2017,253,Allergic reactions,000,NO PROC,811,Allergic reactions,21,"Poisonings, Toxic Effects, Other Injuries and Other Complications of Treatment",1,Minor,Minor,Medical,Private Health Insurance,,,,N,Y,36165.00,7051.27
Long Island,Suffolk,5155000,000938,Peconic Bay Medical Center,70 or Older,119,M,White,Spanish/Hispanic,13,Emergency,Skilled Nursing Home,2017,244,Other injuries and conditions due to external causes,216,RESP INTUB/MECH VENTIL,811,Allergic reactions,21,"Poisonings, Toxic Effects, Other Injuries and Other Complications of Treatment",4,Extreme,Extreme,Medical,Medicare,Private Health Insurance,,,N,Y,128229.97,38450.05
Finger Lakes,Monroe,2701003,000411,Rochester General Hospital,50 to 69,145,F,White,Not Span/Hispanic,2,Emergency,Home or Self Care,2017,244,Other injuries and conditions due to external causes,000,NO PROC,811,Allergic reactions,21,"Poisonings, Toxic Effects, Other Injuries and Other Complications of Treatment",2,Moderate,Minor,Medical,Medicare,Medicaid,,,N,Y,13132.86,4855.82
Finger Lakes,Monroe,2701005,000413,Strong Memorial Hospital,0 to 17,146,F,Black/African American,Not Span/Hispanic,1,Emergency,Home or Self Care,2017,244,Other injuries and conditions due to external causes,000,NO PROC,811,Allergic reactions,21,"Poisonings, Toxic Effects, Other Injuries and Other Complications of Treatment",2,Moderate,Minor,Medical,Medicaid,Medicaid,Self-Pay,,N,Y,3635.25,2800.26
Southern Tier,Broome,0303001,000058,United Health Services Hospitals Inc. - Wilson Medical Center,50 to 69,139,M,Other Race,Not Span/Hispanic,1,Emergency,Home or Self Care,2017,244,Other injuries and conditions due to external causes,231,OTHER THERAPEUTIC PRCS,811,Allergic reactions,21,"Poisonings, Toxic Effects, Other Injuries and Other Complications of Treatment",2,Moderate,Minor,Medical,Medicaid,Medicaid,,,N,Y,3818.27,1703.94