Hospital Service Area,Hospital County,Operating Certificate Number,Permanent Facility Id,Facility Name,Age Group,Zip Code - 3 digits,Gender,Race,Ethnicity,Length of Stay,Type of Admission,Patient Disposition,Discharge Year,CCS Diagnosis Code,CCS Diagnosis Description,CCS Procedure Code,CCS Procedure Description,APR DRG Code,APR DRG Description,APR MDC Code,APR MDC Description,APR Severity of Illness Code,APR Severity of Illness Description,APR Risk of Mortality,APR Medical Surgical Description,Payment Typology 1,Payment Typology 2,Payment Typology 3,Birth Weight,Abortion Edit Indicator,Emergency Department Indicator,Total Charges,Total Costs
Long Island,Suffolk,5123000,000885,Brookhaven Memorial Hospital Medical Center Inc,50 to 69,119,F,Black/African American,Not Span/Hispanic,14,Emergency,Home w/ Home Health Services,2017,253,Allergic reactions,000,NO PROC,811,Allergic reactions,21,"Poisonings, Toxic Effects, Other Injuries and Other Complications of Treatment",3,Major,Major,Medical,Medicare,Medicare,Medicaid,,N,Y,100626.45,19371.87
Long Island,Suffolk,5123000,000885,Brookhaven Memorial Hospital Medical Center Inc,50 to 69,119,F,Other Race,Not Span/Hispanic,3,Emergency,Home or Self Care,2017,244,Other injuries and conditions due to external causes,000,NO PROC,811,Allergic reactions,21,"Poisonings, Toxic Effects, Other Injuries and Other Complications of Treatment",2,Moderate,Minor,Medical,Medicare,,,,N,Y,28517.24,4770.07
Long Island,Suffolk,5123000,000885,Brookhaven Memorial Hospital Medical Center Inc,18 to 29,117,F,Black/African American,Not Span/Hispanic,1,Emergency,Home or Self Care,2017,253,Allergic reactions,000,NO PROC,811,Allergic reactions,21,"Poisonings, Toxic Effects, Other Injuries and Other Complications of Treatment",1,Minor,Minor,Medical,Private Health Insurance,,,,N,Y,12789.73,2513.80
Long Island,Suffolk,5123000,000885,Brookhaven Memorial Hospital Medical Center Inc,50 to 69,117,M,White,Not Span/Hispanic,4,Emergency,Home or Self Care,2017,238,Complications of surgical procedures or medical care,231,OTHER THERAPEUTIC PRCS,811,Allergic reactions,21,"Poisonings, Toxic Effects, Other Injuries and Other Complications of Treatment",3,Major,Major,Medical,Medicare,Medicare,Private Health Insurance,,N,Y,35684.57,7088.75
Long Island,Suffolk,5123000,000885,Brookhaven Memorial Hospital Medical Center Inc,70 or Older,119,F,White,Not Span/Hispanic,2,Emergency,Home or Self Care,2017,238,Complications of surgical procedures or medical care,000,NO PROC,811,Allergic reactions,21,"Poisonings, Toxic Effects, Other Injuries and Other Complications of Treatment",2,Moderate,Minor,Medical,Medicare,Medicare,Private Health Insurance,,N,Y,30021.02,4163.69
Long Island,Suffolk,5123000,000885,Brookhaven Memorial Hospital Medical Center Inc,30 to 49,119,F,Other Race,Not Span/Hispanic,3,Emergency,Home or Self Care,2017,253,Allergic reactions,000,NO PROC,811,Allergic reactions,21,"Poisonings, Toxic Effects, Other Injuries and Other Complications of Treatment",2,Moderate,Moderate,Medical,Private Health Insurance,Medicaid,,,N,Y,31254.27,4937.91
Long Island,Suffolk,5123000,000885,Brookhaven Memorial Hospital Medical Center Inc,30 to 49,117,F,White,Not Span/Hispanic,2,Emergency,Home or Self Care,2017,244,Other injuries and conditions due to external causes,000,NO PROC,811,Allergic reactions,21,"Poisonings, Toxic Effects, Other Injuries and Other Complications of Treatment",2,Moderate,Minor,Medical,Blue Cross/Blue Shield,,,,N,Y,24855.20,3035.70
Long Island,Suffolk,5123000,000885,Brookhaven Memorial Hospital Medical Center Inc,50 to 69,117,M,White,Not Span/Hispanic,1,Emergency,Left Against Medical Advice,2017,244,Other injuries and conditions due to external causes,000,NO PROC,811,Allergic reactions,21,"Poisonings, Toxic Effects, Other Injuries and Other Complications of Treatment",1,Minor,Minor,Medical,Private Health Insurance,Medicaid,,,N,Y,12069.59,2428.54
