Hospital Service Area,Hospital County,Operating Certificate Number,Permanent Facility Id,Facility Name,Age Group,Zip Code - 3 digits,Gender,Race,Ethnicity,Length of Stay,Type of Admission,Patient Disposition,Discharge Year,CCS Diagnosis Code,CCS Diagnosis Description,CCS Procedure Code,CCS Procedure Description,APR DRG Code,APR DRG Description,APR MDC Code,APR MDC Description,APR Severity of Illness Code,APR Severity of Illness Description,APR Risk of Mortality,APR Medical Surgical Description,Payment Typology 1,Payment Typology 2,Payment Typology 3,Birth Weight,Abortion Edit Indicator,Emergency Department Indicator,Total Charges,Total Costs
New York City,Kings,7002053,001304,NYU Langone Hospital-Brooklyn,30 to 49,112,M,Other Race,Not Span/Hispanic,1,Emergency,Home or Self Care,2020,INJ037,"COMPLICATION OF OTHER SURGICAL OR MEDICAL CARE, INJURY, INITIAL ENCOUNTER",,,811,ALLERGIC REACTIONS,21,"INJURIES, POISONINGS AND TOXIC EFFECTS OF DRUGS",1,Minor,Minor,Medical,Medicaid,,,,,Y,29499.93,8297.17
New York City,Kings,7002053,001304,NYU Langone Hospital-Brooklyn,18 to 29,112,F,White,Not Span/Hispanic,1,Emergency,Home or Self Care,2020,INJ031,ALLERGIC REACTIONS,,,811,ALLERGIC REACTIONS,21,"INJURIES, POISONINGS AND TOXIC EFFECTS OF DRUGS",2,Moderate,Minor,Medical,Private Health Insurance,,,,,Y,14572.77,4320.7
New York City,Kings,7002053,001304,NYU Langone Hospital-Brooklyn,50 to 69,112,M,White,Not Span/Hispanic,1,Emergency,Home or Self Care,2020,INJ031,ALLERGIC REACTIONS,,,811,ALLERGIC REACTIONS,21,"INJURIES, POISONINGS AND TOXIC EFFECTS OF DRUGS",2,Moderate,Minor,Medical,Medicare,Medicare,,,,Y,16983.43,4254.85
New York City,Kings,7002053,001304,NYU Langone Hospital-Brooklyn,50 to 69,112,M,White,Not Span/Hispanic,7,Emergency,Home w/ Home Health Services,2020,INJ031,ALLERGIC REACTIONS,,,811,ALLERGIC REACTIONS,21,"INJURIES, POISONINGS AND TOXIC EFFECTS OF DRUGS",4,Extreme,Major,Medical,Medicare,,,,,Y,59773.52,23742.51
New York City,Kings,7002053,001304,NYU Langone Hospital-Brooklyn,18 to 29,112,F,Black/African American,Not Span/Hispanic,1,Emergency,Home or Self Care,2020,INJ031,ALLERGIC REACTIONS,,,811,ALLERGIC REACTIONS,21,"INJURIES, POISONINGS AND TOXIC EFFECTS OF DRUGS",1,Minor,Minor,Medical,Blue Cross/Blue Shield,,,,,Y,13938.81,4028.49
New York City,Kings,7002053,001304,NYU Langone Hospital-Brooklyn,70 or Older,112,F,Black/African American,Not Span/Hispanic,1,Emergency,Home or Self Care,2020,INJ031,ALLERGIC REACTIONS,ENT001,LARYNGOSCOPY (DIAGNOSTIC),811,ALLERGIC REACTIONS,21,"INJURIES, POISONINGS AND TOXIC EFFECTS OF DRUGS",2,Moderate,Moderate,Medical,Medicare,,,,,Y,14014.23,4074.69
New York City,Kings,7002053,001304,NYU Langone Hospital-Brooklyn,70 or Older,112,M,White,Not Span/Hispanic,1,Emergency,Home or Self Care,2020,INJ031,ALLERGIC REACTIONS,,,811,ALLERGIC REACTIONS,21,"INJURIES, POISONINGS AND TOXIC EFFECTS OF DRUGS",2,Moderate,Minor,Medical,Medicare,,,,,Y,18753.55,4438.34
New York City,Kings,7002053,001304,NYU Langone Hospital-Brooklyn,30 to 49,112,F,Other Race,Not Span/Hispanic,1,Emergency,Left Against Medical Advice,2020,INJ031,ALLERGIC REACTIONS,,,811,ALLERGIC REACTIONS,21,"INJURIES, POISONINGS AND TOXIC EFFECTS OF DRUGS",2,Moderate,Minor,Medical,Blue Cross/Blue Shield,,,,,Y,14504.18,4183.36
New York City,Kings,7002053,001304,NYU Langone Hospital-Brooklyn,50 to 69,,F,Other Race,Unknown,21,Emergency,Skilled Nursing Home,2020,INJ037,"COMPLICATION OF OTHER SURGICAL OR MEDICAL CARE, INJURY, INITIAL ENCOUNTER",RES007,AIRWAY INTUBATION,811,ALLERGIC REACTIONS,21,"INJURIES, POISONINGS AND TOXIC EFFECTS OF DRUGS",4,Extreme,Extreme,Medical,Medicare,,,,,Y,376929.88,137763.9
New York City,Kings,7002053,001304,NYU Langone Hospital-Brooklyn,50 to 69,112,F,White,Not Span/Hispanic,2,Emergency,Home or Self Care,2020,INJ037,"COMPLICATION OF OTHER SURGICAL OR MEDICAL CARE, INJURY, INITIAL ENCOUNTER",ADM021,"ADMINISTRATION OF THERAPEUTIC SUBSTANCES, NEC",811,ALLERGIC REACTIONS,21,"INJURIES, POISONINGS AND TOXIC EFFECTS OF DRUGS",2,Moderate,Major,Medical,Medicaid,,,,,Y,49220.85,14931.87
New York City,Kings,7002053,001304,NYU Langone Hospital-Brooklyn,50 to 69,112,F,Other Race,Not Span/Hispanic,1,Emergency,Home or Self Care,2020,INJ037,"COMPLICATION OF OTHER SURGICAL OR MEDICAL CARE, INJURY, INITIAL ENCOUNTER",ADM001,TRANSFUSION OF BLOOD AND BLOOD PRODUCTS,811,ALLERGIC REACTIONS,21,"INJURIES, POISONINGS AND TOXIC EFFECTS OF DRUGS",3,Major,Major,Medical,Private Health Insurance,,,,,Y,23202.77,6143.05
New York City,Kings,7002053,001304,NYU Langone Hospital-Brooklyn,50 to 69,112,F,Other Race,Not Span/Hispanic,2,Emergency,Home w/ Home Health Services,2020,INJ037,"COMPLICATION OF OTHER SURGICAL OR MEDICAL CARE, INJURY, INITIAL ENCOUNTER",ESA004,NON-INVASIVE VENTILATION,811,ALLERGIC REACTIONS,21,"INJURIES, POISONINGS AND TOXIC EFFECTS OF DRUGS",1,Minor,Minor,Medical,Medicare,,,,,Y,40776.91,11017.71
New York City,Kings,7002053,001304,NYU Langone Hospital-Brooklyn,18 to 29,112,F,Other Race,Not Span/Hispanic,4,Emergency,Home or Self Care,2020,INJ031,ALLERGIC REACTIONS,RES007,AIRWAY INTUBATION,811,ALLERGIC REACTIONS,21,"INJURIES, POISONINGS AND TOXIC EFFECTS OF DRUGS",4,Extreme,Extreme,Medical,Medicaid,,,,,Y,69525.41,24485.5
New York City,Kings,7002053,001304,NYU Langone Hospital-Brooklyn,30 to 49,112,M,Black/African American,Not Span/Hispanic,1,Emergency,Home or Self Care,2020,INJ031,ALLERGIC REACTIONS,,,811,ALLERGIC REACTIONS,21,"INJURIES, POISONINGS AND TOXIC EFFECTS OF DRUGS",2,Moderate,Moderate,Medical,Blue Cross/Blue Shield,,,,,Y,33840.95,10987.69
New York City,Kings,7002053,001304,NYU Langone Hospital-Brooklyn,50 to 69,112,F,Other Race,Spanish/Hispanic,3,Emergency,Home or Self Care,2020,INJ037,"COMPLICATION OF OTHER SURGICAL OR MEDICAL CARE, INJURY, INITIAL ENCOUNTER",OTR004,ISOLATION PROCEDURES,811,ALLERGIC REACTIONS,21,"INJURIES, POISONINGS AND TOXIC EFFECTS OF DRUGS",2,Moderate,Minor,Medical,Blue Cross/Blue Shield,,,,,Y,47339.65,19813.76
New York City,Kings,7002053,001304,NYU Langone Hospital-Brooklyn,30 to 49,112,M,Other Race,Not Span/Hispanic,1,Emergency,Short-term Hospital,2020,INJ031,ALLERGIC REACTIONS,OTR004,ISOLATION PROCEDURES,811,ALLERGIC REACTIONS,21,"INJURIES, POISONINGS AND TOXIC EFFECTS OF DRUGS",1,Minor,Minor,Medical,Private Health Insurance,,,,,Y,17234.96,5578.6
New York City,Kings,7002053,001304,NYU Langone Hospital-Brooklyn,30 to 49,112,F,Black/African American,Not Span/Hispanic,1,Emergency,Home or Self Care,2020,INJ031,ALLERGIC REACTIONS,IMG008,ULTRASONOGRAPHY,811,ALLERGIC REACTIONS,21,"INJURIES, POISONINGS AND TOXIC EFFECTS OF DRUGS",1,Minor,Minor,Medical,Blue Cross/Blue Shield,,,,,Y,26316.37,6385.14
