Hospital Service Area,Hospital County,Operating Certificate Number,Permanent Facility Id,Facility Name,Age Group,Zip Code - 3 digits,Gender,Race,Ethnicity,Length of Stay,Type of Admission,Patient Disposition,Discharge Year,CCS Diagnosis Code,CCS Diagnosis Description,CCS Procedure Code,CCS Procedure Description,APR DRG Code,APR DRG Description,APR MDC Code,APR MDC Description,APR Severity of Illness Code,APR Severity of Illness Description,APR Risk of Mortality,APR Medical Surgical Description,Payment Typology 1,Payment Typology 2,Payment Typology 3,Birth Weight,Abortion Edit Indicator,Emergency Department Indicator,Total Charges,Total Costs
Long Island,Nassau,2908000,000511,NYU Langone Hospital-Long Island,30 to 49,115,F,White,Not Span/Hispanic,2,Emergency,Home or Self Care,2020,INJ031,ALLERGIC REACTIONS,,,811,ALLERGIC REACTIONS,21,"INJURIES, POISONINGS AND TOXIC EFFECTS OF DRUGS",1,Minor,Moderate,Medical,Private Health Insurance,,,,,Y,42889.31,9354.07
Long Island,Nassau,2908000,000511,NYU Langone Hospital-Long Island,70 or Older,,M,White,Not Span/Hispanic,1,Emergency,Home or Self Care,2020,INJ031,ALLERGIC REACTIONS,,,811,ALLERGIC REACTIONS,21,"INJURIES, POISONINGS AND TOXIC EFFECTS OF DRUGS",1,Minor,Minor,Medical,Self-Pay,,,,,Y,15317.07,4282.94
Long Island,Nassau,2908000,000511,NYU Langone Hospital-Long Island,50 to 69,117,F,Other Race,Not Span/Hispanic,2,Emergency,Home or Self Care,2020,INJ037,"COMPLICATION OF OTHER SURGICAL OR MEDICAL CARE, INJURY, INITIAL ENCOUNTER",ENT002,ENT DIAGNOSTIC ENDOSCOPY (EXCLUDING LARYNGOSCOPY),811,ALLERGIC REACTIONS,21,"INJURIES, POISONINGS AND TOXIC EFFECTS OF DRUGS",1,Minor,Minor,Medical,Private Health Insurance,,,,,Y,41558.85,15523.25
Long Island,Nassau,2908000,000511,NYU Langone Hospital-Long Island,50 to 69,115,M,Other Race,Not Span/Hispanic,1,Emergency,Home or Self Care,2020,INJ031,ALLERGIC REACTIONS,,,811,ALLERGIC REACTIONS,21,"INJURIES, POISONINGS AND TOXIC EFFECTS OF DRUGS",1,Minor,Minor,Medical,Medicare,,,,,Y,43453.08,11539.87
Long Island,Nassau,2908000,000511,NYU Langone Hospital-Long Island,50 to 69,115,M,Black/African American,Not Span/Hispanic,1,Emergency,Home or Self Care,2020,INJ031,ALLERGIC REACTIONS,,,811,ALLERGIC REACTIONS,21,"INJURIES, POISONINGS AND TOXIC EFFECTS OF DRUGS",1,Minor,Minor,Medical,Blue Cross/Blue Shield,,,,,Y,13044.66,4006.66
Long Island,Nassau,2908000,000511,NYU Langone Hospital-Long Island,30 to 49,115,F,White,Not Span/Hispanic,2,Emergency,Home or Self Care,2020,INJ037,"COMPLICATION OF OTHER SURGICAL OR MEDICAL CARE, INJURY, INITIAL ENCOUNTER",ENT002,ENT DIAGNOSTIC ENDOSCOPY (EXCLUDING LARYNGOSCOPY),811,ALLERGIC REACTIONS,21,"INJURIES, POISONINGS AND TOXIC EFFECTS OF DRUGS",1,Minor,Minor,Medical,Private Health Insurance,,,,,Y,28502.15,9567.12
Long Island,Nassau,2908000,000511,NYU Langone Hospital-Long Island,30 to 49,117,F,Black/African American,Not Span/Hispanic,2,Emergency,Home or Self Care,2020,INJ031,ALLERGIC REACTIONS,ENT001,LARYNGOSCOPY (DIAGNOSTIC),811,ALLERGIC REACTIONS,21,"INJURIES, POISONINGS AND TOXIC EFFECTS OF DRUGS",2,Moderate,Minor,Medical,Medicare,Medicaid,Medicaid,,,Y,44479.68,15585.2
Long Island,Nassau,2908000,000511,NYU Langone Hospital-Long Island,0 to 17,115,M,White,Not Span/Hispanic,2,Emergency,Home or Self Care,2020,INJ037,"COMPLICATION OF OTHER SURGICAL OR MEDICAL CARE, INJURY, INITIAL ENCOUNTER",,,811,ALLERGIC REACTIONS,21,"INJURIES, POISONINGS AND TOXIC EFFECTS OF DRUGS",1,Minor,Minor,Medical,Blue Cross/Blue Shield,,,,,Y,22665.44,5357.85
Long Island,Nassau,2908000,000511,NYU Langone Hospital-Long Island,50 to 69,115,M,Black/African American,Not Span/Hispanic,2,Emergency,Home or Self Care,2020,INJ031,ALLERGIC REACTIONS,,,811,ALLERGIC REACTIONS,21,"INJURIES, POISONINGS AND TOXIC EFFECTS OF DRUGS",2,Moderate,Minor,Medical,Private Health Insurance,,,,,Y,34232.82,13211.06
Long Island,Nassau,2908000,000511,NYU Langone Hospital-Long Island,30 to 49,114,F,Black/African American,Not Span/Hispanic,6,Emergency,Home or Self Care,2020,INJ031,ALLERGIC REACTIONS,ENT001,LARYNGOSCOPY (DIAGNOSTIC),811,ALLERGIC REACTIONS,21,"INJURIES, POISONINGS AND TOXIC EFFECTS OF DRUGS",2,Moderate,Minor,Medical,Private Health Insurance,,,,,Y,77068.05,24957.78
Long Island,Nassau,2908000,000511,NYU Langone Hospital-Long Island,18 to 29,110,F,White,Not Span/Hispanic,1,Emergency,Home or Self Care,2020,INJ031,ALLERGIC REACTIONS,OTR004,ISOLATION PROCEDURES,811,ALLERGIC REACTIONS,21,"INJURIES, POISONINGS AND TOXIC EFFECTS OF DRUGS",1,Minor,Minor,Medical,Blue Cross/Blue Shield,,,,,Y,14771.84,3060.18
Long Island,Nassau,2908000,000511,NYU Langone Hospital-Long Island,18 to 29,110,F,White,Not Span/Hispanic,1,Emergency,Home or Self Care,2020,INJ031,ALLERGIC REACTIONS,ADM021,"ADMINISTRATION OF THERAPEUTIC SUBSTANCES, NEC",811,ALLERGIC REACTIONS,21,"INJURIES, POISONINGS AND TOXIC EFFECTS OF DRUGS",1,Minor,Minor,Medical,Blue Cross/Blue Shield,,,,,Y,24315.15,8269.11
Long Island,Nassau,2908000,000511,NYU Langone Hospital-Long Island,0 to 17,115,M,Black/African American,Not Span/Hispanic,1,Elective,Home or Self Care,2020,INJ031,ALLERGIC REACTIONS,,,811,ALLERGIC REACTIONS,21,"INJURIES, POISONINGS AND TOXIC EFFECTS OF DRUGS",1,Minor,Minor,Medical,Private Health Insurance,,,,,N,5399.95,1922.38
Long Island,Nassau,2908000,000511,NYU Langone Hospital-Long Island,50 to 69,115,M,Other Race,Spanish/Hispanic,3,Emergency,Home or Self Care,2020,INJ031,ALLERGIC REACTIONS,OTR004,ISOLATION PROCEDURES,811,ALLERGIC REACTIONS,21,"INJURIES, POISONINGS AND TOXIC EFFECTS OF DRUGS",2,Moderate,Moderate,Medical,Private Health Insurance,,,,,Y,49947.35,18697.4
Long Island,Nassau,2908000,000511,NYU Langone Hospital-Long Island,50 to 69,115,F,Black/African American,Not Span/Hispanic,2,Emergency,Home w/ Home Health Services,2020,INJ031,ALLERGIC REACTIONS,ENT001,LARYNGOSCOPY (DIAGNOSTIC),811,ALLERGIC REACTIONS,21,"INJURIES, POISONINGS AND TOXIC EFFECTS OF DRUGS",2,Moderate,Moderate,Medical,Medicare,Medicaid,,,,Y,36321.93,15097.53
Long Island,Nassau,2908000,000511,NYU Langone Hospital-Long Island,50 to 69,117,F,White,Not Span/Hispanic,6,Emergency,Home or Self Care,2020,INJ037,"COMPLICATION OF OTHER SURGICAL OR MEDICAL CARE, INJURY, INITIAL ENCOUNTER",RAD001,BEAM RADIATION,811,ALLERGIC REACTIONS,21,"INJURIES, POISONINGS AND TOXIC EFFECTS OF DRUGS",3,Major,Moderate,Medical,Medicaid,,,,,Y,153918.95,38192.43
Long Island,Nassau,2908000,000511,NYU Langone Hospital-Long Island,0 to 17,115,F,White,Not Span/Hispanic,1,Emergency,Home or Self Care,2020,INJ031,ALLERGIC REACTIONS,,,811,ALLERGIC REACTIONS,21,"INJURIES, POISONINGS AND TOXIC EFFECTS OF DRUGS",2,Moderate,Minor,Medical,Private Health Insurance,,,,,Y,15569.04,3752.84
Long Island,Nassau,2908000,000511,NYU Langone Hospital-Long Island,0 to 17,115,M,Other Race,Not Span/Hispanic,1,Emergency,Home or Self Care,2020,INJ031,ALLERGIC REACTIONS,,,811,ALLERGIC REACTIONS,21,"INJURIES, POISONINGS AND TOXIC EFFECTS OF DRUGS",1,Minor,Minor,Medical,Medicaid,,,,,Y,15203.69,3675.59
Long Island,Nassau,2908000,000511,NYU Langone Hospital-Long Island,70 or Older,117,F,White,Not Span/Hispanic,5,Emergency,Home or Self Care,2020,INJ031,ALLERGIC REACTIONS,ENT001,LARYNGOSCOPY (DIAGNOSTIC),811,ALLERGIC REACTIONS,21,"INJURIES, POISONINGS AND TOXIC EFFECTS OF DRUGS",3,Major,Moderate,Medical,Medicare,,,,,Y,77149.83,24775.74
Long Island,Nassau,2908000,000511,NYU Langone Hospital-Long Island,0 to 17,115,F,White,Not Span/Hispanic,4,Emergency,Home or Self Care,2020,INJ031,ALLERGIC REACTIONS,,,811,ALLERGIC REACTIONS,21,"INJURIES, POISONINGS AND TOXIC EFFECTS OF DRUGS",2,Moderate,Moderate,Medical,Private Health Insurance,,,,,Y,58276.61,14078.15
Long Island,Nassau,2908000,000511,NYU Langone Hospital-Long Island,0 to 17,115,M,Other Race,Spanish/Hispanic,1,Emergency,Home or Self Care,2020,INJ031,ALLERGIC REACTIONS,,,811,ALLERGIC REACTIONS,21,"INJURIES, POISONINGS AND TOXIC EFFECTS OF DRUGS",1,Minor,Minor,Medical,Medicaid,,,,,Y,18093.34,5218.64
Long Island,Nassau,2908000,000511,NYU Langone Hospital-Long Island,50 to 69,117,M,White,Not Span/Hispanic,1,Emergency,Home or Self Care,2020,INJ031,ALLERGIC REACTIONS,ENT001,LARYNGOSCOPY (DIAGNOSTIC),811,ALLERGIC REACTIONS,21,"INJURIES, POISONINGS AND TOXIC EFFECTS OF DRUGS",2,Moderate,Minor,Medical,Blue Cross/Blue Shield,Medicare,,,,Y,27610.56,9245.75
Long Island,Nassau,2908000,000511,NYU Langone Hospital-Long Island,0 to 17,117,M,White,Not Span/Hispanic,1,Emergency,Home or Self Care,2020,INJ031,ALLERGIC REACTIONS,,,811,ALLERGIC REACTIONS,21,"INJURIES, POISONINGS AND TOXIC EFFECTS OF DRUGS",2,Moderate,Minor,Medical,Private Health Insurance,,,,,Y,18602.95,5302.2
Long Island,Nassau,2908000,000511,NYU Langone Hospital-Long Island,50 to 69,115,M,White,Not Span/Hispanic,1,Emergency,Home or Self Care,2020,INJ031,ALLERGIC REACTIONS,,,811,ALLERGIC REACTIONS,21,"INJURIES, POISONINGS AND TOXIC EFFECTS OF DRUGS",1,Minor,Moderate,Medical,Private Health Insurance,,,,,Y,22972.61,6238.08
Long Island,Nassau,2908000,000511,NYU Langone Hospital-Long Island,30 to 49,118,F,Other Race,Not Span/Hispanic,2,Emergency,Home or Self Care,2020,INJ037,"COMPLICATION OF OTHER SURGICAL OR MEDICAL CARE, INJURY, INITIAL ENCOUNTER",,,811,ALLERGIC REACTIONS,21,"INJURIES, POISONINGS AND TOXIC EFFECTS OF DRUGS",1,Minor,Minor,Medical,Medicaid,,,,,Y,37584.29,13766.7
Long Island,Nassau,2908000,000511,NYU Langone Hospital-Long Island,50 to 69,115,F,Black/African American,Not Span/Hispanic,2,Emergency,Home or Self Care,2020,INJ031,ALLERGIC REACTIONS,,,811,ALLERGIC REACTIONS,21,"INJURIES, POISONINGS AND TOXIC EFFECTS OF DRUGS",1,Minor,Minor,Medical,Private Health Insurance,,,,,Y,38053.82,13688.37
Long Island,Nassau,2908000,000511,NYU Langone Hospital-Long Island,30 to 49,115,F,Black/African American,Not Span/Hispanic,1,Emergency,Home or Self Care,2020,INJ031,ALLERGIC REACTIONS,ENT001,LARYNGOSCOPY (DIAGNOSTIC),811,ALLERGIC REACTIONS,21,"INJURIES, POISONINGS AND TOXIC EFFECTS OF DRUGS",2,Moderate,Minor,Medical,Private Health Insurance,,,,,Y,23474.79,6196.21
Long Island,Nassau,2908000,000511,NYU Langone Hospital-Long Island,70 or Older,117,M,White,Not Span/Hispanic,2,Emergency,Home or Self Care,2020,INJ031,ALLERGIC REACTIONS,,,811,ALLERGIC REACTIONS,21,"INJURIES, POISONINGS AND TOXIC EFFECTS OF DRUGS",3,Major,Major,Medical,Medicare,Medicare,,,,Y,62440.36,23261.14
Long Island,Nassau,2908000,000511,NYU Langone Hospital-Long Island,70 or Older,110,F,White,Not Span/Hispanic,9,Emergency,Home w/ Home Health Services,2020,INJ037,"COMPLICATION OF OTHER SURGICAL OR MEDICAL CARE, INJURY, INITIAL ENCOUNTER",,,811,ALLERGIC REACTIONS,21,"INJURIES, POISONINGS AND TOXIC EFFECTS OF DRUGS",3,Major,Major,Medical,Medicare,,,,,Y,149185.62,45792.66
Long Island,Nassau,2908000,000511,NYU Langone Hospital-Long Island,0 to 17,115,M,Black/African American,Not Span/Hispanic,1,Urgent,Home or Self Care,2020,INJ031,ALLERGIC REACTIONS,,,811,ALLERGIC REACTIONS,21,"INJURIES, POISONINGS AND TOXIC EFFECTS OF DRUGS",1,Minor,Minor,Medical,Medicaid,,,,,N,10012.63,2802.31
Long Island,Nassau,2908000,000511,NYU Langone Hospital-Long Island,50 to 69,115,F,Black/African American,Not Span/Hispanic,1,Emergency,Home or Self Care,2020,INJ031,ALLERGIC REACTIONS,ENT001,LARYNGOSCOPY (DIAGNOSTIC),811,ALLERGIC REACTIONS,21,"INJURIES, POISONINGS AND TOXIC EFFECTS OF DRUGS",2,Moderate,Minor,Medical,Blue Cross/Blue Shield,,,,,Y,19985.83,6003.53
Long Island,Nassau,2908000,000511,NYU Langone Hospital-Long Island,50 to 69,115,F,White,Not Span/Hispanic,2,Emergency,Home or Self Care,2020,INJ031,ALLERGIC REACTIONS,ENT001,LARYNGOSCOPY (DIAGNOSTIC),811,ALLERGIC REACTIONS,21,"INJURIES, POISONINGS AND TOXIC EFFECTS OF DRUGS",2,Moderate,Minor,Medical,Medicare,,,,,Y,51081.08,16844.8
Long Island,Nassau,2908000,000511,NYU Langone Hospital-Long Island,18 to 29,110,F,Black/African American,Not Span/Hispanic,2,Trauma,Home or Self Care,2020,INJ037,"COMPLICATION OF OTHER SURGICAL OR MEDICAL CARE, INJURY, INITIAL ENCOUNTER",,,811,ALLERGIC REACTIONS,21,"INJURIES, POISONINGS AND TOXIC EFFECTS OF DRUGS",1,Minor,Minor,Medical,Miscellaneous/Other,,,,,Y,89538.85,19828.7
Long Island,Nassau,2908000,000511,NYU Langone Hospital-Long Island,30 to 49,117,F,Black/African American,Not Span/Hispanic,2,Emergency,Home w/ Home Health Services,2020,INJ031,ALLERGIC REACTIONS,ADM001,TRANSFUSION OF BLOOD AND BLOOD PRODUCTS,811,ALLERGIC REACTIONS,21,"INJURIES, POISONINGS AND TOXIC EFFECTS OF DRUGS",3,Major,Minor,Medical,Medicaid,,,,,Y,50124.12,17442.11
Long Island,Nassau,2908000,000511,NYU Langone Hospital-Long Island,50 to 69,117,M,White,Not Span/Hispanic,3,Emergency,Skilled Nursing Home,2020,INJ031,ALLERGIC REACTIONS,CAR024,VENOUS AND ARTERIAL CATHETER PLACEMENT,811,ALLERGIC REACTIONS,21,"INJURIES, POISONINGS AND TOXIC EFFECTS OF DRUGS",3,Major,Major,Medical,Medicare,,,,,Y,73815.16,17554.74
Long Island,Nassau,2908000,000511,NYU Langone Hospital-Long Island,30 to 49,117,F,Black/African American,Not Span/Hispanic,3,Emergency,Home w/ Home Health Services,2020,INJ031,ALLERGIC REACTIONS,ADM001,TRANSFUSION OF BLOOD AND BLOOD PRODUCTS,811,ALLERGIC REACTIONS,21,"INJURIES, POISONINGS AND TOXIC EFFECTS OF DRUGS",2,Moderate,Minor,Medical,Medicaid,,,,,Y,52486.1,18747.09
Long Island,Nassau,2908000,000511,NYU Langone Hospital-Long Island,0 to 17,115,M,White,Not Span/Hispanic,1,Emergency,Home or Self Care,2020,INJ031,ALLERGIC REACTIONS,,,811,ALLERGIC REACTIONS,21,"INJURIES, POISONINGS AND TOXIC EFFECTS OF DRUGS",1,Minor,Minor,Medical,Blue Cross/Blue Shield,,,,,Y,18940.14,5335.13
Long Island,Nassau,2908000,000511,NYU Langone Hospital-Long Island,0 to 17,115,M,White,Spanish/Hispanic,1,Emergency,Home or Self Care,2020,INJ031,ALLERGIC REACTIONS,,,811,ALLERGIC REACTIONS,21,"INJURIES, POISONINGS AND TOXIC EFFECTS OF DRUGS",1,Minor,Minor,Medical,Private Health Insurance,,,,,Y,13834.4,3629.96
Long Island,Nassau,2908000,000511,NYU Langone Hospital-Long Island,0 to 17,115,M,Other Race,Not Span/Hispanic,1,Emergency,Home or Self Care,2020,INJ031,ALLERGIC REACTIONS,,,811,ALLERGIC REACTIONS,21,"INJURIES, POISONINGS AND TOXIC EFFECTS OF DRUGS",1,Minor,Minor,Medical,Private Health Insurance,,,,,Y,18677.67,5258.32
Long Island,Nassau,2908000,000511,NYU Langone Hospital-Long Island,0 to 17,115,F,White,Spanish/Hispanic,1,Emergency,Home or Self Care,2020,INJ031,ALLERGIC REACTIONS,,,811,ALLERGIC REACTIONS,21,"INJURIES, POISONINGS AND TOXIC EFFECTS OF DRUGS",1,Minor,Minor,Medical,Medicaid,,,,,Y,18357.29,4141.24
