Hospital Service Area,Hospital County,Operating Certificate Number,Permanent Facility Id,Facility Name,Age Group,Zip Code - 3 digits,Gender,Race,Ethnicity,Length of Stay,Type of Admission,Patient Disposition,Discharge Year,CCS Diagnosis Code,CCS Diagnosis Description,CCS Procedure Code,CCS Procedure Description,APR DRG Code,APR DRG Description,APR MDC Code,APR MDC Description,APR Severity of Illness Code,APR Severity of Illness Description,APR Risk of Mortality,APR Medical Surgical Description,Payment Typology 1,Payment Typology 2,Payment Typology 3,Birth Weight,Abortion Edit Indicator,Emergency Department Indicator,Total Charges,Total Costs
New York City,Kings,7001016,001301,Kings County Hospital Center,0 to 17,112,F,Black/African American,Not Span/Hispanic,1,Emergency,Psychiatric Hospital or Unit of Hosp,2018,MBD012,SUICIDAL IDEATION/ATTEMPT/INTENTIONAL SELF-HARM,ADM021,"ADMINISTRATION OF THERAPEUTIC SUBSTANCES, NEC",812,POISONING OF MEDICINAL AGENTS,21,"INJURIES, POISONINGS AND TOXIC EFFECTS OF DRUGS",3,Major,Moderate,Medical,Medicaid,Medicaid,,,,true,7837.23,5567.26
New York City,Richmond,7004003,001737,Staten Island University Hospital Prince's Bay,18 to 29,103,M,White,Not Span/Hispanic,5,Emergency,Home or Self Care,2018,INJ022,"POISONING BY DRUGS, INITIAL ENCOUNTER",,,812,POISONING OF MEDICINAL AGENTS,21,"INJURIES, POISONINGS AND TOXIC EFFECTS OF DRUGS",2,Moderate,Minor,Medical,Blue Cross/Blue Shield,Self-Pay,,,,true,38171.63,9192.8
New York City,Manhattan,7002032,001469,Mount Sinai Morningside,18 to 29,100,F,Other Race,Spanish/Hispanic,2,Emergency,Psychiatric Hospital or Unit of Hosp,2018,MBD012,SUICIDAL IDEATION/ATTEMPT/INTENTIONAL SELF-HARM,ADM021,"ADMINISTRATION OF THERAPEUTIC SUBSTANCES, NEC",812,POISONING OF MEDICINAL AGENTS,21,"INJURIES, POISONINGS AND TOXIC EFFECTS OF DRUGS",1,Minor,Minor,Medical,Private Health Insurance,Self-Pay,,,,false,18954,4365.17
New York City,Richmond,7004003,001737,Staten Island University Hospital Prince's Bay,50 to 69,103,M,White,Not Span/Hispanic,1,Emergency,Home or Self Care,2018,INJ022,"POISONING BY DRUGS, INITIAL ENCOUNTER",,,812,POISONING OF MEDICINAL AGENTS,21,"INJURIES, POISONINGS AND TOXIC EFFECTS OF DRUGS",1,Minor,Minor,Medical,Medicaid,Medicaid,,,,true,14194.37,3398
New York City,Richmond,7004003,001737,Staten Island University Hospital Prince's Bay,18 to 29,103,F,White,Not Span/Hispanic,2,Emergency,Psychiatric Hospital or Unit of Hosp,2018,INJ022,"POISONING BY DRUGS, INITIAL ENCOUNTER",,,812,POISONING OF MEDICINAL AGENTS,21,"INJURIES, POISONINGS AND TOXIC EFFECTS OF DRUGS",2,Moderate,Minor,Medical,Blue Cross/Blue Shield,,,,,true,20005.25,4481.98
New York City,Bronx,7000008,001172,Lincoln Medical & Mental Health Center,70 or Older,104,F,Other Race,Spanish/Hispanic,9,Emergency,Skilled Nursing Home,2018,INJ022,"POISONING BY DRUGS, INITIAL ENCOUNTER",ESA001,HEMODIALYSIS,812,POISONING OF MEDICINAL AGENTS,21,"INJURIES, POISONINGS AND TOXIC EFFECTS OF DRUGS",3,Major,Major,Medical,Medicare,Medicaid,,,,true,46204.63,27286.47
Long Island,Suffolk,5154001,000925,Good Samaritan Hospital Medical Center,70 or Older,117,M,White,Not Span/Hispanic,2,Emergency,Home w/ Home Health Services,2018,INJ022,"POISONING BY DRUGS, INITIAL ENCOUNTER",,,812,POISONING OF MEDICINAL AGENTS,21,"INJURIES, POISONINGS AND TOXIC EFFECTS OF DRUGS",2,Moderate,Minor,Medical,Medicare,Private Health Insurance,,,,true,15804,2682.02
New York City,Bronx,7000006,003058,Montefiore Med Center - Jack D Weiler Hosp of A Einstein College Div,50 to 69,104,M,Other Race,Spanish/Hispanic,4,Emergency,Home or Self Care,2018,INJ022,"POISONING BY DRUGS, INITIAL ENCOUNTER",ADM015,ADMINISTRATION OF ANTIBIOTICS,812,POISONING OF MEDICINAL AGENTS,21,"INJURIES, POISONINGS AND TOXIC EFFECTS OF DRUGS",2,Moderate,Moderate,Medical,Private Health Insurance,,,,,true,58222.57,8431.76
Finger Lakes,Monroe,2701003,000411,Rochester General Hospital,30 to 49,146,F,Black/African American,Not Span/Hispanic,2,Emergency,Home or Self Care,2018,INJ022,"POISONING BY DRUGS, INITIAL ENCOUNTER",,,812,POISONING OF MEDICINAL AGENTS,21,"INJURIES, POISONINGS AND TOXIC EFFECTS OF DRUGS",1,Minor,Minor,Medical,Medicare,Medicaid,,,,true,6589.42,2466.58
Finger Lakes,Ontario,3429000,000678,F.F. Thompson Hospital,30 to 49,144,F,White,Not Span/Hispanic,3,Emergency,Psychiatric Hospital or Unit of Hosp,2018,MBD012,SUICIDAL IDEATION/ATTEMPT/INTENTIONAL SELF-HARM,ESA003,MECHANICAL VENTILATION,812,POISONING OF MEDICINAL AGENTS,21,"INJURIES, POISONINGS AND TOXIC EFFECTS OF DRUGS",4,Extreme,Extreme,Medical,Medicare,Medicaid,,,,true,18413.6,7918.89
Capital/Adirond,Albany,0101000,000001,Albany Medical Center Hospital,30 to 49,121,F,White,Not Span/Hispanic,1,Emergency,Home or Self Care,2018,INJ022,"POISONING BY DRUGS, INITIAL ENCOUNTER",,,812,POISONING OF MEDICINAL AGENTS,21,"INJURIES, POISONINGS AND TOXIC EFFECTS OF DRUGS",3,Major,Major,Medical,Medicaid,,,,,true,10793.78,2242.27
New York City,Kings,7001035,001318,Wyckoff Heights Medical Center,30 to 49,112,M,Other Race,Not Span/Hispanic,2,Emergency,Home or Self Care,2018,INJ022,"POISONING BY DRUGS, INITIAL ENCOUNTER",,,812,POISONING OF MEDICINAL AGENTS,21,"INJURIES, POISONINGS AND TOXIC EFFECTS OF DRUGS",3,Major,Minor,Medical,Medicaid,,,,,false,10213.82,4400.8
New York City,Queens,7003004,001638,Long Island Jewish Forest Hills,50 to 69,113,F,White,Not Span/Hispanic,2,Emergency,Left Against Medical Advice,2018,INJ022,"POISONING BY DRUGS, INITIAL ENCOUNTER",,,812,POISONING OF MEDICINAL AGENTS,21,"INJURIES, POISONINGS AND TOXIC EFFECTS OF DRUGS",3,Major,Moderate,Medical,Medicaid,Medicaid,,,,true,40225.31,7951.17
Western NY,Chautauqua,0601000,000098,"Brooks-TLC Hospital System, Inc.",50 to 69,140,F,White,Not Span/Hispanic,1,Elective,Skilled Nursing Home,2018,MBD012,SUICIDAL IDEATION/ATTEMPT/INTENTIONAL SELF-HARM,,,812,POISONING OF MEDICINAL AGENTS,21,"INJURIES, POISONINGS AND TOXIC EFFECTS OF DRUGS",2,Moderate,Minor,Medical,Medicaid,,,,,true,4876.78,2072.19
New York City,Kings,7001020,001305,Maimonides Medical Center,30 to 49,112,M,White,Not Span/Hispanic,25,Emergency,Inpatient Rehabilitation Facility,2018,MBD012,SUICIDAL IDEATION/ATTEMPT/INTENTIONAL SELF-HARM,URN006,BLADDER CATHETERIZATION AND DRAINAGE,812,POISONING OF MEDICINAL AGENTS,21,"INJURIES, POISONINGS AND TOXIC EFFECTS OF DRUGS",4,Extreme,Extreme,Medical,Medicare,Medicare,Self-Pay,,,true,272542.17,55568.53
New York City,Richmond,7004003,001737,Staten Island University Hospital Prince's Bay,50 to 69,103,F,Other Race,Spanish/Hispanic,1,Emergency,Psychiatric Hospital or Unit of Hosp,2018,MBD012,SUICIDAL IDEATION/ATTEMPT/INTENTIONAL SELF-HARM,,,812,POISONING OF MEDICINAL AGENTS,21,"INJURIES, POISONINGS AND TOXIC EFFECTS OF DRUGS",2,Moderate,Minor,Medical,Private Health Insurance,Self-Pay,,,,true,12284.52,3114.58
New York City,Bronx,7000006,001168,Montefiore Medical Center-Wakefield Hospital,50 to 69,104,M,White,Not Span/Hispanic,6,Emergency,Home w/ Home Health Services,2018,INJ022,"POISONING BY DRUGS, INITIAL ENCOUNTER",MAM011,ELECTROENCEPHALOGRAM (EEG),812,POISONING OF MEDICINAL AGENTS,21,"INJURIES, POISONINGS AND TOXIC EFFECTS OF DRUGS",3,Major,Moderate,Medical,Private Health Insurance,,,,,true,123186.34,19767.15
Hudson Valley,Dutchess,5957001,000180,Mid-Hudson Valley Division of Westchester Medical Center,30 to 49,126,M,White,Not Span/Hispanic,1,Emergency,Court/Law Enforcement,2018,INJ022,"POISONING BY DRUGS, INITIAL ENCOUNTER",,,812,POISONING OF MEDICINAL AGENTS,21,"INJURIES, POISONINGS AND TOXIC EFFECTS OF DRUGS",1,Minor,Minor,Medical,Medicaid,Medicaid,,,,true,14282.01,1398.36
New York City,Manhattan,7002054,001437,New York-Presbyterian/Lower Manhattan Hospital,50 to 69,100,M,Other Race,Spanish/Hispanic,3,Emergency,Home or Self Care,2018,INJ022,"POISONING BY DRUGS, INITIAL ENCOUNTER",ADM021,"ADMINISTRATION OF THERAPEUTIC SUBSTANCES, NEC",812,POISONING OF MEDICINAL AGENTS,21,"INJURIES, POISONINGS AND TOXIC EFFECTS OF DRUGS",2,Moderate,Minor,Medical,"Managed Care, Unspecified",Medicaid,Self-Pay,,,true,65971.67,30406.57
Hudson Valley,Putnam,3950000,000752,Putnam Hospital,70 or Older,105,M,White,Not Span/Hispanic,2,Emergency,Home or Self Care,2018,INJ022,"POISONING BY DRUGS, INITIAL ENCOUNTER",,,812,POISONING OF MEDICINAL AGENTS,21,"INJURIES, POISONINGS AND TOXIC EFFECTS OF DRUGS",2,Moderate,Major,Medical,Medicare,Blue Cross/Blue Shield,Federal/State/Local/VA,,,true,12795.73,4746.42
Western NY,Erie,1401005,000210,Erie County Medical Center,30 to 49,142,M,White,Not Span/Hispanic,2,Emergency,Court/Law Enforcement,2018,INJ022,"POISONING BY DRUGS, INITIAL ENCOUNTER",,,812,POISONING OF MEDICINAL AGENTS,21,"INJURIES, POISONINGS AND TOXIC EFFECTS OF DRUGS",2,Moderate,Moderate,Medical,Medicaid,Medicaid,,,,true,8845.43,4284.19
Western NY,Erie,1401014,000208,John R. Oishei Children's Hospital,0 to 17,140,M,Other Race,Spanish/Hispanic,1,Urgent,Home or Self Care,2018,INJ022,"POISONING BY DRUGS, INITIAL ENCOUNTER",,,812,POISONING OF MEDICINAL AGENTS,21,"INJURIES, POISONINGS AND TOXIC EFFECTS OF DRUGS",1,Minor,Minor,Medical,Medicaid,Self-Pay,,,,false,7279.12,3044.84
New York City,Kings,7001035,001318,Wyckoff Heights Medical Center,30 to 49,112,M,Other Race,Not Span/Hispanic,1,Emergency,Home or Self Care,2018,INJ022,"POISONING BY DRUGS, INITIAL ENCOUNTER",,,812,POISONING OF MEDICINAL AGENTS,21,"INJURIES, POISONINGS AND TOXIC EFFECTS OF DRUGS",2,Moderate,Moderate,Medical,Medicaid,Miscellaneous/Other,,,,true,11097.98,3576.48
New York City,Manhattan,7002009,001445,Harlem Hospital Center,30 to 49,100,M,Other Race,Spanish/Hispanic,1,Emergency,Left Against Medical Advice,2018,INJ022,"POISONING BY DRUGS, INITIAL ENCOUNTER",IMG007,COMPUTERIZED TOMOGRAPHY (CT) WITHOUT CONTRAST,812,POISONING OF MEDICINAL AGENTS,21,"INJURIES, POISONINGS AND TOXIC EFFECTS OF DRUGS",2,Moderate,Minor,Medical,Medicaid,Medicaid,,,,true,6440.21,4785.92
New York City,Queens,7003010,001637,New York - Presbyterian/Queens,50 to 69,114,M,Other Race,Not Span/Hispanic,7,Emergency,Skilled Nursing Home,2018,INJ022,"POISONING BY DRUGS, INITIAL ENCOUNTER",ADM021,"ADMINISTRATION OF THERAPEUTIC SUBSTANCES, NEC",812,POISONING OF MEDICINAL AGENTS,21,"INJURIES, POISONINGS AND TOXIC EFFECTS OF DRUGS",4,Extreme,Extreme,Medical,Medicare,Medicaid,Self-Pay,,,true,64003.61,15671.08
New York City,Bronx,7000008,001172,Lincoln Medical & Mental Health Center,70 or Older,104,F,Other Race,Spanish/Hispanic,2,Emergency,Home or Self Care,2018,INJ022,"POISONING BY DRUGS, INITIAL ENCOUNTER",,,812,POISONING OF MEDICINAL AGENTS,21,"INJURIES, POISONINGS AND TOXIC EFFECTS OF DRUGS",3,Major,Moderate,Medical,Medicare,Medicare,Medicaid,,,false,13173.88,7779.93
New York City,Bronx,7000008,001172,Lincoln Medical & Mental Health Center,30 to 49,104,M,Other Race,Spanish/Hispanic,2,Emergency,Home or Self Care,2018,INJ022,"POISONING BY DRUGS, INITIAL ENCOUNTER",URN006,BLADDER CATHETERIZATION AND DRAINAGE,812,POISONING OF MEDICINAL AGENTS,21,"INJURIES, POISONINGS AND TOXIC EFFECTS OF DRUGS",3,Major,Moderate,Medical,Medicaid,,,,,true,15850.1,9360.39
Finger Lakes,Monroe,2701005,000413,Strong Memorial Hospital,70 or Older,144,F,White,Not Span/Hispanic,1,Emergency,Home w/ Home Health Services,2018,INJ022,"POISONING BY DRUGS, INITIAL ENCOUNTER",,,812,POISONING OF MEDICINAL AGENTS,21,"INJURIES, POISONINGS AND TOXIC EFFECTS OF DRUGS",3,Major,Major,Medical,Medicare,,,,,true,4775.49,1813.35
Long Island,Suffolk,5123000,000885,Long Island Community Hospital,50 to 69,119,M,Black/African American,Not Span/Hispanic,8,Emergency,Skilled Nursing Home,2018,INJ022,"POISONING BY DRUGS, INITIAL ENCOUNTER",GIS006,PARACENTESIS,812,POISONING OF MEDICINAL AGENTS,21,"INJURIES, POISONINGS AND TOXIC EFFECTS OF DRUGS",3,Major,Extreme,Medical,Medicare,Medicare,Medicaid,,,true,91950.71,15745.84
New York City,Manhattan,7002054,003975,New York Presbyterian Hospital - Allen Hospital,30 to 49,100,M,Black/African American,Multi-ethnic,5,Emergency,Psychiatric Hospital or Unit of Hosp,2018,MBD012,SUICIDAL IDEATION/ATTEMPT/INTENTIONAL SELF-HARM,,,812,POISONING OF MEDICINAL AGENTS,21,"INJURIES, POISONINGS AND TOXIC EFFECTS OF DRUGS",3,Major,Major,Medical,Medicaid,Medicaid,Self-Pay,,,true,56946.65,12583.69
New York City,Manhattan,7002054,003975,New York Presbyterian Hospital - Allen Hospital,50 to 69,104,F,Other Race,Not Span/Hispanic,4,Emergency,Home or Self Care,2018,INJ022,"POISONING BY DRUGS, INITIAL ENCOUNTER",ESA003,MECHANICAL VENTILATION,812,POISONING OF MEDICINAL AGENTS,21,"INJURIES, POISONINGS AND TOXIC EFFECTS OF DRUGS",4,Extreme,Extreme,Medical,Medicaid,Medicaid,Self-Pay,,,true,99290.28,38315.23
New York City,Manhattan,7002054,001464,New York-Presbyterian Hospital - Columbia Presbyterian Center,50 to 69,100,F,Multi-racial,Multi-ethnic,1,Emergency,Home or Self Care,2018,INJ022,"POISONING BY DRUGS, INITIAL ENCOUNTER",,,812,POISONING OF MEDICINAL AGENTS,21,"INJURIES, POISONINGS AND TOXIC EFFECTS OF DRUGS",2,Moderate,Moderate,Medical,Medicaid,Medicaid,Self-Pay,,,true,17928.86,3826.5
Western NY,Erie,1401008,000213,Mercy Hospital of Buffalo,18 to 29,142,F,White,Not Span/Hispanic,2,Emergency,Left Against Medical Advice,2018,INJ022,"POISONING BY DRUGS, INITIAL ENCOUNTER",,,812,POISONING OF MEDICINAL AGENTS,21,"INJURIES, POISONINGS AND TOXIC EFFECTS OF DRUGS",2,Moderate,Minor,Medical,Medicaid,,,,,true,7075.66,2712.51
New York City,Manhattan,7002054,001464,New York-Presbyterian Hospital - Columbia Presbyterian Center,30 to 49,112,F,Multi-racial,Not Span/Hispanic,9,Emergency,Home or Self Care,2018,INJ022,"POISONING BY DRUGS, INITIAL ENCOUNTER",,,812,POISONING OF MEDICINAL AGENTS,21,"INJURIES, POISONINGS AND TOXIC EFFECTS OF DRUGS",3,Major,Minor,Medical,Medicare,Medicaid,Self-Pay,,,true,147154.36,69645.74
New York City,Manhattan,7002032,001466,Mount Sinai West,30 to 49,100,M,White,Not Span/Hispanic,1,Emergency,Left Against Medical Advice,2018,INJ022,"POISONING BY DRUGS, INITIAL ENCOUNTER",ESA003,MECHANICAL VENTILATION,812,POISONING OF MEDICINAL AGENTS,21,"INJURIES, POISONINGS AND TOXIC EFFECTS OF DRUGS",3,Major,Major,Medical,Medicaid,Medicaid,Self-Pay,,,true,23786.41,7981.29
Western NY,Erie,1401008,000213,Mercy Hospital of Buffalo,18 to 29,140,F,White,Not Span/Hispanic,1,Emergency,Psychiatric Hospital or Unit of Hosp,2018,MBD012,SUICIDAL IDEATION/ATTEMPT/INTENTIONAL SELF-HARM,,,812,POISONING OF MEDICINAL AGENTS,21,"INJURIES, POISONINGS AND TOXIC EFFECTS OF DRUGS",3,Major,Moderate,Medical,Private Health Insurance,,,,,true,5100.47,2164.67
New York City,Richmond,7004003,001740,Staten Island University Hosp-North,18 to 29,103,F,White,Not Span/Hispanic,1,Emergency,Left Against Medical Advice,2018,INJ022,"POISONING BY DRUGS, INITIAL ENCOUNTER",,,812,POISONING OF MEDICINAL AGENTS,21,"INJURIES, POISONINGS AND TOXIC EFFECTS OF DRUGS",2,Moderate,Minor,Medical,Medicaid,Medicaid,,,,true,6698.87,1830.83
New York City,Kings,7001020,001305,Maimonides Medical Center,50 to 69,112,F,Black/African American,Not Span/Hispanic,4,Emergency,Home w/ Home Health Services,2018,INJ022,"POISONING BY DRUGS, INITIAL ENCOUNTER",CAR024,VENOUS AND ARTERIAL CATHETER PLACEMENT,812,POISONING OF MEDICINAL AGENTS,21,"INJURIES, POISONINGS AND TOXIC EFFECTS OF DRUGS",3,Major,Major,Medical,Medicare,Medicare,Medicaid,,,true,48390.89,14342.25
New York City,Kings,7002053,001304,NYU Langone Hospital-Brooklyn,30 to 49,112,F,White,Not Span/Hispanic,1,Emergency,Psychiatric Hospital or Unit of Hosp,2018,MBD012,SUICIDAL IDEATION/ATTEMPT/INTENTIONAL SELF-HARM,,,812,POISONING OF MEDICINAL AGENTS,21,"INJURIES, POISONINGS AND TOXIC EFFECTS OF DRUGS",2,Moderate,Minor,Medical,Blue Cross/Blue Shield,,,,,true,33204.21,9423.42
Hudson Valley,Dutchess,5957001,000180,Mid-Hudson Valley Division of Westchester Medical Center,30 to 49,125,F,White,Not Span/Hispanic,2,Emergency,Left Against Medical Advice,2018,INJ022,"POISONING BY DRUGS, INITIAL ENCOUNTER",,,812,POISONING OF MEDICINAL AGENTS,21,"INJURIES, POISONINGS AND TOXIC EFFECTS OF DRUGS",2,Moderate,Minor,Medical,Medicaid,Medicaid,,,,true,44198.79,7102.99
Finger Lakes,Steuben,5001000,000866,Corning Hospital,50 to 69,148,F,White,Not Span/Hispanic,1,Emergency,Psychiatric Hospital or Unit of Hosp,2018,MBD012,SUICIDAL IDEATION/ATTEMPT/INTENTIONAL SELF-HARM,,,812,POISONING OF MEDICINAL AGENTS,21,"INJURIES, POISONINGS AND TOXIC EFFECTS OF DRUGS",2,Moderate,Moderate,Medical,Medicare,Medicaid,,,,true,9162.5,3164.48
Central NY,Madison,2601001,000397,Oneida Health Hospital,50 to 69,133,M,White,Not Span/Hispanic,7,Emergency,Home or Self Care,2018,INJ022,"POISONING BY DRUGS, INITIAL ENCOUNTER",ESA004,NON-INVASIVE VENTILATION,812,POISONING OF MEDICINAL AGENTS,21,"INJURIES, POISONINGS AND TOXIC EFFECTS OF DRUGS",4,Extreme,Major,Medical,Medicare,Medicaid,Self-Pay,,,true,29712.52,14816.86
New York City,Manhattan,7002054,001464,New York-Presbyterian Hospital - Columbia Presbyterian Center,18 to 29,100,F,White,Not Span/Hispanic,1,Emergency,Home or Self Care,2018,INJ022,"POISONING BY DRUGS, INITIAL ENCOUNTER",,,812,POISONING OF MEDICINAL AGENTS,21,"INJURIES, POISONINGS AND TOXIC EFFECTS OF DRUGS",3,Major,Minor,Medical,Private Health Insurance,Self-Pay,,,,true,16344.32,3751.59
Hudson Valley,Westchester,5957001,001139,Westchester Medical Center,0 to 17,107,F,White,Not Span/Hispanic,1,Emergency,Home or Self Care,2018,INJ022,"POISONING BY DRUGS, INITIAL ENCOUNTER",,,812,POISONING OF MEDICINAL AGENTS,21,"INJURIES, POISONINGS AND TOXIC EFFECTS OF DRUGS",1,Minor,Minor,Medical,Medicaid,Medicaid,,,,true,26547,4507.11
Western NY,Erie,1401013,000218,Sisters of Charity Hospital,70 or Older,142,M,Black/African American,Not Span/Hispanic,5,Emergency,Home w/ Home Health Services,2018,INJ022,"POISONING BY DRUGS, INITIAL ENCOUNTER",ESA003,MECHANICAL VENTILATION,812,POISONING OF MEDICINAL AGENTS,21,"INJURIES, POISONINGS AND TOXIC EFFECTS OF DRUGS",4,Extreme,Extreme,Medical,Medicare,Medicare,Blue Cross/Blue Shield,,,true,23772.85,10313.49
New York City,Manhattan,7002054,003975,New York Presbyterian Hospital - Allen Hospital,50 to 69,104,M,Other Race,Spanish/Hispanic,9,Emergency,Skilled Nursing Home,2018,INJ022,"POISONING BY DRUGS, INITIAL ENCOUNTER",ESA001,HEMODIALYSIS,812,POISONING OF MEDICINAL AGENTS,21,"INJURIES, POISONINGS AND TOXIC EFFECTS OF DRUGS",3,Major,Moderate,Medical,Private Health Insurance,Self-Pay,,,,true,100687.23,24073.07
New York City,Bronx,7000006,001169,Montefiore Medical Center - Henry & Lucy Moses Div,30 to 49,104,M,Black/African American,Not Span/Hispanic,1,Emergency,Home or Self Care,2018,INJ022,"POISONING BY DRUGS, INITIAL ENCOUNTER",,,812,POISONING OF MEDICINAL AGENTS,21,"INJURIES, POISONINGS AND TOXIC EFFECTS OF DRUGS",2,Moderate,Minor,Medical,Medicaid,,,,,true,21264.03,3579.33
Central NY,Onondaga,3301007,000635,University Hospital SUNY Health Science Center,18 to 29,130,M,White,Not Span/Hispanic,1,Emergency,Home or Self Care,2018,INJ022,"POISONING BY DRUGS, INITIAL ENCOUNTER",RES007,AIRWAY INTUBATION,812,POISONING OF MEDICINAL AGENTS,21,"INJURIES, POISONINGS AND TOXIC EFFECTS OF DRUGS",3,Major,Moderate,Medical,Blue Cross/Blue Shield,,,,,true,20993.1,4950.47
New York City,Queens,7003004,001630,Long Island Jewish Medical Center,30 to 49,112,F,Other Race,Not Span/Hispanic,4,Emergency,Home or Self Care,2018,INJ022,"POISONING BY DRUGS, INITIAL ENCOUNTER",,,812,POISONING OF MEDICINAL AGENTS,21,"INJURIES, POISONINGS AND TOXIC EFFECTS OF DRUGS",1,Minor,Minor,Medical,Medicaid,Self-Pay,,,,true,45367.35,7426.61
Central NY,Onondaga,3301003,000630,St. Joseph's Hospital Health Center,70 or Older,130,F,White,Not Span/Hispanic,11,Emergency,Home or Self Care,2018,INJ022,"POISONING BY DRUGS, INITIAL ENCOUNTER",,,812,POISONING OF MEDICINAL AGENTS,21,"INJURIES, POISONINGS AND TOXIC EFFECTS OF DRUGS",1,Minor,Minor,Medical,Medicare,,,,,true,23667.48,10191.04
New York City,Manhattan,7002009,001445,Harlem Hospital Center,30 to 49,100,M,Other Race,Spanish/Hispanic,1,Emergency,Left Against Medical Advice,2018,INJ022,"POISONING BY DRUGS, INITIAL ENCOUNTER",,,812,POISONING OF MEDICINAL AGENTS,21,"INJURIES, POISONINGS AND TOXIC EFFECTS OF DRUGS",2,Moderate,Minor,Medical,Blue Cross/Blue Shield,Medicaid,,,,true,8692.05,6459.33
Capital/Adirond,Albany,0101000,000001,Albany Medical Center Hospital,50 to 69,120,F,White,Not Span/Hispanic,5,Emergency,Psychiatric Hospital or Unit of Hosp,2018,MBD012,SUICIDAL IDEATION/ATTEMPT/INTENTIONAL SELF-HARM,ESA003,MECHANICAL VENTILATION,812,POISONING OF MEDICINAL AGENTS,21,"INJURIES, POISONINGS AND TOXIC EFFECTS OF DRUGS",4,Extreme,Extreme,Medical,Blue Cross/Blue Shield,Medicare,,,,true,56442.67,13344.98
New York City,Kings,7001020,001305,Maimonides Medical Center,50 to 69,112,M,White,Not Span/Hispanic,1,Emergency,Home or Self Care,2018,INJ022,"POISONING BY DRUGS, INITIAL ENCOUNTER",IMG006,COMPUTERIZED TOMOGRAPHY (CT) WITH CONTRAST,812,POISONING OF MEDICINAL AGENTS,21,"INJURIES, POISONINGS AND TOXIC EFFECTS OF DRUGS",2,Moderate,Moderate,Medical,Medicare,Medicare,Self-Pay,,,false,10937,2731.79
Long Island,Nassau,2951001,000541,North Shore University Hospital,50 to 69,115,F,Black/African American,Not Span/Hispanic,2,Emergency,Home or Self Care,2018,INJ022,"POISONING BY DRUGS, INITIAL ENCOUNTER",CNS002,LUMBAR PUNCTURE,812,POISONING OF MEDICINAL AGENTS,21,"INJURIES, POISONINGS AND TOXIC EFFECTS OF DRUGS",3,Major,Major,Medical,Medicare,Blue Cross/Blue Shield,,,,true,47190.23,8937.86
Capital/Adirond,Albany,0101004,000005,St. Peter's Hospital,50 to 69,120,F,White,Not Span/Hispanic,5,Emergency,Home w/ Home Health Services,2018,INJ022,"POISONING BY DRUGS, INITIAL ENCOUNTER",,,812,POISONING OF MEDICINAL AGENTS,21,"INJURIES, POISONINGS AND TOXIC EFFECTS OF DRUGS",4,Extreme,Extreme,Medical,Medicare,Medicaid,,,,true,49593.42,14039.3
New York City,Kings,7001045,001692,Woodhull Medical & Mental Health Center,0 to 17,112,F,Black/African American,Not Span/Hispanic,1,Emergency,Home or Self Care,2018,INJ022,"POISONING BY DRUGS, INITIAL ENCOUNTER",,,812,POISONING OF MEDICINAL AGENTS,21,"INJURIES, POISONINGS AND TOXIC EFFECTS OF DRUGS",1,Minor,Minor,Medical,Medicaid,Medicaid,,,,true,6267.09,4893.24
New York City,Manhattan,7002054,001464,New York-Presbyterian Hospital - Columbia Presbyterian Center,50 to 69,104,M,Multi-racial,Not Span/Hispanic,1,Emergency,Psychiatric Hospital or Unit of Hosp,2018,MBD012,SUICIDAL IDEATION/ATTEMPT/INTENTIONAL SELF-HARM,,,812,POISONING OF MEDICINAL AGENTS,21,"INJURIES, POISONINGS AND TOXIC EFFECTS OF DRUGS",2,Moderate,Minor,Medical,Medicaid,Medicaid,Self-Pay,,,false,7002.35,1708.52
Long Island,Nassau,2950001,000527,Mount Sinai South Nassau,50 to 69,115,F,White,Not Span/Hispanic,3,Emergency,Home or Self Care,2018,INJ022,"POISONING BY DRUGS, INITIAL ENCOUNTER",,,812,POISONING OF MEDICINAL AGENTS,21,"INJURIES, POISONINGS AND TOXIC EFFECTS OF DRUGS",2,Moderate,Moderate,Medical,Medicare,Blue Cross/Blue Shield,,,,true,39038.18,7654.25
New York City,Kings,7001009,001294,Coney Island Hospital,30 to 49,112,F,White,Not Span/Hispanic,4,Emergency,Home or Self Care,2018,INJ022,"POISONING BY DRUGS, INITIAL ENCOUNTER",MAM011,ELECTROENCEPHALOGRAM (EEG),812,POISONING OF MEDICINAL AGENTS,21,"INJURIES, POISONINGS AND TOXIC EFFECTS OF DRUGS",2,Moderate,Moderate,Medical,Medicaid,,,,,true,37413.1,20941.2
New York City,Manhattan,7002054,001437,New York-Presbyterian/Lower Manhattan Hospital,50 to 69,112,M,Black/African American,Not Span/Hispanic,3,Emergency,Home or Self Care,2018,MBD012,SUICIDAL IDEATION/ATTEMPT/INTENTIONAL SELF-HARM,ADM021,"ADMINISTRATION OF THERAPEUTIC SUBSTANCES, NEC",812,POISONING OF MEDICINAL AGENTS,21,"INJURIES, POISONINGS AND TOXIC EFFECTS OF DRUGS",2,Moderate,Moderate,Medical,"Managed Care, Unspecified",Medicaid,Self-Pay,,,true,34292.59,7742.41