Hospital Service Area,Hospital County,Operating Certificate Number,Permanent Facility Id,Facility Name,Age Group,Zip Code - 3 digits,Gender,Race,Ethnicity,Length of Stay,Type of Admission,Patient Disposition,Discharge Year,CCS Diagnosis Code,CCS Diagnosis Description,CCS Procedure Code,CCS Procedure Description,APR DRG Code,APR DRG Description,APR MDC Code,APR MDC Description,APR Severity of Illness Code,APR Severity of Illness Description,APR Risk of Mortality,APR Medical Surgical Description,Payment Typology 1,Payment Typology 2,Payment Typology 3,Birth Weight,Abortion Edit Indicator,Emergency Department Indicator,Total Charges,Total Costs
New York City,Kings,7002053,001304,NYU Langone Hospital-Brooklyn,50 to 69,112,M,White,Spanish/Hispanic,3,Emergency,Home or Self Care,2019,INJ022,"POISONING BY DRUGS, INITIAL ENCOUNTER",,,812,POISONING OF MEDICINAL AGENTS,21,"INJURIES, POISONINGS AND TOXIC EFFECTS OF DRUGS",2,Moderate,Moderate,Medical,Medicaid,,,,,true,34822.06,11304.48
New York City,Kings,7002053,001304,NYU Langone Hospital-Brooklyn,50 to 69,112,M,Other Race,Not Span/Hispanic,3,Emergency,Home w/ Home Health Services,2019,INJ022,"POISONING BY DRUGS, INITIAL ENCOUNTER",RES007,AIRWAY INTUBATION,812,POISONING OF MEDICINAL AGENTS,21,"INJURIES, POISONINGS AND TOXIC EFFECTS OF DRUGS",4,Extreme,Extreme,Medical,Medicare,,,,,true,67527.18,19137.45
New York City,Kings,7002053,001304,NYU Langone Hospital-Brooklyn,18 to 29,112,M,Other Race,Spanish/Hispanic,2,Emergency,Home or Self Care,2019,INJ022,"POISONING BY DRUGS, INITIAL ENCOUNTER",,,812,POISONING OF MEDICINAL AGENTS,21,"INJURIES, POISONINGS AND TOXIC EFFECTS OF DRUGS",2,Moderate,Minor,Medical,Medicaid,,,,,true,39193.9,12962.68
New York City,Kings,7002053,001304,NYU Langone Hospital-Brooklyn,30 to 49,112,M,Other Race,Spanish/Hispanic,7,Emergency,Psychiatric Hospital or Unit of Hosp,2019,INJ022,"POISONING BY DRUGS, INITIAL ENCOUNTER",MHT002,PSYCHOTHERAPY FOR MENTAL HEALTH (EXCLUDING SUBSTANCE USE),812,POISONING OF MEDICINAL AGENTS,21,"INJURIES, POISONINGS AND TOXIC EFFECTS OF DRUGS",3,Major,Major,Medical,Medicaid,,,,,true,101242.97,42418.97
New York City,Kings,7002053,001304,NYU Langone Hospital-Brooklyn,70 or Older,112,M,White,Not Span/Hispanic,5,Emergency,Home w/ Home Health Services,2019,INJ022,"POISONING BY DRUGS, INITIAL ENCOUNTER",,,812,POISONING OF MEDICINAL AGENTS,21,"INJURIES, POISONINGS AND TOXIC EFFECTS OF DRUGS",3,Major,Extreme,Medical,Medicare,Medicaid,,,,true,87097.01,24129.53
New York City,Kings,7002053,001304,NYU Langone Hospital-Brooklyn,70 or Older,112,F,Other Race,Not Span/Hispanic,9,Emergency,Home w/ Home Health Services,2019,INJ022,"POISONING BY DRUGS, INITIAL ENCOUNTER",CNS002,LUMBAR PUNCTURE,812,POISONING OF MEDICINAL AGENTS,21,"INJURIES, POISONINGS AND TOXIC EFFECTS OF DRUGS",3,Major,Major,Medical,Medicare,Medicaid,,,,true,135841.2,38510.62
New York City,Kings,7002053,001304,NYU Langone Hospital-Brooklyn,70 or Older,112,F,Other Race,Not Span/Hispanic,3,Emergency,Home or Self Care,2019,INJ022,"POISONING BY DRUGS, INITIAL ENCOUNTER",,,812,POISONING OF MEDICINAL AGENTS,21,"INJURIES, POISONINGS AND TOXIC EFFECTS OF DRUGS",2,Moderate,Major,Medical,Medicare,,,,,true,34675.41,11698.37
New York City,Kings,7002053,001304,NYU Langone Hospital-Brooklyn,18 to 29,112,F,Black/African American,Not Span/Hispanic,1,Emergency,Home or Self Care,2019,INJ022,"POISONING BY DRUGS, INITIAL ENCOUNTER",,,812,POISONING OF MEDICINAL AGENTS,21,"INJURIES, POISONINGS AND TOXIC EFFECTS OF DRUGS",2,Moderate,Minor,Medical,Private Health Insurance,,,,,true,23484.68,5848.94
New York City,Kings,7002053,001304,NYU Langone Hospital-Brooklyn,30 to 49,OOS,F,White,Not Span/Hispanic,1,Emergency,Home or Self Care,2019,MBD012,SUICIDAL IDEATION/ATTEMPT/INTENTIONAL SELF-HARM,,,812,POISONING OF MEDICINAL AGENTS,21,"INJURIES, POISONINGS AND TOXIC EFFECTS OF DRUGS",1,Minor,Minor,Medical,Blue Cross/Blue Shield,,,,,true,16735.13,4664.78
New York City,Kings,7002053,001304,NYU Langone Hospital-Brooklyn,18 to 29,112,F,Other Race,Spanish/Hispanic,4,Emergency,Left Against Medical Advice,2019,INJ022,"POISONING BY DRUGS, INITIAL ENCOUNTER",MAM011,ELECTROENCEPHALOGRAM (EEG),812,POISONING OF MEDICINAL AGENTS,21,"INJURIES, POISONINGS AND TOXIC EFFECTS OF DRUGS",2,Moderate,Minor,Medical,Medicaid,,,,,true,69880.59,18041.33
New York City,Kings,7002053,001304,NYU Langone Hospital-Brooklyn,70 or Older,112,F,Other Race,Spanish/Hispanic,3,Emergency,Home w/ Home Health Services,2019,INJ022,"POISONING BY DRUGS, INITIAL ENCOUNTER",,,812,POISONING OF MEDICINAL AGENTS,21,"INJURIES, POISONINGS AND TOXIC EFFECTS OF DRUGS",2,Moderate,Minor,Medical,Medicare,Medicaid,,,,true,51912.91,14026.63
New York City,Kings,7002053,001304,NYU Langone Hospital-Brooklyn,70 or Older,112,F,White,Not Span/Hispanic,20,Emergency,Skilled Nursing Home,2019,INJ022,"POISONING BY DRUGS, INITIAL ENCOUNTER",ADM015,ADMINISTRATION OF ANTIBIOTICS,812,POISONING OF MEDICINAL AGENTS,21,"INJURIES, POISONINGS AND TOXIC EFFECTS OF DRUGS",4,Extreme,Extreme,Medical,Blue Cross/Blue Shield,Medicaid,,,,true,215258.65,71909.61
New York City,Kings,7002053,001304,NYU Langone Hospital-Brooklyn,18 to 29,112,M,Other Race,Spanish/Hispanic,3,Emergency,Psychiatric Hospital or Unit of Hosp,2019,MBD012,SUICIDAL IDEATION/ATTEMPT/INTENTIONAL SELF-HARM,,,812,POISONING OF MEDICINAL AGENTS,21,"INJURIES, POISONINGS AND TOXIC EFFECTS OF DRUGS",2,Moderate,Minor,Medical,Medicaid,,,,,true,33596.71,11464.82
New York City,Kings,7002053,001304,NYU Langone Hospital-Brooklyn,18 to 29,112,M,Other Race,Not Span/Hispanic,1,Emergency,Left Against Medical Advice,2019,INJ022,"POISONING BY DRUGS, INITIAL ENCOUNTER",,,812,POISONING OF MEDICINAL AGENTS,21,"INJURIES, POISONINGS AND TOXIC EFFECTS OF DRUGS",3,Major,Moderate,Medical,Medicaid,,,,,true,10133.5,3635.02
New York City,Kings,7002053,001304,NYU Langone Hospital-Brooklyn,50 to 69,112,M,Other Race,Not Span/Hispanic,8,Emergency,Home or Self Care,2019,INJ022,"POISONING BY DRUGS, INITIAL ENCOUNTER",LYM001,LYMPH NODE BIOPSY,812,POISONING OF MEDICINAL AGENTS,21,"INJURIES, POISONINGS AND TOXIC EFFECTS OF DRUGS",3,Major,Major,Medical,Self-Pay,,,,,true,120275.85,33985.71
New York City,Kings,7002053,001304,NYU Langone Hospital-Brooklyn,50 to 69,112,F,White,Not Span/Hispanic,1,Emergency,Home or Self Care,2019,INJ022,"POISONING BY DRUGS, INITIAL ENCOUNTER",,,812,POISONING OF MEDICINAL AGENTS,21,"INJURIES, POISONINGS AND TOXIC EFFECTS OF DRUGS",2,Moderate,Minor,Medical,Medicare,,,,,true,15698.41,4635.29
New York City,Kings,7002053,001304,NYU Langone Hospital-Brooklyn,50 to 69,116,M,Other Race,Not Span/Hispanic,2,Emergency,Home or Self Care,2019,INJ022,"POISONING BY DRUGS, INITIAL ENCOUNTER",,,812,POISONING OF MEDICINAL AGENTS,21,"INJURIES, POISONINGS AND TOXIC EFFECTS OF DRUGS",3,Major,Major,Medical,Medicaid,,,,,true,31433.6,8812.96
New York City,Kings,7002053,001304,NYU Langone Hospital-Brooklyn,50 to 69,112,F,White,Unknown,1,Emergency,Home or Self Care,2019,MBD012,SUICIDAL IDEATION/ATTEMPT/INTENTIONAL SELF-HARM,MHT005,"MENTAL HEALTH PROCEDURES, NEC",812,POISONING OF MEDICINAL AGENTS,21,"INJURIES, POISONINGS AND TOXIC EFFECTS OF DRUGS",1,Minor,Minor,Medical,Private Health Insurance,,,,,true,17645.6,4875.97
New York City,Kings,7002053,001304,NYU Langone Hospital-Brooklyn,30 to 49,112,M,Other Race,Spanish/Hispanic,1,Emergency,Home or Self Care,2019,INJ022,"POISONING BY DRUGS, INITIAL ENCOUNTER",,,812,POISONING OF MEDICINAL AGENTS,21,"INJURIES, POISONINGS AND TOXIC EFFECTS OF DRUGS",2,Moderate,Moderate,Medical,Medicaid,,,,,true,48880.58,11130.71
New York City,Kings,7002053,001304,NYU Langone Hospital-Brooklyn,50 to 69,112,F,White,Not Span/Hispanic,2,Emergency,Home or Self Care,2019,INJ022,"POISONING BY DRUGS, INITIAL ENCOUNTER",ADM007,INTRAVENOUS INDUCTION OF LABOR,812,POISONING OF MEDICINAL AGENTS,21,"INJURIES, POISONINGS AND TOXIC EFFECTS OF DRUGS",3,Major,Moderate,Medical,Medicaid,,,,,true,25101.67,7989.79
New York City,Kings,7002053,001304,NYU Langone Hospital-Brooklyn,70 or Older,112,F,Other Race,Unknown,3,Emergency,Home w/ Home Health Services,2019,INJ022,"POISONING BY DRUGS, INITIAL ENCOUNTER",ESA001,HEMODIALYSIS,812,POISONING OF MEDICINAL AGENTS,21,"INJURIES, POISONINGS AND TOXIC EFFECTS OF DRUGS",3,Major,Moderate,Medical,Medicare,Medicaid,,,,true,62739.23,18941.79
New York City,Kings,7002053,001304,NYU Langone Hospital-Brooklyn,30 to 49,100,F,White,Not Span/Hispanic,1,Emergency,Short-term Hospital,2019,MBD012,SUICIDAL IDEATION/ATTEMPT/INTENTIONAL SELF-HARM,,,812,POISONING OF MEDICINAL AGENTS,21,"INJURIES, POISONINGS AND TOXIC EFFECTS OF DRUGS",2,Moderate,Minor,Medical,Medicaid,,,,,false,6389.39,2501.29
New York City,Kings,7002053,001304,NYU Langone Hospital-Brooklyn,30 to 49,112,M,Other Race,Spanish/Hispanic,1,Emergency,Left Against Medical Advice,2019,INJ022,"POISONING BY DRUGS, INITIAL ENCOUNTER",,,812,POISONING OF MEDICINAL AGENTS,21,"INJURIES, POISONINGS AND TOXIC EFFECTS OF DRUGS",3,Major,Major,Medical,Blue Cross/Blue Shield,Medicare,,,,true,21067.83,5203.35
New York City,Kings,7002053,001304,NYU Langone Hospital-Brooklyn,18 to 29,,M,White,Unknown,2,Emergency,Home or Self Care,2019,INJ022,"POISONING BY DRUGS, INITIAL ENCOUNTER",MAM011,ELECTROENCEPHALOGRAM (EEG),812,POISONING OF MEDICINAL AGENTS,21,"INJURIES, POISONINGS AND TOXIC EFFECTS OF DRUGS",2,Moderate,Minor,Medical,Medicaid,,,,,true,32786.57,9211.71
New York City,Kings,7002053,001304,NYU Langone Hospital-Brooklyn,18 to 29,112,F,White,Not Span/Hispanic,1,Emergency,Home or Self Care,2019,INJ022,"POISONING BY DRUGS, INITIAL ENCOUNTER",,,812,POISONING OF MEDICINAL AGENTS,21,"INJURIES, POISONINGS AND TOXIC EFFECTS OF DRUGS",1,Minor,Minor,Medical,Private Health Insurance,,,,,true,17882.15,4731.26
New York City,Kings,7002053,001304,NYU Langone Hospital-Brooklyn,50 to 69,112,M,White,Spanish/Hispanic,2,Emergency,Home w/ Home Health Services,2019,INJ022,"POISONING BY DRUGS, INITIAL ENCOUNTER",ESA004,NON-INVASIVE VENTILATION,812,POISONING OF MEDICINAL AGENTS,21,"INJURIES, POISONINGS AND TOXIC EFFECTS OF DRUGS",3,Major,Moderate,Medical,Medicaid,,,,,true,60152.12,17592.2
New York City,Kings,7002053,001304,NYU Langone Hospital-Brooklyn,70 or Older,112,M,Black/African American,Not Span/Hispanic,6,Emergency,Home or Self Care,2019,INJ022,"POISONING BY DRUGS, INITIAL ENCOUNTER",,,812,POISONING OF MEDICINAL AGENTS,21,"INJURIES, POISONINGS AND TOXIC EFFECTS OF DRUGS",4,Extreme,Extreme,Medical,Medicare,,,,,true,70157.28,22730.28
New York City,Kings,7002053,001304,NYU Langone Hospital-Brooklyn,50 to 69,112,F,Other Race,Not Span/Hispanic,5,Emergency,Home w/ Home Health Services,2019,INJ022,"POISONING BY DRUGS, INITIAL ENCOUNTER",CAR024,VENOUS AND ARTERIAL CATHETER PLACEMENT,812,POISONING OF MEDICINAL AGENTS,21,"INJURIES, POISONINGS AND TOXIC EFFECTS OF DRUGS",3,Major,Major,Medical,Medicare,Federal/State/Local/VA,,,,true,260370.4,32212.62
New York City,Kings,7002053,001304,NYU Langone Hospital-Brooklyn,18 to 29,112,F,Black/African American,Not Span/Hispanic,11,Emergency,Home or Self Care,2019,INJ022,"POISONING BY DRUGS, INITIAL ENCOUNTER",GIS017,GASTROSTOMY,812,POISONING OF MEDICINAL AGENTS,21,"INJURIES, POISONINGS AND TOXIC EFFECTS OF DRUGS",3,Major,Moderate,Medical,Medicaid,,,,,true,133345.42,41149.11
New York City,Kings,7002053,001304,NYU Langone Hospital-Brooklyn,50 to 69,112,M,White,Not Span/Hispanic,5,Emergency,Skilled Nursing Home,2019,INJ022,"POISONING BY DRUGS, INITIAL ENCOUNTER",MAM011,ELECTROENCEPHALOGRAM (EEG),812,POISONING OF MEDICINAL AGENTS,21,"INJURIES, POISONINGS AND TOXIC EFFECTS OF DRUGS",3,Major,Moderate,Medical,Medicare,Medicare,,,,true,83430.01,21340.65
New York City,Kings,7002053,001304,NYU Langone Hospital-Brooklyn,30 to 49,112,F,White,Not Span/Hispanic,1,Emergency,Home or Self Care,2019,INJ022,"POISONING BY DRUGS, INITIAL ENCOUNTER",GIS001,ESOPHAGOGASTRODUODENOSCOPY (EGD) WITH BIOPSY,812,POISONING OF MEDICINAL AGENTS,21,"INJURIES, POISONINGS AND TOXIC EFFECTS OF DRUGS",3,Major,Minor,Medical,Medicaid,,,,,true,44327.01,8938.97
New York City,Kings,7002053,001304,NYU Langone Hospital-Brooklyn,70 or Older,112,M,White,Not Span/Hispanic,4,Emergency,Psychiatric Hospital or Unit of Hosp,2019,MBD012,SUICIDAL IDEATION/ATTEMPT/INTENTIONAL SELF-HARM,,,812,POISONING OF MEDICINAL AGENTS,21,"INJURIES, POISONINGS AND TOXIC EFFECTS OF DRUGS",3,Major,Moderate,Medical,Medicare,Blue Cross/Blue Shield,,,,true,42247.75,15101
New York City,Kings,7002053,001304,NYU Langone Hospital-Brooklyn,50 to 69,112,M,White,Not Span/Hispanic,2,Emergency,Left Against Medical Advice,2019,INJ022,"POISONING BY DRUGS, INITIAL ENCOUNTER",,,812,POISONING OF MEDICINAL AGENTS,21,"INJURIES, POISONINGS AND TOXIC EFFECTS OF DRUGS",3,Major,Major,Medical,Medicaid,,,,,true,39938.27,9428.49
New York City,Kings,7002053,001304,NYU Langone Hospital-Brooklyn,50 to 69,112,F,Other Race,Spanish/Hispanic,5,Emergency,Home or Self Care,2019,INJ022,"POISONING BY DRUGS, INITIAL ENCOUNTER",MAM011,ELECTROENCEPHALOGRAM (EEG),812,POISONING OF MEDICINAL AGENTS,21,"INJURIES, POISONINGS AND TOXIC EFFECTS OF DRUGS",4,Extreme,Extreme,Medical,Medicare,Medicaid,,,,true,140872.57,32158.26
New York City,Kings,7002053,001304,NYU Langone Hospital-Brooklyn,30 to 49,112,F,Black/African American,Not Span/Hispanic,3,Emergency,Home or Self Care,2019,INJ022,"POISONING BY DRUGS, INITIAL ENCOUNTER",,,812,POISONING OF MEDICINAL AGENTS,21,"INJURIES, POISONINGS AND TOXIC EFFECTS OF DRUGS",3,Major,Moderate,Medical,Medicaid,,,,,true,41323.5,11711.41
New York City,Kings,7002053,001304,NYU Langone Hospital-Brooklyn,70 or Older,112,M,White,Not Span/Hispanic,6,Emergency,Expired,2019,INJ022,"POISONING BY DRUGS, INITIAL ENCOUNTER",ADM002,TRANSFUSION OF PLASMA,812,POISONING OF MEDICINAL AGENTS,21,"INJURIES, POISONINGS AND TOXIC EFFECTS OF DRUGS",4,Extreme,Extreme,Medical,Medicare,,,,,true,71412.59,23901.05
New York City,Kings,7002053,001304,NYU Langone Hospital-Brooklyn,18 to 29,112,M,White,Spanish/Hispanic,1,Emergency,Home or Self Care,2019,MBD012,SUICIDAL IDEATION/ATTEMPT/INTENTIONAL SELF-HARM,,,812,POISONING OF MEDICINAL AGENTS,21,"INJURIES, POISONINGS AND TOXIC EFFECTS OF DRUGS",1,Minor,Minor,Medical,Medicaid,,,,,true,17920.18,4867.94
New York City,Kings,7002053,001304,NYU Langone Hospital-Brooklyn,30 to 49,112,F,Other Race,Spanish/Hispanic,1,Emergency,Home or Self Care,2019,MBD012,SUICIDAL IDEATION/ATTEMPT/INTENTIONAL SELF-HARM,ADM021,"ADMINISTRATION OF THERAPEUTIC SUBSTANCES, NEC",812,POISONING OF MEDICINAL AGENTS,21,"INJURIES, POISONINGS AND TOXIC EFFECTS OF DRUGS",3,Major,Moderate,Medical,Medicaid,,,,,true,25392.84,5698.08
New York City,Kings,7002053,001304,NYU Langone Hospital-Brooklyn,70 or Older,112,M,Other Race,Not Span/Hispanic,1,Emergency,Home or Self Care,2019,INJ022,"POISONING BY DRUGS, INITIAL ENCOUNTER",,,812,POISONING OF MEDICINAL AGENTS,21,"INJURIES, POISONINGS AND TOXIC EFFECTS OF DRUGS",3,Major,Major,Medical,Medicare,,,,,true,14429.95,4343.27
New York City,Kings,7002053,001304,NYU Langone Hospital-Brooklyn,18 to 29,112,M,Other Race,Spanish/Hispanic,2,Emergency,Home or Self Care,2019,INJ022,"POISONING BY DRUGS, INITIAL ENCOUNTER",,,812,POISONING OF MEDICINAL AGENTS,21,"INJURIES, POISONINGS AND TOXIC EFFECTS OF DRUGS",4,Extreme,Major,Medical,Medicaid,,,,,true,23423.4,7795.14
New York City,Kings,7002053,001304,NYU Langone Hospital-Brooklyn,50 to 69,112,M,Other Race,Spanish/Hispanic,4,Emergency,Psychiatric Hospital or Unit of Hosp,2019,MBD012,SUICIDAL IDEATION/ATTEMPT/INTENTIONAL SELF-HARM,ADM021,"ADMINISTRATION OF THERAPEUTIC SUBSTANCES, NEC",812,POISONING OF MEDICINAL AGENTS,21,"INJURIES, POISONINGS AND TOXIC EFFECTS OF DRUGS",4,Extreme,Extreme,Medical,Medicaid,,,,,true,95949.26,34709.21
New York City,Kings,7002053,001304,NYU Langone Hospital-Brooklyn,50 to 69,112,F,White,Spanish/Hispanic,5,Emergency,Home or Self Care,2019,INJ022,"POISONING BY DRUGS, INITIAL ENCOUNTER",,,812,POISONING OF MEDICINAL AGENTS,21,"INJURIES, POISONINGS AND TOXIC EFFECTS OF DRUGS",2,Moderate,Moderate,Medical,Medicaid,,,,,true,52529.84,17660.79
New York City,Kings,7002053,001304,NYU Langone Hospital-Brooklyn,18 to 29,112,F,Black/African American,Not Span/Hispanic,1,Emergency,Psychiatric Hospital or Unit of Hosp,2019,MBD012,SUICIDAL IDEATION/ATTEMPT/INTENTIONAL SELF-HARM,,,812,POISONING OF MEDICINAL AGENTS,21,"INJURIES, POISONINGS AND TOXIC EFFECTS OF DRUGS",2,Moderate,Minor,Medical,Private Health Insurance,,,,,true,30030.45,9762.52
New York City,Kings,7002053,001304,NYU Langone Hospital-Brooklyn,18 to 29,117,F,White,Not Span/Hispanic,1,Emergency,Left Against Medical Advice,2019,INJ022,"POISONING BY DRUGS, INITIAL ENCOUNTER",,,812,POISONING OF MEDICINAL AGENTS,21,"INJURIES, POISONINGS AND TOXIC EFFECTS OF DRUGS",1,Minor,Minor,Medical,Medicaid,,,,,true,11606.33,4048.93
New York City,Kings,7002053,001304,NYU Langone Hospital-Brooklyn,50 to 69,112,M,White,Not Span/Hispanic,1,Emergency,Home or Self Care,2019,MBD012,SUICIDAL IDEATION/ATTEMPT/INTENTIONAL SELF-HARM,,,812,POISONING OF MEDICINAL AGENTS,21,"INJURIES, POISONINGS AND TOXIC EFFECTS OF DRUGS",2,Moderate,Minor,Medical,Self-Pay,,,,,true,24618.41,5899.24
New York City,Kings,7002053,001304,NYU Langone Hospital-Brooklyn,30 to 49,114,M,White,Not Span/Hispanic,1,Emergency,Home or Self Care,2019,INJ022,"POISONING BY DRUGS, INITIAL ENCOUNTER",,,812,POISONING OF MEDICINAL AGENTS,21,"INJURIES, POISONINGS AND TOXIC EFFECTS OF DRUGS",3,Major,Major,Medical,Medicaid,,,,,true,37924.02,8109.84
New York City,Kings,7002053,001304,NYU Langone Hospital-Brooklyn,18 to 29,112,M,White,Not Span/Hispanic,1,Emergency,Home or Self Care,2019,INJ022,"POISONING BY DRUGS, INITIAL ENCOUNTER",IMG008,ULTRASONOGRAPHY,812,POISONING OF MEDICINAL AGENTS,21,"INJURIES, POISONINGS AND TOXIC EFFECTS OF DRUGS",4,Extreme,Extreme,Medical,Private Health Insurance,,,,,true,25738.1,6027.7
New York City,Kings,7002053,001304,NYU Langone Hospital-Brooklyn,30 to 49,112,M,White,Unknown,2,Emergency,Left Against Medical Advice,2019,INJ022,"POISONING BY DRUGS, INITIAL ENCOUNTER",ESA003,MECHANICAL VENTILATION,812,POISONING OF MEDICINAL AGENTS,21,"INJURIES, POISONINGS AND TOXIC EFFECTS OF DRUGS",4,Extreme,Major,Medical,Self-Pay,,,,,true,46045.58,12105.14
New York City,Kings,7002053,001304,NYU Langone Hospital-Brooklyn,18 to 29,112,M,Other Race,Not Span/Hispanic,1,Emergency,Home or Self Care,2019,MBD012,SUICIDAL IDEATION/ATTEMPT/INTENTIONAL SELF-HARM,ADM021,"ADMINISTRATION OF THERAPEUTIC SUBSTANCES, NEC",812,POISONING OF MEDICINAL AGENTS,21,"INJURIES, POISONINGS AND TOXIC EFFECTS OF DRUGS",2,Moderate,Minor,Medical,Private Health Insurance,,,,,true,22294.76,5214.41
New York City,Kings,7002053,001304,NYU Langone Hospital-Brooklyn,70 or Older,112,M,Other Race,Spanish/Hispanic,7,Emergency,Skilled Nursing Home,2019,INJ022,"POISONING BY DRUGS, INITIAL ENCOUNTER",RES007,AIRWAY INTUBATION,812,POISONING OF MEDICINAL AGENTS,21,"INJURIES, POISONINGS AND TOXIC EFFECTS OF DRUGS",4,Extreme,Extreme,Medical,Medicare,,,,,true,176186.99,40313.92
New York City,Kings,7002053,001304,NYU Langone Hospital-Brooklyn,50 to 69,112,F,White,Not Span/Hispanic,2,Emergency,Home or Self Care,2019,INJ022,"POISONING BY DRUGS, INITIAL ENCOUNTER",,,812,POISONING OF MEDICINAL AGENTS,21,"INJURIES, POISONINGS AND TOXIC EFFECTS OF DRUGS",3,Major,Major,Medical,Medicare,Medicaid,,,,true,40323.95,9835.51
New York City,Kings,7002053,001304,NYU Langone Hospital-Brooklyn,50 to 69,112,M,Black/African American,Not Span/Hispanic,35,Emergency,Home or Self Care,2019,INJ022,"POISONING BY DRUGS, INITIAL ENCOUNTER",RES005,CHEST TUBE PLACEMENT AND THERAPEUTIC THORACENTESIS,812,POISONING OF MEDICINAL AGENTS,21,"INJURIES, POISONINGS AND TOXIC EFFECTS OF DRUGS",4,Extreme,Extreme,Medical,Medicaid,,,,,true,385677.58,144286.34
New York City,Kings,7002053,001304,NYU Langone Hospital-Brooklyn,70 or Older,112,M,Other Race,Spanish/Hispanic,1,Emergency,Home or Self Care,2019,INJ022,"POISONING BY DRUGS, INITIAL ENCOUNTER",,,812,POISONING OF MEDICINAL AGENTS,21,"INJURIES, POISONINGS AND TOXIC EFFECTS OF DRUGS",3,Major,Major,Medical,Medicare,,,,,true,25711.42,9289.89
New York City,Kings,7002053,001304,NYU Langone Hospital-Brooklyn,50 to 69,112,M,Other Race,Unknown,7,Emergency,Home or Self Care,2019,INJ022,"POISONING BY DRUGS, INITIAL ENCOUNTER",RES007,AIRWAY INTUBATION,812,POISONING OF MEDICINAL AGENTS,21,"INJURIES, POISONINGS AND TOXIC EFFECTS OF DRUGS",4,Extreme,Extreme,Medical,Medicaid,,,,,true,137730.72,54234.41
New York City,Kings,7002053,001304,NYU Langone Hospital-Brooklyn,50 to 69,112,F,White,Spanish/Hispanic,6,Emergency,Home or Self Care,2019,INJ022,"POISONING BY DRUGS, INITIAL ENCOUNTER",ADM021,"ADMINISTRATION OF THERAPEUTIC SUBSTANCES, NEC",812,POISONING OF MEDICINAL AGENTS,21,"INJURIES, POISONINGS AND TOXIC EFFECTS OF DRUGS",4,Extreme,Extreme,Medical,Medicaid,,,,,true,97087.62,23914.77
New York City,Kings,7002053,001304,NYU Langone Hospital-Brooklyn,30 to 49,112,M,Other Race,Spanish/Hispanic,2,Emergency,Home or Self Care,2019,INJ022,"POISONING BY DRUGS, INITIAL ENCOUNTER",ADM021,"ADMINISTRATION OF THERAPEUTIC SUBSTANCES, NEC",812,POISONING OF MEDICINAL AGENTS,21,"INJURIES, POISONINGS AND TOXIC EFFECTS OF DRUGS",4,Extreme,Major,Medical,Medicaid,,,,,true,68176.95,20011.79
New York City,Kings,7002053,001304,NYU Langone Hospital-Brooklyn,70 or Older,112,F,White,Not Span/Hispanic,1,Emergency,Home w/ Home Health Services,2019,INJ022,"POISONING BY DRUGS, INITIAL ENCOUNTER",,,812,POISONING OF MEDICINAL AGENTS,21,"INJURIES, POISONINGS AND TOXIC EFFECTS OF DRUGS",3,Major,Major,Medical,Medicare,Medicaid,,,,true,22074.97,5518.07
New York City,Kings,7002053,001304,NYU Langone Hospital-Brooklyn,50 to 69,103,F,White,Not Span/Hispanic,3,Emergency,Home w/ Home Health Services,2019,INJ022,"POISONING BY DRUGS, INITIAL ENCOUNTER",MAM011,ELECTROENCEPHALOGRAM (EEG),812,POISONING OF MEDICINAL AGENTS,21,"INJURIES, POISONINGS AND TOXIC EFFECTS OF DRUGS",3,Major,Major,Medical,Medicare,Blue Cross/Blue Shield,,,,true,94309.24,18722.3
New York City,Kings,7002053,001304,NYU Langone Hospital-Brooklyn,50 to 69,112,F,White,Spanish/Hispanic,3,Emergency,Home or Self Care,2019,INJ022,"POISONING BY DRUGS, INITIAL ENCOUNTER",,,812,POISONING OF MEDICINAL AGENTS,21,"INJURIES, POISONINGS AND TOXIC EFFECTS OF DRUGS",2,Moderate,Moderate,Medical,Medicaid,,,,,true,60170.14,11850.6
New York City,Kings,7002053,001304,NYU Langone Hospital-Brooklyn,30 to 49,112,F,Other Race,Spanish/Hispanic,6,Emergency,Home w/ Home Health Services,2019,INJ022,"POISONING BY DRUGS, INITIAL ENCOUNTER",,,812,POISONING OF MEDICINAL AGENTS,21,"INJURIES, POISONINGS AND TOXIC EFFECTS OF DRUGS",3,Major,Major,Medical,Medicaid,,,,,true,95363.73,30117.93
New York City,Kings,7002053,001304,NYU Langone Hospital-Brooklyn,18 to 29,112,M,White,Not Span/Hispanic,2,Emergency,Home or Self Care,2019,INJ022,"POISONING BY DRUGS, INITIAL ENCOUNTER",ADM021,"ADMINISTRATION OF THERAPEUTIC SUBSTANCES, NEC",812,POISONING OF MEDICINAL AGENTS,21,"INJURIES, POISONINGS AND TOXIC EFFECTS OF DRUGS",3,Major,Major,Medical,Medicaid,,,,,true,38653.54,15912.51
New York City,Kings,7002053,001304,NYU Langone Hospital-Brooklyn,30 to 49,112,M,White,Not Span/Hispanic,22,Emergency,Home or Self Care,2019,INJ022,"POISONING BY DRUGS, INITIAL ENCOUNTER",,,812,POISONING OF MEDICINAL AGENTS,21,"INJURIES, POISONINGS AND TOXIC EFFECTS OF DRUGS",3,Major,Major,Medical,Medicaid,,,,,true,207886.3,75167.28
New York City,Kings,7002053,001304,NYU Langone Hospital-Brooklyn,18 to 29,112,M,White,Not Span/Hispanic,1,Emergency,Home or Self Care,2019,MBD012,SUICIDAL IDEATION/ATTEMPT/INTENTIONAL SELF-HARM,,,812,POISONING OF MEDICINAL AGENTS,21,"INJURIES, POISONINGS AND TOXIC EFFECTS OF DRUGS",2,Moderate,Minor,Medical,Medicaid,,,,,true,19160.61,5077.44