Hospital Service Area,Hospital County,Operating Certificate Number,Permanent Facility Id,Facility Name,Age Group,Zip Code - 3 digits,Gender,Race,Ethnicity,Length of Stay,Type of Admission,Patient Disposition,Discharge Year,CCS Diagnosis Code,CCS Diagnosis Description,CCS Procedure Code,CCS Procedure Description,APR DRG Code,APR DRG Description,APR MDC Code,APR MDC Description,APR Severity of Illness Code,APR Severity of Illness Description,APR Risk of Mortality,APR Medical Surgical Description,Payment Typology 1,Payment Typology 2,Payment Typology 3,Birth Weight,Abortion Edit Indicator,Emergency Department Indicator,Total Charges,Total Costs
New York City,Bronx,7000006,001169,Montefiore Medical Center - Henry & Lucy Moses Div,70 or Older,104,M,Other Race,Spanish/Hispanic,2,Emergency,Home or Self Care,2020,INJ022,"POISONING BY DRUGS, INITIAL ENCOUNTER",,,812,POISONING OF MEDICINAL AGENTS,21,"INJURIES, POISONINGS AND TOXIC EFFECTS OF DRUGS",2,Moderate,Moderate,Medical,Medicare,Medicaid,,,,Y,27548.96,4684.96
New York City,Bronx,7000006,001169,Montefiore Medical Center - Henry & Lucy Moses Div,70 or Older,107,F,Black/African American,Not Span/Hispanic,2,Emergency,Home w/ Home Health Services,2020,INJ022,"POISONING BY DRUGS, INITIAL ENCOUNTER",,,812,POISONING OF MEDICINAL AGENTS,21,"INJURIES, POISONINGS AND TOXIC EFFECTS OF DRUGS",3,Major,Major,Medical,Medicare,,,,,N,50724.19,7340.16
New York City,Bronx,7000006,001169,Montefiore Medical Center - Henry & Lucy Moses Div,0 to 17,104,F,Other Race,Spanish/Hispanic,1,Emergency,Home or Self Care,2020,INJ022,"POISONING BY DRUGS, INITIAL ENCOUNTER",ADM017,ADMINISTRATION OF NUTRITIONAL AND ELECTROLYTIC SUBSTANCES,812,POISONING OF MEDICINAL AGENTS,21,"INJURIES, POISONINGS AND TOXIC EFFECTS OF DRUGS",1,Minor,Minor,Medical,Medicaid,,,,,N,10932.93,2932.97
New York City,Bronx,7000006,001169,Montefiore Medical Center - Henry & Lucy Moses Div,18 to 29,104,F,Black/African American,Not Span/Hispanic,4,Emergency,Home or Self Care,2020,INJ022,"POISONING BY DRUGS, INITIAL ENCOUNTER",,,812,POISONING OF MEDICINAL AGENTS,21,"INJURIES, POISONINGS AND TOXIC EFFECTS OF DRUGS",2,Moderate,Moderate,Medical,Blue Cross/Blue Shield,,,,,Y,50974.26,12598.4
New York City,Bronx,7000006,001169,Montefiore Medical Center - Henry & Lucy Moses Div,70 or Older,104,M,White,Not Span/Hispanic,20,Emergency,Expired,2020,INJ022,"POISONING BY DRUGS, INITIAL ENCOUNTER",IMG008,ULTRASONOGRAPHY,812,POISONING OF MEDICINAL AGENTS,21,"INJURIES, POISONINGS AND TOXIC EFFECTS OF DRUGS",3,Major,Major,Medical,Blue Cross/Blue Shield,Medicare,,,,Y,291867.8,59749.82
New York City,Bronx,7000006,001168,Montefiore Medical Center-Wakefield Hospital,18 to 29,104,M,Black/African American,Not Span/Hispanic,1,Emergency,Home or Self Care,2020,INJ022,"POISONING BY DRUGS, INITIAL ENCOUNTER",IMG006,COMPUTERIZED TOMOGRAPHY (CT) WITH CONTRAST,812,POISONING OF MEDICINAL AGENTS,21,"INJURIES, POISONINGS AND TOXIC EFFECTS OF DRUGS",2,Moderate,Moderate,Medical,Private Health Insurance,,,,,Y,22978.89,3025.89
New York City,Bronx,7000006,001168,Montefiore Medical Center-Wakefield Hospital,70 or Older,104,F,Other Race,Not Span/Hispanic,3,Emergency,Skilled Nursing Home,2020,INJ022,"POISONING BY DRUGS, INITIAL ENCOUNTER",,,812,POISONING OF MEDICINAL AGENTS,21,"INJURIES, POISONINGS AND TOXIC EFFECTS OF DRUGS",2,Moderate,Minor,Medical,Medicare,Medicaid,,,,Y,45476.68,6523.28
New York City,Bronx,7000006,003058,Montefiore Med Center - Jack D Weiler Hosp of A Einstein College Div,70 or Older,104,M,White,Not Span/Hispanic,3,Emergency,Home w/ Home Health Services,2020,INJ022,"POISONING BY DRUGS, INITIAL ENCOUNTER",IMG008,ULTRASONOGRAPHY,812,POISONING OF MEDICINAL AGENTS,21,"INJURIES, POISONINGS AND TOXIC EFFECTS OF DRUGS",2,Moderate,Moderate,Medical,Medicare,,,,,Y,75927.73,11547.72
New York City,Bronx,7000006,001169,Montefiore Medical Center - Henry & Lucy Moses Div,70 or Older,104,M,Other Race,Spanish/Hispanic,10,Emergency,Skilled Nursing Home,2020,INJ022,"POISONING BY DRUGS, INITIAL ENCOUNTER",OTR004,ISOLATION PROCEDURES,812,POISONING OF MEDICINAL AGENTS,21,"INJURIES, POISONINGS AND TOXIC EFFECTS OF DRUGS",2,Moderate,Major,Medical,Medicare,Medicaid,,,,Y,117555.7,21144.5
New York City,Bronx,7000006,001169,Montefiore Medical Center - Henry & Lucy Moses Div,50 to 69,104,M,Other Race,Spanish/Hispanic,2,Emergency,Home or Self Care,2020,INJ022,"POISONING BY DRUGS, INITIAL ENCOUNTER",,,812,POISONING OF MEDICINAL AGENTS,21,"INJURIES, POISONINGS AND TOXIC EFFECTS OF DRUGS",3,Major,Moderate,Medical,Medicare,Private Health Insurance,,,,Y,34172.1,5224.35
New York City,Bronx,7000006,001169,Montefiore Medical Center - Henry & Lucy Moses Div,30 to 49,104,F,Other Race,Spanish/Hispanic,3,Emergency,Left Against Medical Advice,2020,INJ022,"POISONING BY DRUGS, INITIAL ENCOUNTER",,,812,POISONING OF MEDICINAL AGENTS,21,"INJURIES, POISONINGS AND TOXIC EFFECTS OF DRUGS",2,Moderate,Moderate,Medical,Private Health Insurance,,,,,Y,41707.75,7057.52
New York City,Bronx,7000006,003058,Montefiore Med Center - Jack D Weiler Hosp of A Einstein College Div,50 to 69,104,M,White,Not Span/Hispanic,2,Emergency,Skilled Nursing Home,2020,INJ022,"POISONING BY DRUGS, INITIAL ENCOUNTER",ADM017,ADMINISTRATION OF NUTRITIONAL AND ELECTROLYTIC SUBSTANCES,812,POISONING OF MEDICINAL AGENTS,21,"INJURIES, POISONINGS AND TOXIC EFFECTS OF DRUGS",3,Major,Major,Medical,Medicaid,,,,,Y,28854.9,3707.57
New York City,Bronx,7000006,001169,Montefiore Medical Center - Henry & Lucy Moses Div,30 to 49,104,F,Black/African American,Not Span/Hispanic,2,Emergency,Home or Self Care,2020,INJ022,"POISONING BY DRUGS, INITIAL ENCOUNTER",,,812,POISONING OF MEDICINAL AGENTS,21,"INJURIES, POISONINGS AND TOXIC EFFECTS OF DRUGS",2,Moderate,Minor,Medical,Private Health Insurance,,,,,Y,40896.57,6188.53
New York City,Bronx,7000006,003058,Montefiore Med Center - Jack D Weiler Hosp of A Einstein College Div,70 or Older,104,F,Black/African American,Not Span/Hispanic,10,Emergency,Medicaid Cert Nursing Facility,2020,INJ022,"POISONING BY DRUGS, INITIAL ENCOUNTER",ADM016,ADMINISTRATION OF ANTI-INFLAMMATORY AGENTS,812,POISONING OF MEDICINAL AGENTS,21,"INJURIES, POISONINGS AND TOXIC EFFECTS OF DRUGS",3,Major,Major,Medical,Medicare,,,,,Y,92403.27,15608.67
New York City,Bronx,7000006,001169,Montefiore Medical Center - Henry & Lucy Moses Div,0 to 17,104,M,Other Race,Unknown,1,Emergency,Home or Self Care,2020,INJ022,"POISONING BY DRUGS, INITIAL ENCOUNTER",ADM017,ADMINISTRATION OF NUTRITIONAL AND ELECTROLYTIC SUBSTANCES,812,POISONING OF MEDICINAL AGENTS,21,"INJURIES, POISONINGS AND TOXIC EFFECTS OF DRUGS",2,Moderate,Minor,Medical,Medicaid,,,,,N,10392.5,2916.76
New York City,Manhattan,7002032,001469,Mount Sinai Morningside,50 to 69,104,F,Other Race,Spanish/Hispanic,2,Emergency,Home or Self Care,2020,INJ022,"POISONING BY DRUGS, INITIAL ENCOUNTER",ADM001,TRANSFUSION OF BLOOD AND BLOOD PRODUCTS,812,POISONING OF MEDICINAL AGENTS,21,"INJURIES, POISONINGS AND TOXIC EFFECTS OF DRUGS",3,Major,Minor,Medical,Medicare,Medicare,Medicaid,,,Y,35617.8,8796.95
New York City,Kings,7002002,001324,Mount Sinai Brooklyn,70 or Older,116,F,White,Not Span/Hispanic,2,Emergency,Home or Self Care,2020,INJ037,"COMPLICATION OF OTHER SURGICAL OR MEDICAL CARE, INJURY, INITIAL ENCOUNTER",,,812,POISONING OF MEDICINAL AGENTS,21,"INJURIES, POISONINGS AND TOXIC EFFECTS OF DRUGS",2,Moderate,Minor,Medical,Medicare,Blue Cross/Blue Shield,Self-Pay,,,Y,42807.16,4022.9
New York City,Bronx,7000006,001169,Montefiore Medical Center - Henry & Lucy Moses Div,30 to 49,104,F,Black/African American,Not Span/Hispanic,1,Emergency,Home or Self Care,2020,INJ022,"POISONING BY DRUGS, INITIAL ENCOUNTER",,,812,POISONING OF MEDICINAL AGENTS,21,"INJURIES, POISONINGS AND TOXIC EFFECTS OF DRUGS",2,Moderate,Minor,Medical,Private Health Insurance,,,,,Y,28820.12,4054.03
New York City,Manhattan,7002032,001466,Mount Sinai West,50 to 69,100,M,Black/African American,Not Span/Hispanic,5,Emergency,Home or Self Care,2020,INJ022,"POISONING BY DRUGS, INITIAL ENCOUNTER",ADM017,ADMINISTRATION OF NUTRITIONAL AND ELECTROLYTIC SUBSTANCES,812,POISONING OF MEDICINAL AGENTS,21,"INJURIES, POISONINGS AND TOXIC EFFECTS OF DRUGS",2,Moderate,Major,Medical,Medicaid,Medicaid,Self-Pay,,,Y,61491.44,12812.09
New York City,Manhattan,7002032,001466,Mount Sinai West,30 to 49,100,M,Black/African American,Not Span/Hispanic,7,Emergency,Left Against Medical Advice,2020,INJ022,"POISONING BY DRUGS, INITIAL ENCOUNTER",IMG007,COMPUTERIZED TOMOGRAPHY (CT) WITHOUT CONTRAST,812,POISONING OF MEDICINAL AGENTS,21,"INJURIES, POISONINGS AND TOXIC EFFECTS OF DRUGS",3,Major,Moderate,Medical,Medicaid,Medicaid,Self-Pay,,,Y,78910.93,16725.16
New York City,Manhattan,7002002,001439,Mount Sinai Beth Israel,70 or Older,100,F,Other Race,Spanish/Hispanic,6,Emergency,Home w/ Home Health Services,2020,INJ022,"POISONING BY DRUGS, INITIAL ENCOUNTER",ESA004,NON-INVASIVE VENTILATION,812,POISONING OF MEDICINAL AGENTS,21,"INJURIES, POISONINGS AND TOXIC EFFECTS OF DRUGS",4,Extreme,Extreme,Medical,Medicare,Miscellaneous/Other,Medicaid,,,Y,105505.13,22387.62
New York City,Manhattan,7002002,001439,Mount Sinai Beth Israel,50 to 69,100,F,Other Race,Unknown,3,Emergency,Home or Self Care,2020,INJ022,"POISONING BY DRUGS, INITIAL ENCOUNTER",ADM021,"ADMINISTRATION OF THERAPEUTIC SUBSTANCES, NEC",812,POISONING OF MEDICINAL AGENTS,21,"INJURIES, POISONINGS AND TOXIC EFFECTS OF DRUGS",2,Moderate,Moderate,Medical,Medicaid,Medicaid,Self-Pay,,,Y,39770.19,8517.78
New York City,Manhattan,7002032,001466,Mount Sinai West,70 or Older,100,M,Other Race,Not Span/Hispanic,27,Emergency,Expired,2020,INJ022,"POISONING BY DRUGS, INITIAL ENCOUNTER",ESA001,HEMODIALYSIS,812,POISONING OF MEDICINAL AGENTS,21,"INJURIES, POISONINGS AND TOXIC EFFECTS OF DRUGS",4,Extreme,Extreme,Medical,Medicare,Private Health Insurance,Self-Pay,,,Y,556426.27,136531.53
Hudson Valley,Westchester,5901000,001039,NewYork-Presbyterian/Hudson Valley Hospital,70 or Older,105,F,White,Not Span/Hispanic,1,Emergency,Home or Self Care,2020,INJ022,"POISONING BY DRUGS, INITIAL ENCOUNTER",ADM021,"ADMINISTRATION OF THERAPEUTIC SUBSTANCES, NEC",812,POISONING OF MEDICINAL AGENTS,21,"INJURIES, POISONINGS AND TOXIC EFFECTS OF DRUGS",3,Major,Moderate,Medical,Medicare,,,,,Y,22002.11,6568.83
New York City,Bronx,7000006,001168,Montefiore Medical Center-Wakefield Hospital,18 to 29,100,F,Black/African American,Not Span/Hispanic,2,Emergency,Home or Self Care,2020,INJ022,"POISONING BY DRUGS, INITIAL ENCOUNTER",IMG008,ULTRASONOGRAPHY,812,POISONING OF MEDICINAL AGENTS,21,"INJURIES, POISONINGS AND TOXIC EFFECTS OF DRUGS",2,Moderate,Moderate,Medical,Medicaid,,,,,Y,44022.76,5527.38
New York City,Manhattan,7002024,001456,Mount Sinai Hospital,0 to 17,100,F,White,Not Span/Hispanic,1,Urgent,Home or Self Care,2020,INJ022,"POISONING BY DRUGS, INITIAL ENCOUNTER",,,812,POISONING OF MEDICINAL AGENTS,21,"INJURIES, POISONINGS AND TOXIC EFFECTS OF DRUGS",1,Minor,Minor,Medical,Blue Cross/Blue Shield,Self-Pay,,,,N,9400.25,6240.93
New York City,Manhattan,7002024,001456,Mount Sinai Hospital,50 to 69,104,M,Black/African American,Not Span/Hispanic,4,Emergency,Skilled Nursing Home,2020,INJ022,"POISONING BY DRUGS, INITIAL ENCOUNTER",IMG009,PLAIN RADIOGRAPHY,812,POISONING OF MEDICINAL AGENTS,21,"INJURIES, POISONINGS AND TOXIC EFFECTS OF DRUGS",3,Major,Major,Medical,Medicaid,Self-Pay,,,,Y,49006.44,12391.65
New York City,Bronx,7000006,001168,Montefiore Medical Center-Wakefield Hospital,30 to 49,104,M,Other Race,Spanish/Hispanic,1,Emergency,Home or Self Care,2020,INJ022,"POISONING BY DRUGS, INITIAL ENCOUNTER",ADM015,ADMINISTRATION OF ANTIBIOTICS,812,POISONING OF MEDICINAL AGENTS,21,"INJURIES, POISONINGS AND TOXIC EFFECTS OF DRUGS",3,Major,Major,Medical,Private Health Insurance,,,,,Y,29262.96,3708.7
New York City,Bronx,7000006,001169,Montefiore Medical Center - Henry & Lucy Moses Div,18 to 29,104,M,Black/African American,Unknown,3,Emergency,Home or Self Care,2020,INJ022,"POISONING BY DRUGS, INITIAL ENCOUNTER",ADM007,INTRAVENOUS INDUCTION OF LABOR,812,POISONING OF MEDICINAL AGENTS,21,"INJURIES, POISONINGS AND TOXIC EFFECTS OF DRUGS",2,Moderate,Moderate,Medical,Medicaid,,,,,Y,52836.71,7744.97
New York City,Bronx,7000006,001169,Montefiore Medical Center - Henry & Lucy Moses Div,50 to 69,104,F,Other Race,Unknown,2,Emergency,Home w/ Home Health Services,2020,INJ022,"POISONING BY DRUGS, INITIAL ENCOUNTER",,,812,POISONING OF MEDICINAL AGENTS,21,"INJURIES, POISONINGS AND TOXIC EFFECTS OF DRUGS",2,Moderate,Minor,Medical,Medicare,Medicaid,,,,Y,39312.55,5553.39
Long Island,Nassau,2908000,000511,NYU Langone Hospital-Long Island,50 to 69,115,M,White,Not Span/Hispanic,1,Emergency,Left Against Medical Advice,2020,INJ022,"POISONING BY DRUGS, INITIAL ENCOUNTER",,,812,POISONING OF MEDICINAL AGENTS,21,"INJURIES, POISONINGS AND TOXIC EFFECTS OF DRUGS",2,Moderate,Moderate,Medical,Medicare,Medicare,,,,Y,38131.4,7009.31
New York City,Manhattan,7002054,003975,New York Presbyterian Hospital - Allen Hospital,70 or Older,104,F,Other Race,Spanish/Hispanic,4,Emergency,Home w/ Home Health Services,2020,INJ022,"POISONING BY DRUGS, INITIAL ENCOUNTER",,,812,POISONING OF MEDICINAL AGENTS,21,"INJURIES, POISONINGS AND TOXIC EFFECTS OF DRUGS",2,Moderate,Major,Medical,Medicare,Medicare,Medicaid,,,Y,53564.14,11220.67
New York City,Manhattan,7002054,003975,New York Presbyterian Hospital - Allen Hospital,30 to 49,104,F,Other Race,Not Span/Hispanic,5,Emergency,Expired,2020,INJ022,"POISONING BY DRUGS, INITIAL ENCOUNTER",CAR024,VENOUS AND ARTERIAL CATHETER PLACEMENT,812,POISONING OF MEDICINAL AGENTS,21,"INJURIES, POISONINGS AND TOXIC EFFECTS OF DRUGS",4,Extreme,Extreme,Medical,Medicaid,Medicaid,Self-Pay,,,Y,206129.43,76413.75
New York City,Manhattan,7002054,001464,New York-Presbyterian Hospital - Columbia Presbyterian Center,50 to 69,100,M,Multi-racial,Not Span/Hispanic,1,Emergency,Home or Self Care,2020,INJ022,"POISONING BY DRUGS, INITIAL ENCOUNTER",,,812,POISONING OF MEDICINAL AGENTS,21,"INJURIES, POISONINGS AND TOXIC EFFECTS OF DRUGS",2,Moderate,Minor,Medical,Medicare,Medicare,Medicaid,,,Y,15475.23,3491.09
New York City,Manhattan,7002054,001464,New York-Presbyterian Hospital - Columbia Presbyterian Center,70 or Older,100,M,White,Spanish/Hispanic,2,Emergency,Home w/ Home Health Services,2020,INJ022,"POISONING BY DRUGS, INITIAL ENCOUNTER",,,812,POISONING OF MEDICINAL AGENTS,21,"INJURIES, POISONINGS AND TOXIC EFFECTS OF DRUGS",2,Moderate,Minor,Medical,Medicare,Medicare,Medicaid,,,Y,39155.11,8241.99
New York City,Manhattan,7002054,001464,New York-Presbyterian Hospital - Columbia Presbyterian Center,70 or Older,100,F,Other Race,Multi-ethnic,1,Emergency,Home w/ Home Health Services,2020,INJ022,"POISONING BY DRUGS, INITIAL ENCOUNTER",,,812,POISONING OF MEDICINAL AGENTS,21,"INJURIES, POISONINGS AND TOXIC EFFECTS OF DRUGS",2,Moderate,Moderate,Medical,Medicare,Medicare,Medicaid,,,Y,16633.89,3546.98
New York City,Manhattan,7002054,001464,New York-Presbyterian Hospital - Columbia Presbyterian Center,18 to 29,100,M,White,Spanish/Hispanic,4,Emergency,Home or Self Care,2020,INJ022,"POISONING BY DRUGS, INITIAL ENCOUNTER",,,812,POISONING OF MEDICINAL AGENTS,21,"INJURIES, POISONINGS AND TOXIC EFFECTS OF DRUGS",2,Moderate,Minor,Medical,Medicaid,Medicaid,Self-Pay,,,Y,61924.83,13536.76
New York City,Manhattan,7002024,001456,Mount Sinai Hospital,0 to 17,114,F,White,Spanish/Hispanic,1,Urgent,Home or Self Care,2020,INJ022,"POISONING BY DRUGS, INITIAL ENCOUNTER",,,812,POISONING OF MEDICINAL AGENTS,21,"INJURIES, POISONINGS AND TOXIC EFFECTS OF DRUGS",1,Minor,Minor,Medical,Private Health Insurance,Self-Pay,,,,N,20500,5077.48
New York City,Manhattan,7002024,001456,Mount Sinai Hospital,0 to 17,100,M,White,Not Span/Hispanic,1,Emergency,Home or Self Care,2020,INJ022,"POISONING BY DRUGS, INITIAL ENCOUNTER",,,812,POISONING OF MEDICINAL AGENTS,21,"INJURIES, POISONINGS AND TOXIC EFFECTS OF DRUGS",1,Minor,Minor,Medical,Private Health Insurance,Self-Pay,,,,Y,24804,5735.81
New York City,Manhattan,7002024,001456,Mount Sinai Hospital,70 or Older,112,M,Other Race,Unknown,7,Urgent,Home or Self Care,2020,INJ022,"POISONING BY DRUGS, INITIAL ENCOUNTER",,,812,POISONING OF MEDICINAL AGENTS,21,"INJURIES, POISONINGS AND TOXIC EFFECTS OF DRUGS",2,Moderate,Minor,Medical,Medicare,Medicaid,Self-Pay,,,N,70763.94,18790
New York City,Queens,7003010,001637,New York - Presbyterian/Queens,18 to 29,113,M,White,Spanish/Hispanic,3,Emergency,Home or Self Care,2020,INJ022,"POISONING BY DRUGS, INITIAL ENCOUNTER",ADM015,ADMINISTRATION OF ANTIBIOTICS,812,POISONING OF MEDICINAL AGENTS,21,"INJURIES, POISONINGS AND TOXIC EFFECTS OF DRUGS",2,Moderate,Moderate,Medical,"Managed Care, Unspecified",Medicaid,Self-Pay,,,Y,29998.26,6517.92
New York City,Manhattan,7002024,001456,Mount Sinai Hospital,30 to 49,104,M,Other Race,Not Span/Hispanic,6,Emergency,Skilled Nursing Home,2020,INJ022,"POISONING BY DRUGS, INITIAL ENCOUNTER",ESA001,HEMODIALYSIS,812,POISONING OF MEDICINAL AGENTS,21,"INJURIES, POISONINGS AND TOXIC EFFECTS OF DRUGS",3,Major,Major,Medical,Medicare,Private Health Insurance,Self-Pay,,,Y,80201.05,21264.19
New York City,Queens,7003010,001637,New York - Presbyterian/Queens,70 or Older,113,M,White,Not Span/Hispanic,3,Emergency,Home w/ Home Health Services,2020,INJ022,"POISONING BY DRUGS, INITIAL ENCOUNTER",ESA001,HEMODIALYSIS,812,POISONING OF MEDICINAL AGENTS,21,"INJURIES, POISONINGS AND TOXIC EFFECTS OF DRUGS",3,Major,Moderate,Medical,Medicare,Blue Cross/Blue Shield,Medicaid,,,Y,34339.48,8027.31
New York City,Manhattan,7002054,001437,New York-Presbyterian/Lower Manhattan Hospital,18 to 29,104,M,Black/African American,Not Span/Hispanic,2,Emergency,Home or Self Care,2020,INJ022,"POISONING BY DRUGS, INITIAL ENCOUNTER",ADM014,REGIONAL ANESTHESIA,812,POISONING OF MEDICINAL AGENTS,21,"INJURIES, POISONINGS AND TOXIC EFFECTS OF DRUGS",2,Moderate,Moderate,Medical,Medicaid,Self-Pay,,,,Y,47420.45,9506.54
New York City,Manhattan,7002054,001437,New York-Presbyterian/Lower Manhattan Hospital,50 to 69,100,M,Black/African American,Not Span/Hispanic,2,Emergency,Home or Self Care,2020,INJ022,"POISONING BY DRUGS, INITIAL ENCOUNTER",ADM021,"ADMINISTRATION OF THERAPEUTIC SUBSTANCES, NEC",812,POISONING OF MEDICINAL AGENTS,21,"INJURIES, POISONINGS AND TOXIC EFFECTS OF DRUGS",3,Major,Extreme,Medical,Private Health Insurance,Medicare,Self-Pay,,,Y,42676.24,9150.58
New York City,Manhattan,7002054,001458,New York-Presbyterian Hospital - New York Weill Cornell Center,18 to 29,113,M,Other Race,Not Span/Hispanic,5,Emergency,Psychiatric Hospital or Unit of Hosp,2020,INJ022,"POISONING BY DRUGS, INITIAL ENCOUNTER",URN006,BLADDER CATHETERIZATION AND DRAINAGE,812,POISONING OF MEDICINAL AGENTS,21,"INJURIES, POISONINGS AND TOXIC EFFECTS OF DRUGS",2,Moderate,Moderate,Medical,"Managed Care, Unspecified",Medicaid,Self-Pay,,,Y,75135.06,16404.25
New York City,Kings,7001021,001306,New York - Presbyterian Brooklyn Methodist Hospital,70 or Older,112,F,Black/African American,Not Span/Hispanic,2,Emergency,Home or Self Care,2020,INJ022,"POISONING BY DRUGS, INITIAL ENCOUNTER",ESA001,HEMODIALYSIS,812,POISONING OF MEDICINAL AGENTS,21,"INJURIES, POISONINGS AND TOXIC EFFECTS OF DRUGS",3,Major,Major,Medical,Medicare,Self-Pay,,,,Y,22990.1,6644.71
New York City,Kings,7001021,001306,New York - Presbyterian Brooklyn Methodist Hospital,70 or Older,112,F,White,Not Span/Hispanic,6,Emergency,Home w/ Home Health Services,2020,INJ022,"POISONING BY DRUGS, INITIAL ENCOUNTER",MST028,"SUBCUTANEOUS TISSUE AND FASCIA PROCEDURES, NEC",812,POISONING OF MEDICINAL AGENTS,21,"INJURIES, POISONINGS AND TOXIC EFFECTS OF DRUGS",2,Moderate,Moderate,Medical,Medicare,Medicaid,Self-Pay,,,Y,57214.08,16646.3
New York City,Kings,7001021,001306,New York - Presbyterian Brooklyn Methodist Hospital,50 to 69,112,M,Black/African American,Spanish/Hispanic,2,Emergency,Home or Self Care,2020,INJ022,"POISONING BY DRUGS, INITIAL ENCOUNTER",,,812,POISONING OF MEDICINAL AGENTS,21,"INJURIES, POISONINGS AND TOXIC EFFECTS OF DRUGS",3,Major,Major,Medical,Medicare,Medicare,Self-Pay,,,Y,16677.61,3756.95
New York City,Manhattan,7002054,001458,New York-Presbyterian Hospital - New York Weill Cornell Center,50 to 69,111,M,Other Race,Not Span/Hispanic,1,Emergency,Home or Self Care,2020,INJ022,"POISONING BY DRUGS, INITIAL ENCOUNTER",ADM017,ADMINISTRATION OF NUTRITIONAL AND ELECTROLYTIC SUBSTANCES,812,POISONING OF MEDICINAL AGENTS,21,"INJURIES, POISONINGS AND TOXIC EFFECTS OF DRUGS",2,Moderate,Minor,Medical,"Managed Care, Unspecified",Medicaid,Self-Pay,,,Y,22397.13,4593.01
New York City,Kings,7001021,001306,New York - Presbyterian Brooklyn Methodist Hospital,30 to 49,112,M,Black/African American,Not Span/Hispanic,3,Emergency,Left Against Medical Advice,2020,INJ022,"POISONING BY DRUGS, INITIAL ENCOUNTER",,,812,POISONING OF MEDICINAL AGENTS,21,"INJURIES, POISONINGS AND TOXIC EFFECTS OF DRUGS",2,Moderate,Major,Medical,"Managed Care, Unspecified",Medicaid,Self-Pay,,,Y,22197.66,5373.68
New York City,Manhattan,7002054,001458,New York-Presbyterian Hospital - New York Weill Cornell Center,70 or Older,100,F,White,Not Span/Hispanic,8,Emergency,Skilled Nursing Home,2020,INJ022,"POISONING BY DRUGS, INITIAL ENCOUNTER",ESA004,NON-INVASIVE VENTILATION,812,POISONING OF MEDICINAL AGENTS,21,"INJURIES, POISONINGS AND TOXIC EFFECTS OF DRUGS",3,Major,Major,Medical,Medicare,Private Health Insurance,Self-Pay,,,Y,174831.28,65840.72
New York City,Kings,7001021,001306,New York - Presbyterian Brooklyn Methodist Hospital,70 or Older,112,F,White,Not Span/Hispanic,9,Emergency,Home w/ Home Health Services,2020,INJ022,"POISONING BY DRUGS, INITIAL ENCOUNTER",MAM007,ELECTROCARDIOGRAM (ECG),812,POISONING OF MEDICINAL AGENTS,21,"INJURIES, POISONINGS AND TOXIC EFFECTS OF DRUGS",3,Major,Moderate,Medical,Medicare,Medicaid,Self-Pay,,,Y,64262.63,19057.23
New York City,Kings,7001021,001306,New York - Presbyterian Brooklyn Methodist Hospital,50 to 69,112,F,White,Spanish/Hispanic,3,Emergency,Home w/ Home Health Services,2020,INJ022,"POISONING BY DRUGS, INITIAL ENCOUNTER",,,812,POISONING OF MEDICINAL AGENTS,21,"INJURIES, POISONINGS AND TOXIC EFFECTS OF DRUGS",3,Major,Major,Medical,"Managed Care, Unspecified",Medicaid,Self-Pay,,,Y,22899.14,5585.13
New York City,Kings,7001021,001306,New York - Presbyterian Brooklyn Methodist Hospital,50 to 69,112,F,White,Spanish/Hispanic,6,Emergency,Psychiatric Hospital or Unit of Hosp,2020,INJ022,"POISONING BY DRUGS, INITIAL ENCOUNTER",CAR024,VENOUS AND ARTERIAL CATHETER PLACEMENT,812,POISONING OF MEDICINAL AGENTS,21,"INJURIES, POISONINGS AND TOXIC EFFECTS OF DRUGS",3,Major,Major,Medical,"Managed Care, Unspecified",Medicaid,Self-Pay,,,Y,44892.27,10678.52
New York City,Kings,7001021,001306,New York - Presbyterian Brooklyn Methodist Hospital,70 or Older,112,F,Black/African American,Not Span/Hispanic,1,Emergency,Home or Self Care,2020,INJ022,"POISONING BY DRUGS, INITIAL ENCOUNTER",,,812,POISONING OF MEDICINAL AGENTS,21,"INJURIES, POISONINGS AND TOXIC EFFECTS OF DRUGS",1,Minor,Minor,Medical,Medicare,Medicare,Self-Pay,,,Y,15668.94,3067.83
New York City,Kings,7001021,001306,New York - Presbyterian Brooklyn Methodist Hospital,70 or Older,112,M,White,Not Span/Hispanic,4,Emergency,Home or Self Care,2020,INJ022,"POISONING BY DRUGS, INITIAL ENCOUNTER",,,812,POISONING OF MEDICINAL AGENTS,21,"INJURIES, POISONINGS AND TOXIC EFFECTS OF DRUGS",1,Minor,Minor,Medical,Medicare,Medicaid,Self-Pay,,,Y,27303.75,6591.37
New York City,Manhattan,7002024,001456,Mount Sinai Hospital,70 or Older,100,F,Other Race,Not Span/Hispanic,5,Emergency,Home or Self Care,2020,INJ022,"POISONING BY DRUGS, INITIAL ENCOUNTER",IMG008,ULTRASONOGRAPHY,812,POISONING OF MEDICINAL AGENTS,21,"INJURIES, POISONINGS AND TOXIC EFFECTS OF DRUGS",3,Major,Major,Medical,Medicare,Medicare,Medicaid,,,Y,93223.91,21372.05