Hospital Service Area,Hospital County,Operating Certificate Number,Permanent Facility Id,Facility Name,Age Group,Zip Code - 3 digits,Gender,Race,Ethnicity,Length of Stay,Type of Admission,Patient Disposition,Discharge Year,CCS Diagnosis Code,CCS Diagnosis Description,CCS Procedure Code,CCS Procedure Description,APR DRG Code,APR DRG Description,APR MDC Code,APR MDC Description,APR Severity of Illness Code,APR Severity of Illness Description,APR Risk of Mortality,APR Medical Surgical Description,Payment Typology 1,Payment Typology 2,Payment Typology 3,Birth Weight,Abortion Edit Indicator,Emergency Department Indicator,Total Charges,Total Costs
Long Island,Suffolk,5123000,000885,Long Island Community Hospital,18 to 29,,M,White,Not Span/Hispanic,10,Emergency,Home or Self Care,2020,INJ022,"POISONING BY DRUGS, INITIAL ENCOUNTER",RES007,AIRWAY INTUBATION,812,POISONING OF MEDICINAL AGENTS,21,"INJURIES, POISONINGS AND TOXIC EFFECTS OF DRUGS",4,Extreme,Extreme,Medical,Private Health Insurance,,,,,Y,111944.5,32297.31
Long Island,Suffolk,5123000,000885,Long Island Community Hospital,30 to 49,117,M,Black/African American,Not Span/Hispanic,1,Emergency,Home or Self Care,2020,INJ022,"POISONING BY DRUGS, INITIAL ENCOUNTER",SUD002,PHARMACOTHERAPY FOR SUBSTANCE USE,812,POISONING OF MEDICINAL AGENTS,21,"INJURIES, POISONINGS AND TOXIC EFFECTS OF DRUGS",3,Major,Major,Medical,Blue Cross/Blue Shield,,,,,Y,9973.73,1849.07
Long Island,Suffolk,5123000,000885,Long Island Community Hospital,30 to 49,119,M,White,Not Span/Hispanic,14,Emergency,Home or Self Care,2020,INJ022,"POISONING BY DRUGS, INITIAL ENCOUNTER",RES007,AIRWAY INTUBATION,812,POISONING OF MEDICINAL AGENTS,21,"INJURIES, POISONINGS AND TOXIC EFFECTS OF DRUGS",4,Extreme,Extreme,Medical,Blue Cross/Blue Shield,Medicare,,,,Y,270901.14,58450.46
Long Island,Suffolk,5123000,000885,Long Island Community Hospital,50 to 69,117,M,White,Not Span/Hispanic,3,Emergency,Psychiatric Hospital or Unit of Hosp,2020,INJ022,"POISONING BY DRUGS, INITIAL ENCOUNTER",SUD001,SUBSTANCE USE DETOXIFICATION,812,POISONING OF MEDICINAL AGENTS,21,"INJURIES, POISONINGS AND TOXIC EFFECTS OF DRUGS",3,Major,Moderate,Medical,Private Health Insurance,Medicaid,,,,Y,56986.82,8878.18
Long Island,Suffolk,5123000,000885,Long Island Community Hospital,50 to 69,119,M,Other Race,Not Span/Hispanic,1,Emergency,Home or Self Care,2020,INJ022,"POISONING BY DRUGS, INITIAL ENCOUNTER",,,812,POISONING OF MEDICINAL AGENTS,21,"INJURIES, POISONINGS AND TOXIC EFFECTS OF DRUGS",2,Moderate,Minor,Medical,Medicare,Medicaid,,,,Y,11084.33,1910.55
Long Island,Suffolk,5123000,000885,Long Island Community Hospital,50 to 69,117,M,White,Not Span/Hispanic,5,Emergency,Home or Self Care,2020,INJ022,"POISONING BY DRUGS, INITIAL ENCOUNTER",SUD002,PHARMACOTHERAPY FOR SUBSTANCE USE,812,POISONING OF MEDICINAL AGENTS,21,"INJURIES, POISONINGS AND TOXIC EFFECTS OF DRUGS",3,Major,Major,Medical,Medicaid,,,,,Y,45746.23,10972.12
Long Island,Suffolk,5123000,000885,Long Island Community Hospital,30 to 49,117,F,White,Not Span/Hispanic,4,Emergency,Home or Self Care,2020,INJ022,"POISONING BY DRUGS, INITIAL ENCOUNTER",SUD002,PHARMACOTHERAPY FOR SUBSTANCE USE,812,POISONING OF MEDICINAL AGENTS,21,"INJURIES, POISONINGS AND TOXIC EFFECTS OF DRUGS",3,Major,Major,Medical,Private Health Insurance,,,,,Y,48771.8,8618.42
Long Island,Suffolk,5123000,000885,Long Island Community Hospital,30 to 49,117,M,Other Race,Not Span/Hispanic,2,Emergency,Home or Self Care,2020,INJ022,"POISONING BY DRUGS, INITIAL ENCOUNTER",SUD001,SUBSTANCE USE DETOXIFICATION,812,POISONING OF MEDICINAL AGENTS,21,"INJURIES, POISONINGS AND TOXIC EFFECTS OF DRUGS",3,Major,Moderate,Medical,Self-Pay,,,,,Y,20106.21,3301.23
Long Island,Suffolk,5123000,000885,Long Island Community Hospital,50 to 69,117,F,White,Not Span/Hispanic,1,Emergency,Home or Self Care,2020,INJ022,"POISONING BY DRUGS, INITIAL ENCOUNTER",,,812,POISONING OF MEDICINAL AGENTS,21,"INJURIES, POISONINGS AND TOXIC EFFECTS OF DRUGS",3,Major,Moderate,Medical,Medicare,Medicare,Private Health Insurance,,,Y,36363.13,4230.06
Long Island,Suffolk,5123000,000885,Long Island Community Hospital,30 to 49,119,F,Other Race,Not Span/Hispanic,2,Emergency,Left Against Medical Advice,2020,INJ022,"POISONING BY DRUGS, INITIAL ENCOUNTER",ESA003,MECHANICAL VENTILATION,812,POISONING OF MEDICINAL AGENTS,21,"INJURIES, POISONINGS AND TOXIC EFFECTS OF DRUGS",4,Extreme,Extreme,Medical,Private Health Insurance,Medicaid,,,,Y,30774.05,6415.94
Long Island,Suffolk,5123000,000885,Long Island Community Hospital,30 to 49,117,M,White,Not Span/Hispanic,4,Emergency,Home or Self Care,2020,INJ022,"POISONING BY DRUGS, INITIAL ENCOUNTER",,,812,POISONING OF MEDICINAL AGENTS,21,"INJURIES, POISONINGS AND TOXIC EFFECTS OF DRUGS",2,Moderate,Moderate,Medical,Private Health Insurance,Medicaid,,,,Y,40983.57,7537.71
Long Island,Suffolk,5123000,000885,Long Island Community Hospital,50 to 69,119,F,White,Not Span/Hispanic,4,Emergency,Home or Self Care,2020,INJ022,"POISONING BY DRUGS, INITIAL ENCOUNTER",GIS001,ESOPHAGOGASTRODUODENOSCOPY (EGD) WITH BIOPSY,812,POISONING OF MEDICINAL AGENTS,21,"INJURIES, POISONINGS AND TOXIC EFFECTS OF DRUGS",2,Moderate,Minor,Medical,Medicare,Blue Cross/Blue Shield,,,,Y,40197.29,8163.28
Long Island,Suffolk,5123000,000885,Long Island Community Hospital,18 to 29,117,M,White,Not Span/Hispanic,1,Emergency,Left Against Medical Advice,2020,INJ022,"POISONING BY DRUGS, INITIAL ENCOUNTER",GIS007,GI SYSTEM DRAINAGE (EXCLUDING PARACENTESIS),812,POISONING OF MEDICINAL AGENTS,21,"INJURIES, POISONINGS AND TOXIC EFFECTS OF DRUGS",3,Major,Major,Medical,Private Health Insurance,Medicaid,,,,Y,27940.07,4824.79
Long Island,Suffolk,5123000,000885,Long Island Community Hospital,50 to 69,OOS,F,White,Not Span/Hispanic,6,Emergency,Short-term Hospital,2020,INJ022,"POISONING BY DRUGS, INITIAL ENCOUNTER",,,812,POISONING OF MEDICINAL AGENTS,21,"INJURIES, POISONINGS AND TOXIC EFFECTS OF DRUGS",3,Major,Major,Medical,Medicare,,,,,Y,46761.47,8497.94
Long Island,Suffolk,5123000,000885,Long Island Community Hospital,30 to 49,117,M,White,Not Span/Hispanic,1,Emergency,Left Against Medical Advice,2020,INJ022,"POISONING BY DRUGS, INITIAL ENCOUNTER",,,812,POISONING OF MEDICINAL AGENTS,21,"INJURIES, POISONINGS AND TOXIC EFFECTS OF DRUGS",3,Major,Major,Medical,Private Health Insurance,Medicaid,,,,Y,12327.29,2069.35
Long Island,Suffolk,5123000,000885,Long Island Community Hospital,50 to 69,117,F,Other Race,Not Span/Hispanic,14,Emergency,Skilled Nursing Home,2020,INJ022,"POISONING BY DRUGS, INITIAL ENCOUNTER",ESA004,NON-INVASIVE VENTILATION,812,POISONING OF MEDICINAL AGENTS,21,"INJURIES, POISONINGS AND TOXIC EFFECTS OF DRUGS",4,Extreme,Extreme,Medical,Medicare,Medicaid,,,,Y,114196.85,23664.4
Long Island,Suffolk,5123000,000885,Long Island Community Hospital,50 to 69,119,F,White,Not Span/Hispanic,4,Emergency,Left Against Medical Advice,2020,INJ022,"POISONING BY DRUGS, INITIAL ENCOUNTER",,,812,POISONING OF MEDICINAL AGENTS,21,"INJURIES, POISONINGS AND TOXIC EFFECTS OF DRUGS",2,Moderate,Moderate,Medical,Private Health Insurance,,,,,Y,26374.75,5843.01
Long Island,Suffolk,5123000,000885,Long Island Community Hospital,30 to 49,117,F,White,Not Span/Hispanic,3,Emergency,Home or Self Care,2020,INJ022,"POISONING BY DRUGS, INITIAL ENCOUNTER",,,812,POISONING OF MEDICINAL AGENTS,21,"INJURIES, POISONINGS AND TOXIC EFFECTS OF DRUGS",3,Major,Major,Medical,Medicare,Medicare,Medicaid,,,Y,36995.08,4684.15
Long Island,Suffolk,5123000,000885,Long Island Community Hospital,30 to 49,119,F,White,Not Span/Hispanic,3,Emergency,Home or Self Care,2020,INJ022,"POISONING BY DRUGS, INITIAL ENCOUNTER",RES007,AIRWAY INTUBATION,812,POISONING OF MEDICINAL AGENTS,21,"INJURIES, POISONINGS AND TOXIC EFFECTS OF DRUGS",4,Extreme,Extreme,Medical,Private Health Insurance,Medicaid,,,,Y,61280.26,13275.09
Long Island,Suffolk,5123000,000885,Long Island Community Hospital,30 to 49,117,F,White,Not Span/Hispanic,1,Emergency,Left Against Medical Advice,2020,INJ022,"POISONING BY DRUGS, INITIAL ENCOUNTER",,,812,POISONING OF MEDICINAL AGENTS,21,"INJURIES, POISONINGS AND TOXIC EFFECTS OF DRUGS",3,Major,Moderate,Medical,Medicare,Medicare,,,,Y,16337.57,2202.32
Long Island,Suffolk,5123000,000885,Long Island Community Hospital,50 to 69,117,M,White,Not Span/Hispanic,9,Emergency,Home or Self Care,2020,INJ022,"POISONING BY DRUGS, INITIAL ENCOUNTER",ADM006,INFUSION OF VASOPRESSOR,812,POISONING OF MEDICINAL AGENTS,21,"INJURIES, POISONINGS AND TOXIC EFFECTS OF DRUGS",4,Extreme,Extreme,Medical,Medicare,Blue Cross/Blue Shield,,,,Y,137427.85,23181.13
Long Island,Suffolk,5123000,000885,Long Island Community Hospital,70 or Older,117,F,White,Not Span/Hispanic,5,Emergency,Home w/ Home Health Services,2020,INJ022,"POISONING BY DRUGS, INITIAL ENCOUNTER",URN006,BLADDER CATHETERIZATION AND DRAINAGE,812,POISONING OF MEDICINAL AGENTS,21,"INJURIES, POISONINGS AND TOXIC EFFECTS OF DRUGS",3,Major,Major,Medical,Medicare,Medicare,Blue Cross/Blue Shield,,,Y,44528.57,7486.46
Long Island,Suffolk,5123000,000885,Long Island Community Hospital,50 to 69,119,F,White,Not Span/Hispanic,2,Emergency,Home or Self Care,2020,INJ022,"POISONING BY DRUGS, INITIAL ENCOUNTER",,,812,POISONING OF MEDICINAL AGENTS,21,"INJURIES, POISONINGS AND TOXIC EFFECTS OF DRUGS",3,Major,Major,Medical,Private Health Insurance,Medicaid,,,,Y,32184.79,6482.21
Long Island,Suffolk,5123000,000885,Long Island Community Hospital,50 to 69,117,M,White,Not Span/Hispanic,31,Emergency,Skilled Nursing Home,2020,INJ022,"POISONING BY DRUGS, INITIAL ENCOUNTER",ADM006,INFUSION OF VASOPRESSOR,812,POISONING OF MEDICINAL AGENTS,21,"INJURIES, POISONINGS AND TOXIC EFFECTS OF DRUGS",4,Extreme,Extreme,Medical,Medicare,,,,,Y,407326.94,67533.37
Long Island,Suffolk,5123000,000885,Long Island Community Hospital,30 to 49,119,M,White,Not Span/Hispanic,6,Emergency,Expired,2020,INJ022,"POISONING BY DRUGS, INITIAL ENCOUNTER",CAR024,VENOUS AND ARTERIAL CATHETER PLACEMENT,812,POISONING OF MEDICINAL AGENTS,21,"INJURIES, POISONINGS AND TOXIC EFFECTS OF DRUGS",4,Extreme,Extreme,Medical,Medicare,Medicare,Medicaid,,,Y,84072.41,16482.78
Long Island,Suffolk,5123000,000885,Long Island Community Hospital,50 to 69,117,F,White,Not Span/Hispanic,3,Emergency,Home or Self Care,2020,INJ022,"POISONING BY DRUGS, INITIAL ENCOUNTER",MAM005,MEASUREMENT DURING CARDIAC CATHETERIZATION,812,POISONING OF MEDICINAL AGENTS,21,"INJURIES, POISONINGS AND TOXIC EFFECTS OF DRUGS",4,Extreme,Extreme,Medical,Blue Cross/Blue Shield,Medicare,Medicare,,,Y,66557.16,9323.83
Long Island,Suffolk,5123000,000885,Long Island Community Hospital,50 to 69,119,M,White,Not Span/Hispanic,4,Emergency,Home or Self Care,2020,INJ022,"POISONING BY DRUGS, INITIAL ENCOUNTER",ADM001,TRANSFUSION OF BLOOD AND BLOOD PRODUCTS,812,POISONING OF MEDICINAL AGENTS,21,"INJURIES, POISONINGS AND TOXIC EFFECTS OF DRUGS",3,Major,Major,Medical,Private Health Insurance,Medicaid,,,,Y,56827.46,7751.49
Long Island,Suffolk,5123000,000885,Long Island Community Hospital,50 to 69,119,F,White,Not Span/Hispanic,2,Emergency,Home or Self Care,2020,INJ022,"POISONING BY DRUGS, INITIAL ENCOUNTER",,,812,POISONING OF MEDICINAL AGENTS,21,"INJURIES, POISONINGS AND TOXIC EFFECTS OF DRUGS",3,Major,Moderate,Medical,Medicare,Medicare,Blue Cross/Blue Shield,,,Y,20454.59,3356.06
Long Island,Suffolk,5123000,000885,Long Island Community Hospital,50 to 69,117,M,Black/African American,Not Span/Hispanic,3,Emergency,Home or Self Care,2020,INJ022,"POISONING BY DRUGS, INITIAL ENCOUNTER",CAR024,VENOUS AND ARTERIAL CATHETER PLACEMENT,812,POISONING OF MEDICINAL AGENTS,21,"INJURIES, POISONINGS AND TOXIC EFFECTS OF DRUGS",3,Major,Major,Medical,Private Health Insurance,Medicaid,,,,Y,50215.15,9277.77
Long Island,Suffolk,5123000,000885,Long Island Community Hospital,30 to 49,117,F,White,Not Span/Hispanic,6,Emergency,Home or Self Care,2020,INJ022,"POISONING BY DRUGS, INITIAL ENCOUNTER",HEP010,HEPATOBILIARY AND PANCREATIC DRAINAGE,812,POISONING OF MEDICINAL AGENTS,21,"INJURIES, POISONINGS AND TOXIC EFFECTS OF DRUGS",3,Major,Moderate,Medical,Self-Pay,,,,,Y,72768.05,9918.38
Long Island,Suffolk,5123000,000885,Long Island Community Hospital,70 or Older,117,F,White,Not Span/Hispanic,5,Emergency,Skilled Nursing Home,2020,INJ022,"POISONING BY DRUGS, INITIAL ENCOUNTER",OTR004,ISOLATION PROCEDURES,812,POISONING OF MEDICINAL AGENTS,21,"INJURIES, POISONINGS AND TOXIC EFFECTS OF DRUGS",2,Moderate,Moderate,Medical,Medicare,Medicare,Medicaid,,,Y,33148.94,6988.13
Long Island,Suffolk,5123000,000885,Long Island Community Hospital,30 to 49,117,M,White,Not Span/Hispanic,2,Emergency,Home or Self Care,2020,INJ022,"POISONING BY DRUGS, INITIAL ENCOUNTER",OTR004,ISOLATION PROCEDURES,812,POISONING OF MEDICINAL AGENTS,21,"INJURIES, POISONINGS AND TOXIC EFFECTS OF DRUGS",4,Extreme,Extreme,Medical,Blue Cross/Blue Shield,,,,,Y,42847.49,8549.9
Long Island,Suffolk,5123000,000885,Long Island Community Hospital,30 to 49,117,M,Black/African American,Not Span/Hispanic,5,Emergency,Court/Law Enforcement,2020,INJ022,"POISONING BY DRUGS, INITIAL ENCOUNTER",PLC001,IMMOBILIZATION BY SPLINT OR OTHER EXTERNAL DEVICE,812,POISONING OF MEDICINAL AGENTS,21,"INJURIES, POISONINGS AND TOXIC EFFECTS OF DRUGS",3,Major,Major,Medical,Private Health Insurance,Medicaid,,,,Y,40076.33,7974.98
Long Island,Suffolk,5123000,000885,Long Island Community Hospital,18 to 29,119,M,Black/African American,Not Span/Hispanic,2,Emergency,Left Against Medical Advice,2020,INJ022,"POISONING BY DRUGS, INITIAL ENCOUNTER",SUD002,PHARMACOTHERAPY FOR SUBSTANCE USE,812,POISONING OF MEDICINAL AGENTS,21,"INJURIES, POISONINGS AND TOXIC EFFECTS OF DRUGS",3,Major,Moderate,Medical,Medicaid,,,,,Y,25173.35,4878.54
Long Island,Suffolk,5123000,000885,Long Island Community Hospital,18 to 29,117,M,Black/African American,Not Span/Hispanic,2,Emergency,Left Against Medical Advice,2020,INJ022,"POISONING BY DRUGS, INITIAL ENCOUNTER",,,812,POISONING OF MEDICINAL AGENTS,21,"INJURIES, POISONINGS AND TOXIC EFFECTS OF DRUGS",2,Moderate,Moderate,Medical,Private Health Insurance,Medicaid,,,,Y,24966.57,4663.86
Long Island,Suffolk,5123000,000885,Long Island Community Hospital,30 to 49,117,M,White,Not Span/Hispanic,1,Emergency,Left Against Medical Advice,2020,INJ022,"POISONING BY DRUGS, INITIAL ENCOUNTER",,,812,POISONING OF MEDICINAL AGENTS,21,"INJURIES, POISONINGS AND TOXIC EFFECTS OF DRUGS",1,Minor,Minor,Medical,Private Health Insurance,Medicaid,,,,Y,8247.71,1652.01
Long Island,Suffolk,5123000,000885,Long Island Community Hospital,30 to 49,117,M,White,Not Span/Hispanic,1,Emergency,Left Against Medical Advice,2020,INJ022,"POISONING BY DRUGS, INITIAL ENCOUNTER",SUD001,SUBSTANCE USE DETOXIFICATION,812,POISONING OF MEDICINAL AGENTS,21,"INJURIES, POISONINGS AND TOXIC EFFECTS OF DRUGS",1,Minor,Minor,Medical,Private Health Insurance,Medicaid,,,,Y,13468.75,1887.23
Long Island,Suffolk,5123000,000885,Long Island Community Hospital,50 to 69,117,M,White,Not Span/Hispanic,5,Emergency,Expired,2020,INJ022,"POISONING BY DRUGS, INITIAL ENCOUNTER",ADM006,INFUSION OF VASOPRESSOR,812,POISONING OF MEDICINAL AGENTS,21,"INJURIES, POISONINGS AND TOXIC EFFECTS OF DRUGS",4,Extreme,Extreme,Medical,Medicare,Medicaid,,,,Y,77277.59,19221.11
Long Island,Suffolk,5123000,000885,Long Island Community Hospital,50 to 69,119,M,White,Not Span/Hispanic,3,Emergency,Home or Self Care,2020,INJ022,"POISONING BY DRUGS, INITIAL ENCOUNTER",OTR004,ISOLATION PROCEDURES,812,POISONING OF MEDICINAL AGENTS,21,"INJURIES, POISONINGS AND TOXIC EFFECTS OF DRUGS",3,Major,Major,Medical,Medicare,,,,,Y,52288.98,5264.52
Long Island,Suffolk,5123000,000885,Long Island Community Hospital,50 to 69,117,M,White,Not Span/Hispanic,2,Emergency,Home w/ Home Health Services,2020,INJ022,"POISONING BY DRUGS, INITIAL ENCOUNTER",OTR004,ISOLATION PROCEDURES,812,POISONING OF MEDICINAL AGENTS,21,"INJURIES, POISONINGS AND TOXIC EFFECTS OF DRUGS",2,Moderate,Moderate,Medical,Medicare,,,,,Y,33816.78,4093.74
Long Island,Suffolk,5123000,000885,Long Island Community Hospital,30 to 49,119,F,White,Not Span/Hispanic,2,Emergency,Short-term Hospital,2020,INJ022,"POISONING BY DRUGS, INITIAL ENCOUNTER",,,812,POISONING OF MEDICINAL AGENTS,21,"INJURIES, POISONINGS AND TOXIC EFFECTS OF DRUGS",3,Major,Moderate,Medical,Private Health Insurance,,,,,Y,28132.39,4652.63
Long Island,Suffolk,5123000,000885,Long Island Community Hospital,30 to 49,119,F,White,Not Span/Hispanic,1,Emergency,Left Against Medical Advice,2020,INJ022,"POISONING BY DRUGS, INITIAL ENCOUNTER",ESA005,CARDIAC CHEST COMPRESSION,812,POISONING OF MEDICINAL AGENTS,21,"INJURIES, POISONINGS AND TOXIC EFFECTS OF DRUGS",3,Major,Extreme,Medical,Self-Pay,,,,,Y,13514.21,2037.63
Long Island,Suffolk,5123000,000885,Long Island Community Hospital,30 to 49,119,M,Black/African American,Not Span/Hispanic,21,Emergency,Home or Self Care,2020,INJ022,"POISONING BY DRUGS, INITIAL ENCOUNTER",,,812,POISONING OF MEDICINAL AGENTS,21,"INJURIES, POISONINGS AND TOXIC EFFECTS OF DRUGS",3,Major,Major,Medical,Medicare,Medicare,Medicaid,,,Y,116582.17,26567.5
Long Island,Suffolk,5123000,000885,Long Island Community Hospital,18 to 29,119,M,White,Not Span/Hispanic,1,Emergency,Home or Self Care,2020,INJ022,"POISONING BY DRUGS, INITIAL ENCOUNTER",SUD001,SUBSTANCE USE DETOXIFICATION,812,POISONING OF MEDICINAL AGENTS,21,"INJURIES, POISONINGS AND TOXIC EFFECTS OF DRUGS",2,Moderate,Moderate,Medical,Blue Cross/Blue Shield,,,,,Y,17664.94,1928.58
Long Island,Suffolk,5123000,000885,Long Island Community Hospital,70 or Older,117,M,Other Race,Not Span/Hispanic,1,Emergency,Left Against Medical Advice,2020,INJ022,"POISONING BY DRUGS, INITIAL ENCOUNTER",SUD001,SUBSTANCE USE DETOXIFICATION,812,POISONING OF MEDICINAL AGENTS,21,"INJURIES, POISONINGS AND TOXIC EFFECTS OF DRUGS",3,Major,Moderate,Medical,Self-Pay,,,,,Y,16838.84,2057.87
Long Island,Suffolk,5123000,000885,Long Island Community Hospital,70 or Older,117,M,Black/African American,Not Span/Hispanic,5,Emergency,Home or Self Care,2020,INJ022,"POISONING BY DRUGS, INITIAL ENCOUNTER",,,812,POISONING OF MEDICINAL AGENTS,21,"INJURIES, POISONINGS AND TOXIC EFFECTS OF DRUGS",2,Moderate,Major,Medical,Medicare,,,,,Y,48295.18,7750.06
Long Island,Suffolk,5123000,000885,Long Island Community Hospital,70 or Older,117,F,Black/African American,Not Span/Hispanic,10,Emergency,Skilled Nursing Home,2020,INJ022,"POISONING BY DRUGS, INITIAL ENCOUNTER",ADM004,TRANSFUSION OF CLOTTING FACTORS,812,POISONING OF MEDICINAL AGENTS,21,"INJURIES, POISONINGS AND TOXIC EFFECTS OF DRUGS",3,Major,Major,Medical,Medicare,Medicare,Private Health Insurance,,,Y,180526.49,32455.03
Long Island,Suffolk,5123000,000885,Long Island Community Hospital,50 to 69,117,F,Black/African American,Not Span/Hispanic,2,Emergency,Home or Self Care,2020,INJ022,"POISONING BY DRUGS, INITIAL ENCOUNTER",,,812,POISONING OF MEDICINAL AGENTS,21,"INJURIES, POISONINGS AND TOXIC EFFECTS OF DRUGS",3,Major,Major,Medical,Medicare,,,,,Y,23733.25,3611.22
Long Island,Suffolk,5123000,000885,Long Island Community Hospital,18 to 29,117,F,Other Race,Not Span/Hispanic,1,Emergency,Home or Self Care,2020,INJ022,"POISONING BY DRUGS, INITIAL ENCOUNTER",,,812,POISONING OF MEDICINAL AGENTS,21,"INJURIES, POISONINGS AND TOXIC EFFECTS OF DRUGS",1,Minor,Minor,Medical,Private Health Insurance,Medicaid,,,,Y,28538.93,3223.48
Long Island,Suffolk,5123000,000885,Long Island Community Hospital,30 to 49,117,M,White,Not Span/Hispanic,1,Emergency,Home or Self Care,2020,INJ022,"POISONING BY DRUGS, INITIAL ENCOUNTER",SUD002,PHARMACOTHERAPY FOR SUBSTANCE USE,812,POISONING OF MEDICINAL AGENTS,21,"INJURIES, POISONINGS AND TOXIC EFFECTS OF DRUGS",4,Extreme,Extreme,Medical,Medicare,Medicare,Medicaid,,,Y,27278.87,2187.91
Long Island,Suffolk,5123000,000885,Long Island Community Hospital,30 to 49,117,M,White,Not Span/Hispanic,1,Emergency,Left Against Medical Advice,2020,INJ022,"POISONING BY DRUGS, INITIAL ENCOUNTER",,,812,POISONING OF MEDICINAL AGENTS,21,"INJURIES, POISONINGS AND TOXIC EFFECTS OF DRUGS",1,Minor,Minor,Medical,Private Health Insurance,Medicaid,,,,Y,8087.8,1666.08
Long Island,Suffolk,5123000,000885,Long Island Community Hospital,50 to 69,119,F,White,Not Span/Hispanic,2,Emergency,Home or Self Care,2020,INJ022,"POISONING BY DRUGS, INITIAL ENCOUNTER",SUD002,PHARMACOTHERAPY FOR SUBSTANCE USE,812,POISONING OF MEDICINAL AGENTS,21,"INJURIES, POISONINGS AND TOXIC EFFECTS OF DRUGS",3,Major,Moderate,Medical,Blue Cross/Blue Shield,,,,,Y,16276.24,3245.61
Long Island,Suffolk,5123000,000885,Long Island Community Hospital,50 to 69,117,M,White,Not Span/Hispanic,2,Emergency,Home or Self Care,2020,INJ022,"POISONING BY DRUGS, INITIAL ENCOUNTER",OTR004,ISOLATION PROCEDURES,812,POISONING OF MEDICINAL AGENTS,21,"INJURIES, POISONINGS AND TOXIC EFFECTS OF DRUGS",3,Major,Major,Medical,Blue Cross/Blue Shield,,,,,Y,58567.5,5501
Long Island,Suffolk,5123000,000885,Long Island Community Hospital,30 to 49,119,M,White,Not Span/Hispanic,1,Emergency,Home or Self Care,2020,INJ022,"POISONING BY DRUGS, INITIAL ENCOUNTER",,,812,POISONING OF MEDICINAL AGENTS,21,"INJURIES, POISONINGS AND TOXIC EFFECTS OF DRUGS",2,Moderate,Moderate,Medical,Blue Cross/Blue Shield,Medicare,,,,Y,36317.14,3359.38
Long Island,Suffolk,5123000,000885,Long Island Community Hospital,30 to 49,117,F,White,Not Span/Hispanic,9,Emergency,Expired,2020,INJ022,"POISONING BY DRUGS, INITIAL ENCOUNTER",ESA003,MECHANICAL VENTILATION,812,POISONING OF MEDICINAL AGENTS,21,"INJURIES, POISONINGS AND TOXIC EFFECTS OF DRUGS",4,Extreme,Extreme,Medical,Private Health Insurance,Medicaid,,,,Y,230461.31,33088.06
Long Island,Suffolk,5123000,000885,Long Island Community Hospital,18 to 29,117,M,White,Not Span/Hispanic,3,Emergency,Home or Self Care,2020,INJ022,"POISONING BY DRUGS, INITIAL ENCOUNTER",,,812,POISONING OF MEDICINAL AGENTS,21,"INJURIES, POISONINGS AND TOXIC EFFECTS OF DRUGS",3,Major,Minor,Medical,Private Health Insurance,Medicaid,,,,Y,28900.99,5260.84
Long Island,Suffolk,5123000,000885,Long Island Community Hospital,30 to 49,119,F,White,Not Span/Hispanic,3,Emergency,Home or Self Care,2020,INJ022,"POISONING BY DRUGS, INITIAL ENCOUNTER",OTR004,ISOLATION PROCEDURES,812,POISONING OF MEDICINAL AGENTS,21,"INJURIES, POISONINGS AND TOXIC EFFECTS OF DRUGS",4,Extreme,Extreme,Medical,Private Health Insurance,,,,,Y,28639.95,6296.62
Long Island,Suffolk,5123000,000885,Long Island Community Hospital,50 to 69,119,F,White,Not Span/Hispanic,17,Emergency,Home w/ Home Health Services,2020,INJ022,"POISONING BY DRUGS, INITIAL ENCOUNTER",RES007,AIRWAY INTUBATION,812,POISONING OF MEDICINAL AGENTS,21,"INJURIES, POISONINGS AND TOXIC EFFECTS OF DRUGS",4,Extreme,Extreme,Medical,Medicare,,,,,Y,258035.29,52937.08
Long Island,Suffolk,5123000,000885,Long Island Community Hospital,30 to 49,117,M,White,Not Span/Hispanic,3,Emergency,Left Against Medical Advice,2020,INJ022,"POISONING BY DRUGS, INITIAL ENCOUNTER",,,812,POISONING OF MEDICINAL AGENTS,21,"INJURIES, POISONINGS AND TOXIC EFFECTS OF DRUGS",4,Extreme,Extreme,Medical,Private Health Insurance,,,,,Y,86095.54,14367.92
Long Island,Suffolk,5123000,000885,Long Island Community Hospital,30 to 49,117,M,White,Not Span/Hispanic,6,Emergency,Psychiatric Hospital or Unit of Hosp,2020,INJ022,"POISONING BY DRUGS, INITIAL ENCOUNTER",RES007,AIRWAY INTUBATION,812,POISONING OF MEDICINAL AGENTS,21,"INJURIES, POISONINGS AND TOXIC EFFECTS OF DRUGS",3,Major,Major,Medical,Medicare,Medicare,,,,Y,80454.3,18272.38
Long Island,Suffolk,5123000,000885,Long Island Community Hospital,18 to 29,117,M,White,Not Span/Hispanic,1,Emergency,Home or Self Care,2020,INJ022,"POISONING BY DRUGS, INITIAL ENCOUNTER",,,812,POISONING OF MEDICINAL AGENTS,21,"INJURIES, POISONINGS AND TOXIC EFFECTS OF DRUGS",4,Extreme,Extreme,Medical,Blue Cross/Blue Shield,,,,,Y,18704.59,4315.89