Hospital Service Area,Hospital County,Operating Certificate Number,Permanent Facility Id,Facility Name,Age Group,Zip Code - 3 digits,Gender,Race,Ethnicity,Length of Stay,Type of Admission,Patient Disposition,Discharge Year,CCS Diagnosis Code,CCS Diagnosis Description,CCS Procedure Code,CCS Procedure Description,APR DRG Code,APR DRG Description,APR MDC Code,APR MDC Description,APR Severity of Illness Code,APR Severity of Illness Description,APR Risk of Mortality,APR Medical Surgical Description,Payment Typology 1,Payment Typology 2,Payment Typology 3,Birth Weight,Abortion Edit Indicator,Emergency Department Indicator,Total Charges,Total Costs
New York City,Manhattan,7002001,001438,Bellevue Hospital Center,30 to 49,117,F,White,Not Span/Hispanic,35,Emergency,Psychiatric Hospital or Unit of Hosp,2017,244,Other injuries and conditions due to external causes,231,OTHER THERAPEUTIC PRCS,815,"Other injury, poisoning & toxic effect diagnoses",21,"Poisonings, Toxic Effects, Other Injuries and Other Complications of Treatment",4,Extreme,Moderate,Medical,Medicaid,Medicaid,,,N,Y,174318.20,112391.31
New York City,Manhattan,7002001,001438,Bellevue Hospital Center,30 to 49,100,M,Other Race,Spanish/Hispanic,3,Emergency,Home or Self Care,2017,244,Other injuries and conditions due to external causes,231,OTHER THERAPEUTIC PRCS,815,"Other injury, poisoning & toxic effect diagnoses",21,"Poisonings, Toxic Effects, Other Injuries and Other Complications of Treatment",2,Moderate,Moderate,Medical,Medicaid,,,,N,Y,19395.29,12505.07
New York City,Manhattan,7002001,001438,Bellevue Hospital Center,0 to 17,112,M,White,Not Span/Hispanic,1,Emergency,Home or Self Care,2017,244,Other injuries and conditions due to external causes,000,NO PROC,815,"Other injury, poisoning & toxic effect diagnoses",21,"Poisonings, Toxic Effects, Other Injuries and Other Complications of Treatment",1,Minor,Minor,Medical,Medicaid,Medicaid,,,N,Y,7357.11,4743.48
New York City,Manhattan,7002001,001438,Bellevue Hospital Center,30 to 49,100,F,White,Not Span/Hispanic,2,Emergency,Home or Self Care,2017,244,Other injuries and conditions due to external causes,222,BLOOD TRANSFUSION,815,"Other injury, poisoning & toxic effect diagnoses",21,"Poisonings, Toxic Effects, Other Injuries and Other Complications of Treatment",1,Minor,Minor,Medical,Self-Pay,,,,N,Y,14021.51,9040.34
New York City,Manhattan,7002001,001438,Bellevue Hospital Center,50 to 69,105,M,White,Not Span/Hispanic,3,Emergency,Home or Self Care,2017,244,Other injuries and conditions due to external causes,000,NO PROC,815,"Other injury, poisoning & toxic effect diagnoses",21,"Poisonings, Toxic Effects, Other Injuries and Other Complications of Treatment",3,Major,Moderate,Medical,Medicare,,,,N,Y,25284.65,16302.23
New York City,Manhattan,7002001,001438,Bellevue Hospital Center,30 to 49,100,M,Other Race,Not Span/Hispanic,8,Emergency,Psychiatric Hospital or Unit of Hosp,2017,244,Other injuries and conditions due to external causes,222,BLOOD TRANSFUSION,815,"Other injury, poisoning & toxic effect diagnoses",21,"Poisonings, Toxic Effects, Other Injuries and Other Complications of Treatment",2,Moderate,Minor,Medical,Medicaid,,,,N,Y,42888.14,27652.04
New York City,Manhattan,7002001,001438,Bellevue Hospital Center,50 to 69,104,M,White,Not Span/Hispanic,3,Emergency,Left Against Medical Advice,2017,244,Other injuries and conditions due to external causes,222,BLOOD TRANSFUSION,815,"Other injury, poisoning & toxic effect diagnoses",21,"Poisonings, Toxic Effects, Other Injuries and Other Complications of Treatment",3,Major,Moderate,Medical,Medicaid,,,,N,Y,23502.23,15153.02
New York City,Manhattan,7002001,001438,Bellevue Hospital Center,50 to 69,100,M,Black/African American,Not Span/Hispanic,7,Emergency,Home or Self Care,2017,244,Other injuries and conditions due to external causes,000,NO PROC,815,"Other injury, poisoning & toxic effect diagnoses",21,"Poisonings, Toxic Effects, Other Injuries and Other Complications of Treatment",3,Major,Major,Medical,Medicaid,Medicaid,,,N,Y,37592.37,24237.61
