Hospital Service Area,Hospital County,Operating Certificate Number,Permanent Facility Id,Facility Name,Age Group,Zip Code - 3 digits,Gender,Race,Ethnicity,Length of Stay,Type of Admission,Patient Disposition,Discharge Year,CCS Diagnosis Code,CCS Diagnosis Description,CCS Procedure Code,CCS Procedure Description,APR DRG Code,APR DRG Description,APR MDC Code,APR MDC Description,APR Severity of Illness Code,APR Severity of Illness Description,APR Risk of Mortality,APR Medical Surgical Description,Payment Typology 1,Payment Typology 2,Payment Typology 3,Birth Weight,Abortion Edit Indicator,Emergency Department Indicator,Total Charges,Total Costs
New York City,Manhattan,7002002,001439,Mount Sinai Beth Israel,50 to 69,100,M,Other Race,Unknown,2,Urgent,Home or Self Care,2020,INJ021,"EFFECT OF OTHER EXTERNAL CAUSES, INITIAL ENCOUNTER",ADM015,ADMINISTRATION OF ANTIBIOTICS,815,"OTHER INJURY, POISONING & TOXIC EFFECT DIAGNOSES",21,"INJURIES, POISONINGS AND TOXIC EFFECTS OF DRUGS",1,Minor,Minor,Medical,Medicare,Medicaid,Self-Pay,,,N,19001.72,4511.28
Hudson Valley,Westchester,5901000,001039,NewYork-Presbyterian/Hudson Valley Hospital,70 or Older,105,M,Other Race,Spanish/Hispanic,5,Emergency,Skilled Nursing Home,2020,INJ021,"EFFECT OF OTHER EXTERNAL CAUSES, INITIAL ENCOUNTER",ADM021,"ADMINISTRATION OF THERAPEUTIC SUBSTANCES, NEC",815,"OTHER INJURY, POISONING & TOXIC EFFECT DIAGNOSES",21,"INJURIES, POISONINGS AND TOXIC EFFECTS OF DRUGS",2,Moderate,Major,Medical,Medicare,,,,,Y,38360.04,20953.53
New York City,Bronx,7000006,001169,Montefiore Medical Center - Henry & Lucy Moses Div,70 or Older,104,M,Other Race,Spanish/Hispanic,1,Emergency,Home or Self Care,2020,FAC003,"ENCOUNTER FOR OBSERVATION AND EXAMINATION FOR CONDITIONS RULED OUT (EXCLUDES INFECTIOUS DISEASE, NEOPLASM, MENTAL DISORDERS)",,,815,"OTHER INJURY, POISONING & TOXIC EFFECT DIAGNOSES",21,"INJURIES, POISONINGS AND TOXIC EFFECTS OF DRUGS",3,Major,Major,Medical,Medicare,,,,,Y,26110.86,3700.51
New York City,Manhattan,7002054,001464,New York-Presbyterian Hospital - Columbia Presbyterian Center,50 to 69,100,F,White,Not Span/Hispanic,13,Emergency,Home w/ Home Health Services,2020,INJ032,MALTREATMENT/ABUSE,,,815,"OTHER INJURY, POISONING & TOXIC EFFECT DIAGNOSES",21,"INJURIES, POISONINGS AND TOXIC EFFECTS OF DRUGS",3,Major,Major,Medical,Medicare,Self-Pay,,,,Y,144917.61,33711.59
New York City,Queens,7003010,001637,New York - Presbyterian/Queens,70 or Older,,M,Black/African American,Spanish/Hispanic,7,Emergency,Skilled Nursing Home,2020,INJ021,"EFFECT OF OTHER EXTERNAL CAUSES, INITIAL ENCOUNTER",ADM015,ADMINISTRATION OF ANTIBIOTICS,815,"OTHER INJURY, POISONING & TOXIC EFFECT DIAGNOSES",21,"INJURIES, POISONINGS AND TOXIC EFFECTS OF DRUGS",2,Moderate,Major,Medical,Medicare,Medicare,Blue Cross/Blue Shield,,,Y,58303.28,14511.86
New York City,Manhattan,7002054,001437,New York-Presbyterian/Lower Manhattan Hospital,50 to 69,100,M,Black/African American,Not Span/Hispanic,2,Emergency,Home or Self Care,2020,INJ021,"EFFECT OF OTHER EXTERNAL CAUSES, INITIAL ENCOUNTER",ADM021,"ADMINISTRATION OF THERAPEUTIC SUBSTANCES, NEC",815,"OTHER INJURY, POISONING & TOXIC EFFECT DIAGNOSES",21,"INJURIES, POISONINGS AND TOXIC EFFECTS OF DRUGS",3,Major,Extreme,Medical,"Managed Care, Unspecified",Medicaid,Self-Pay,,,Y,33542.34,6799.22
Western NY,Erie,1401005,000210,Erie County Medical Center,30 to 49,OOS,F,White,Not Span/Hispanic,6,Emergency,Home or Self Care,2020,INJ032,MALTREATMENT/ABUSE,ESA003,MECHANICAL VENTILATION,815,"OTHER INJURY, POISONING & TOXIC EFFECT DIAGNOSES",21,"INJURIES, POISONINGS AND TOXIC EFFECTS OF DRUGS",2,Moderate,Major,Medical,Self-Pay,,,,,Y,52890.19,19885.82
Finger Lakes,Monroe,2701005,000413,Strong Memorial Hospital,0 to 17,146,F,Black/African American,Not Span/Hispanic,1,Emergency,Home or Self Care,2020,INJ032,MALTREATMENT/ABUSE,SKB008,SKIN EXCISION AND DEBRIDEMENT,815,"OTHER INJURY, POISONING & TOXIC EFFECT DIAGNOSES",21,"INJURIES, POISONINGS AND TOXIC EFFECTS OF DRUGS",1,Minor,Minor,Medical,Medicaid,,,,,Y,4116,1698.39
Finger Lakes,Monroe,2701005,000413,Strong Memorial Hospital,50 to 69,146,M,Black/African American,Not Span/Hispanic,6,Emergency,Home w/ Home Health Services,2020,INJ021,"EFFECT OF OTHER EXTERNAL CAUSES, INITIAL ENCOUNTER",,,815,"OTHER INJURY, POISONING & TOXIC EFFECT DIAGNOSES",21,"INJURIES, POISONINGS AND TOXIC EFFECTS OF DRUGS",2,Moderate,Moderate,Medical,Medicaid,,,,,Y,17678.09,8678.37
Finger Lakes,Monroe,2701005,000413,Strong Memorial Hospital,50 to 69,146,M,White,Not Span/Hispanic,8,Emergency,Home w/ Home Health Services,2020,INJ021,"EFFECT OF OTHER EXTERNAL CAUSES, INITIAL ENCOUNTER",,,815,"OTHER INJURY, POISONING & TOXIC EFFECT DIAGNOSES",21,"INJURIES, POISONINGS AND TOXIC EFFECTS OF DRUGS",2,Moderate,Minor,Medical,Medicaid,,,,,Y,37586.07,22459.06
Capital/Adirond,Albany,0101000,000001,Albany Medical Center Hospital,0 to 17,120,F,White,Not Span/Hispanic,18,Emergency,Home or Self Care,2020,INJ032,MALTREATMENT/ABUSE,ESA003,MECHANICAL VENTILATION,815,"OTHER INJURY, POISONING & TOXIC EFFECT DIAGNOSES",21,"INJURIES, POISONINGS AND TOXIC EFFECTS OF DRUGS",4,Extreme,Extreme,Medical,"Managed Care, Unspecified",,,,,Y,121766.45,41600.84
Capital/Adirond,Albany,0101000,000001,Albany Medical Center Hospital,70 or Older,124,M,White,Not Span/Hispanic,13,Emergency,Home or Self Care,2020,INJ021,"EFFECT OF OTHER EXTERNAL CAUSES, INITIAL ENCOUNTER",,,815,"OTHER INJURY, POISONING & TOXIC EFFECT DIAGNOSES",21,"INJURIES, POISONINGS AND TOXIC EFFECTS OF DRUGS",3,Major,Moderate,Medical,Medicare,Blue Cross/Blue Shield,,,,Y,59182,19780.7
New York City,Bronx,7000006,003058,Montefiore Med Center - Jack D Weiler Hosp of A Einstein College Div,70 or Older,104,M,White,Not Span/Hispanic,5,Emergency,Skilled Nursing Home,2020,INJ021,"EFFECT OF OTHER EXTERNAL CAUSES, INITIAL ENCOUNTER",,,815,"OTHER INJURY, POISONING & TOXIC EFFECT DIAGNOSES",21,"INJURIES, POISONINGS AND TOXIC EFFECTS OF DRUGS",3,Major,Major,Medical,Medicare,Medicaid,,,,Y,74478.65,12994.71
Capital/Adirond,Albany,0101000,000001,Albany Medical Center Hospital,0 to 17,122,F,Other Race,Not Span/Hispanic,2,Emergency,Home or Self Care,2020,PNL013,OTHER SPECIFIED AND UNSPECIFIED PERINATAL CONDITIONS,CNS002,LUMBAR PUNCTURE,815,"OTHER INJURY, POISONING & TOXIC EFFECT DIAGNOSES",21,"INJURIES, POISONINGS AND TOXIC EFFECTS OF DRUGS",2,Moderate,Minor,Medical,Medicaid,,,03500,,Y,15229.04,4089.68
Capital/Adirond,Albany,0101000,000001,Albany Medical Center Hospital,0 to 17,124,F,Black/African American,Not Span/Hispanic,9,Emergency,Home or Self Care,2020,INJ032,MALTREATMENT/ABUSE,ADM001,TRANSFUSION OF BLOOD AND BLOOD PRODUCTS,815,"OTHER INJURY, POISONING & TOXIC EFFECT DIAGNOSES",21,"INJURIES, POISONINGS AND TOXIC EFFECTS OF DRUGS",2,Moderate,Moderate,Medical,Medicaid,,,,,Y,58329.91,16406.25
Capital/Adirond,Albany,0101000,000001,Albany Medical Center Hospital,70 or Older,121,M,White,Not Span/Hispanic,5,Trauma,Expired,2020,INJ021,"EFFECT OF OTHER EXTERNAL CAUSES, INITIAL ENCOUNTER",CAR024,VENOUS AND ARTERIAL CATHETER PLACEMENT,815,"OTHER INJURY, POISONING & TOXIC EFFECT DIAGNOSES",21,"INJURIES, POISONINGS AND TOXIC EFFECTS OF DRUGS",4,Extreme,Extreme,Medical,Medicare,,,,,Y,82911.35,19142.31
Capital/Adirond,Albany,0101000,000001,Albany Medical Center Hospital,18 to 29,122,M,White,Not Span/Hispanic,7,Urgent,Psychiatric Hospital or Unit of Hosp,2020,INJ021,"EFFECT OF OTHER EXTERNAL CAUSES, INITIAL ENCOUNTER",,,815,"OTHER INJURY, POISONING & TOXIC EFFECT DIAGNOSES",21,"INJURIES, POISONINGS AND TOXIC EFFECTS OF DRUGS",1,Minor,Minor,Medical,Medicare,Medicaid,,,,N,23851.76,9206.72
New York City,Manhattan,7002002,001439,Mount Sinai Beth Israel,50 to 69,OOS,F,Other Race,Unknown,4,Emergency,Home or Self Care,2020,INJ021,"EFFECT OF OTHER EXTERNAL CAUSES, INITIAL ENCOUNTER",ADM021,"ADMINISTRATION OF THERAPEUTIC SUBSTANCES, NEC",815,"OTHER INJURY, POISONING & TOXIC EFFECT DIAGNOSES",21,"INJURIES, POISONINGS AND TOXIC EFFECTS OF DRUGS",2,Moderate,Moderate,Medical,Medicare,Self-Pay,,,,N,42167.52,9817.23
New York City,Bronx,7000006,001169,Montefiore Medical Center - Henry & Lucy Moses Div,30 to 49,104,M,Black/African American,Not Span/Hispanic,1,Emergency,Home or Self Care,2020,INJ021,"EFFECT OF OTHER EXTERNAL CAUSES, INITIAL ENCOUNTER",,,815,"OTHER INJURY, POISONING & TOXIC EFFECT DIAGNOSES",21,"INJURIES, POISONINGS AND TOXIC EFFECTS OF DRUGS",2,Moderate,Major,Medical,Medicaid,,,,,Y,21207.26,3321.11
Western NY,Erie,1401014,000208,John R. Oishei Children's Hospital,0 to 17,142,M,Other Race,Spanish/Hispanic,1,Emergency,Home or Self Care,2020,INJ032,MALTREATMENT/ABUSE,,,815,"OTHER INJURY, POISONING & TOXIC EFFECT DIAGNOSES",21,"INJURIES, POISONINGS AND TOXIC EFFECTS OF DRUGS",1,Minor,Minor,Medical,Medicaid,Self-Pay,,,,Y,6822.14,3593.12
New York City,Manhattan,7002053,001463,NYU Langone Hospitals,70 or Older,100,M,White,Not Span/Hispanic,2,Emergency,Home or Self Care,2020,INJ032,MALTREATMENT/ABUSE,,,815,"OTHER INJURY, POISONING & TOXIC EFFECT DIAGNOSES",21,"INJURIES, POISONINGS AND TOXIC EFFECTS OF DRUGS",2,Moderate,Moderate,Medical,Medicare,Medicare,,,,Y,49435.34,13897.47
Capital/Adirond,Otsego,3824000,000746,Mary Imogene Bassett Hospital,70 or Older,OOS,F,White,Not Span/Hispanic,1,Emergency,Home or Self Care,2020,FAC003,"ENCOUNTER FOR OBSERVATION AND EXAMINATION FOR CONDITIONS RULED OUT (EXCLUDES INFECTIOUS DISEASE, NEOPLASM, MENTAL DISORDERS)",,,815,"OTHER INJURY, POISONING & TOXIC EFFECT DIAGNOSES",21,"INJURIES, POISONINGS AND TOXIC EFFECTS OF DRUGS",1,Minor,Minor,Medical,Medicare,Private Health Insurance,,,,Y,12692.34,6023.93
Finger Lakes,Monroe,2701003,000411,Rochester General Hospital,70 or Older,146,M,White,Not Span/Hispanic,2,Emergency,Home or Self Care,2020,INJ021,"EFFECT OF OTHER EXTERNAL CAUSES, INITIAL ENCOUNTER",,,815,"OTHER INJURY, POISONING & TOXIC EFFECT DIAGNOSES",21,"INJURIES, POISONINGS AND TOXIC EFFECTS OF DRUGS",2,Moderate,Moderate,Medical,Medicare,,,,,Y,8649.19,3280.57
New York City,Manhattan,7002032,001466,Mount Sinai West,50 to 69,100,F,Other Race,Not Span/Hispanic,3,Emergency,Home or Self Care,2020,INJ021,"EFFECT OF OTHER EXTERNAL CAUSES, INITIAL ENCOUNTER",ADM017,ADMINISTRATION OF NUTRITIONAL AND ELECTROLYTIC SUBSTANCES,815,"OTHER INJURY, POISONING & TOXIC EFFECT DIAGNOSES",21,"INJURIES, POISONINGS AND TOXIC EFFECTS OF DRUGS",3,Major,Minor,Medical,Medicaid,Self-Pay,,,,N,33803.33,6866.16
New York City,Manhattan,7002032,001466,Mount Sinai West,50 to 69,100,F,White,Not Span/Hispanic,6,Emergency,Home w/ Home Health Services,2020,INJ021,"EFFECT OF OTHER EXTERNAL CAUSES, INITIAL ENCOUNTER",IMG008,ULTRASONOGRAPHY,815,"OTHER INJURY, POISONING & TOXIC EFFECT DIAGNOSES",21,"INJURIES, POISONINGS AND TOXIC EFFECTS OF DRUGS",3,Major,Moderate,Medical,Medicare,Medicaid,Self-Pay,,,Y,75257.88,17242.86
Capital/Adirond,Albany,0101000,000001,Albany Medical Center Hospital,70 or Older,122,M,White,Not Span/Hispanic,10,Emergency,Skilled Nursing Home,2020,INJ021,"EFFECT OF OTHER EXTERNAL CAUSES, INITIAL ENCOUNTER",,,815,"OTHER INJURY, POISONING & TOXIC EFFECT DIAGNOSES",21,"INJURIES, POISONINGS AND TOXIC EFFECTS OF DRUGS",3,Major,Extreme,Medical,Medicare,Private Health Insurance,,,,Y,90951.61,22167.74
Capital/Adirond,Albany,0101000,000001,Albany Medical Center Hospital,0 to 17,120,M,White,Not Span/Hispanic,4,Emergency,Home or Self Care,2020,INJ032,MALTREATMENT/ABUSE,,,815,"OTHER INJURY, POISONING & TOXIC EFFECT DIAGNOSES",21,"INJURIES, POISONINGS AND TOXIC EFFECTS OF DRUGS",3,Major,Moderate,Medical,"Managed Care, Unspecified",,,,,Y,28450.94,7584.77
Hudson Valley,Westchester,5903001,001061,Montefiore Mount Vernon Hospital,70 or Older,105,M,Black/African American,Unknown,2,Emergency,Home or Self Care,2020,INJ021,"EFFECT OF OTHER EXTERNAL CAUSES, INITIAL ENCOUNTER",,,815,"OTHER INJURY, POISONING & TOXIC EFFECT DIAGNOSES",21,"INJURIES, POISONINGS AND TOXIC EFFECTS OF DRUGS",2,Moderate,Minor,Medical,Medicare,Medicare,Medicaid,,,Y,20779.65,7001.8
Capital/Adirond,Albany,0101000,000001,Albany Medical Center Hospital,0 to 17,121,M,Black/African American,Not Span/Hispanic,1,Emergency,Home or Self Care,2020,FAC003,"ENCOUNTER FOR OBSERVATION AND EXAMINATION FOR CONDITIONS RULED OUT (EXCLUDES INFECTIOUS DISEASE, NEOPLASM, MENTAL DISORDERS)",,,815,"OTHER INJURY, POISONING & TOXIC EFFECT DIAGNOSES",21,"INJURIES, POISONINGS AND TOXIC EFFECTS OF DRUGS",1,Minor,Minor,Medical,"Managed Care, Unspecified",,,,,Y,10758.48,2454.05
Capital/Adirond,Albany,0101000,000001,Albany Medical Center Hospital,0 to 17,133,M,White,Not Span/Hispanic,3,Trauma,Home or Self Care,2020,INJ021,"EFFECT OF OTHER EXTERNAL CAUSES, INITIAL ENCOUNTER",,,815,"OTHER INJURY, POISONING & TOXIC EFFECT DIAGNOSES",21,"INJURIES, POISONINGS AND TOXIC EFFECTS OF DRUGS",1,Minor,Minor,Medical,"Managed Care, Unspecified",,,,,Y,15477,4341.05
Capital/Adirond,Albany,0101000,000001,Albany Medical Center Hospital,0 to 17,121,M,White,Not Span/Hispanic,2,Emergency,Home or Self Care,2020,PNL013,OTHER SPECIFIED AND UNSPECIFIED PERINATAL CONDITIONS,CNS002,LUMBAR PUNCTURE,815,"OTHER INJURY, POISONING & TOXIC EFFECT DIAGNOSES",21,"INJURIES, POISONINGS AND TOXIC EFFECTS OF DRUGS",2,Moderate,Minor,Medical,"Managed Care, Unspecified",,,02400,,N,12370.8,3044.39
Capital/Adirond,Albany,0101000,000001,Albany Medical Center Hospital,50 to 69,128,F,White,Not Span/Hispanic,10,Emergency,Home or Self Care,2020,INJ021,"EFFECT OF OTHER EXTERNAL CAUSES, INITIAL ENCOUNTER",ESA003,MECHANICAL VENTILATION,815,"OTHER INJURY, POISONING & TOXIC EFFECT DIAGNOSES",21,"INJURIES, POISONINGS AND TOXIC EFFECTS OF DRUGS",4,Extreme,Extreme,Medical,"Managed Care, Unspecified",,,,,Y,141447.1,35312.63
Capital/Adirond,Albany,0101000,000001,Albany Medical Center Hospital,0 to 17,122,F,White,Not Span/Hispanic,1,Emergency,Home or Self Care,2020,INJ032,MALTREATMENT/ABUSE,,,815,"OTHER INJURY, POISONING & TOXIC EFFECT DIAGNOSES",21,"INJURIES, POISONINGS AND TOXIC EFFECTS OF DRUGS",1,Minor,Minor,Medical,"Managed Care, Unspecified",,,,,Y,8959.73,2218.89
New York City,Richmond,7004003,001740,Staten Island University Hosp-North,50 to 69,103,F,Black/African American,Not Span/Hispanic,1,Emergency,Home or Self Care,2020,INJ021,"EFFECT OF OTHER EXTERNAL CAUSES, INITIAL ENCOUNTER",,,815,"OTHER INJURY, POISONING & TOXIC EFFECT DIAGNOSES",21,"INJURIES, POISONINGS AND TOXIC EFFECTS OF DRUGS",1,Minor,Minor,Medical,Miscellaneous/Other,Private Health Insurance,,,,Y,13469.16,3469.23
New York City,Richmond,7004003,001740,Staten Island University Hosp-North,30 to 49,103,M,White,Not Span/Hispanic,1,Emergency,Left Against Medical Advice,2020,INJ021,"EFFECT OF OTHER EXTERNAL CAUSES, INITIAL ENCOUNTER",,,815,"OTHER INJURY, POISONING & TOXIC EFFECT DIAGNOSES",21,"INJURIES, POISONINGS AND TOXIC EFFECTS OF DRUGS",1,Minor,Minor,Medical,Miscellaneous/Other,,,,,Y,18315.16,4199.75
New York City,Richmond,7004003,001740,Staten Island University Hosp-North,0 to 17,103,F,White,Not Span/Hispanic,3,Emergency,Home or Self Care,2020,INJ032,MALTREATMENT/ABUSE,,,815,"OTHER INJURY, POISONING & TOXIC EFFECT DIAGNOSES",21,"INJURIES, POISONINGS AND TOXIC EFFECTS OF DRUGS",2,Moderate,Minor,Medical,Medicaid,,,,,Y,16307,15244.43
New York City,Richmond,7004003,001740,Staten Island University Hosp-North,18 to 29,103,M,White,Not Span/Hispanic,1,Emergency,Home or Self Care,2020,FAC003,"ENCOUNTER FOR OBSERVATION AND EXAMINATION FOR CONDITIONS RULED OUT (EXCLUDES INFECTIOUS DISEASE, NEOPLASM, MENTAL DISORDERS)",,,815,"OTHER INJURY, POISONING & TOXIC EFFECT DIAGNOSES",21,"INJURIES, POISONINGS AND TOXIC EFFECTS OF DRUGS",1,Minor,Minor,Medical,Miscellaneous/Other,Blue Cross/Blue Shield,,,,Y,11729.25,2395.35
Western NY,Erie,1401005,000210,Erie County Medical Center,70 or Older,142,F,Black/African American,Not Span/Hispanic,17,Emergency,Skilled Nursing Home,2020,INJ032,MALTREATMENT/ABUSE,,,815,"OTHER INJURY, POISONING & TOXIC EFFECT DIAGNOSES",21,"INJURIES, POISONINGS AND TOXIC EFFECTS OF DRUGS",3,Major,Moderate,Medical,Medicare,Medicaid,,,,Y,49254.48,29402.25
New York City,Manhattan,7002024,001456,Mount Sinai Hospital,0 to 17,112,M,Black/African American,Not Span/Hispanic,3,Emergency,Home or Self Care,2020,INJ032,MALTREATMENT/ABUSE,IMG007,COMPUTERIZED TOMOGRAPHY (CT) WITHOUT CONTRAST,815,"OTHER INJURY, POISONING & TOXIC EFFECT DIAGNOSES",21,"INJURIES, POISONINGS AND TOXIC EFFECTS OF DRUGS",3,Major,Minor,Medical,Medicaid,Medicaid,Self-Pay,,,Y,47683.52,10916.97
New York City,Queens,7003004,001638,Long Island Jewish Forest Hills,18 to 29,112,F,Other Race,Spanish/Hispanic,1,Emergency,Home or Self Care,2020,FAC003,"ENCOUNTER FOR OBSERVATION AND EXAMINATION FOR CONDITIONS RULED OUT (EXCLUDES INFECTIOUS DISEASE, NEOPLASM, MENTAL DISORDERS)",PGN001,FETAL HEART RATE MONITORING,815,"OTHER INJURY, POISONING & TOXIC EFFECT DIAGNOSES",21,"INJURIES, POISONINGS AND TOXIC EFFECTS OF DRUGS",1,Minor,Minor,Medical,Blue Cross/Blue Shield,,,,,N,12875,3561.25
New York City,Queens,7003004,001638,Long Island Jewish Forest Hills,70 or Older,113,M,White,Not Span/Hispanic,5,Emergency,Home w/ Home Health Services,2020,INJ076,"COMPLICATION, SEQUELA",CAR024,VENOUS AND ARTERIAL CATHETER PLACEMENT,815,"OTHER INJURY, POISONING & TOXIC EFFECT DIAGNOSES",21,"INJURIES, POISONINGS AND TOXIC EFFECTS OF DRUGS",2,Moderate,Minor,Medical,Medicare,Medicare,,,,Y,54636.4,9339.45
New York City,Queens,7003004,001638,Long Island Jewish Forest Hills,50 to 69,113,M,White,Not Span/Hispanic,1,Emergency,Left Against Medical Advice,2020,INJ021,"EFFECT OF OTHER EXTERNAL CAUSES, INITIAL ENCOUNTER",,,815,"OTHER INJURY, POISONING & TOXIC EFFECT DIAGNOSES",21,"INJURIES, POISONINGS AND TOXIC EFFECTS OF DRUGS",2,Moderate,Moderate,Medical,Medicare,Medicare,,,,Y,24001.51,2805.66
New York City,Kings,7001003,001288,Brooklyn Hospital Center - Downtown Campus,50 to 69,112,F,White,Not Span/Hispanic,1,Emergency,Home or Self Care,2020,FAC003,"ENCOUNTER FOR OBSERVATION AND EXAMINATION FOR CONDITIONS RULED OUT (EXCLUDES INFECTIOUS DISEASE, NEOPLASM, MENTAL DISORDERS)",,,815,"OTHER INJURY, POISONING & TOXIC EFFECT DIAGNOSES",21,"INJURIES, POISONINGS AND TOXIC EFFECTS OF DRUGS",1,Minor,Minor,Medical,Medicaid,Medicaid,Self-Pay,,,Y,17949.93,3219.26
New York City,Kings,7002053,001304,NYU Langone Hospital-Brooklyn,70 or Older,112,M,Other Race,Unknown,12,Emergency,Facility w/ Custodial/Supportive Care,2020,INJ032,MALTREATMENT/ABUSE,ADM018,IRRIGATION (DIAGNOSTIC AND THERAPEUTIC),815,"OTHER INJURY, POISONING & TOXIC EFFECT DIAGNOSES",21,"INJURIES, POISONINGS AND TOXIC EFFECTS OF DRUGS",3,Major,Major,Medical,Medicare,,,,,Y,113372.62,43386.44
New York City,Kings,7002053,001304,NYU Langone Hospital-Brooklyn,70 or Older,112,F,Other Race,Not Span/Hispanic,3,Emergency,Skilled Nursing Home,2020,INJ032,MALTREATMENT/ABUSE,,,815,"OTHER INJURY, POISONING & TOXIC EFFECT DIAGNOSES",21,"INJURIES, POISONINGS AND TOXIC EFFECTS OF DRUGS",3,Major,Major,Medical,Medicare,Medicaid,,,,Y,60499.28,12850.05
Finger Lakes,Monroe,2701005,000413,Strong Memorial Hospital,18 to 29,131,M,White,Not Span/Hispanic,2,Emergency,Home or Self Care,2020,INJ021,"EFFECT OF OTHER EXTERNAL CAUSES, INITIAL ENCOUNTER",SKB008,SKIN EXCISION AND DEBRIDEMENT,815,"OTHER INJURY, POISONING & TOXIC EFFECT DIAGNOSES",21,"INJURIES, POISONINGS AND TOXIC EFFECTS OF DRUGS",2,Moderate,Moderate,Medical,Medicaid,,,,,Y,8328.61,3489.89
Central NY,Onondaga,3301007,000635,University Hospital SUNY Health Science Center,0 to 17,131,M,White,Not Span/Hispanic,32,Emergency,Home or Self Care,2020,INJ032,MALTREATMENT/ABUSE,ADM017,ADMINISTRATION OF NUTRITIONAL AND ELECTROLYTIC SUBSTANCES,815,"OTHER INJURY, POISONING & TOXIC EFFECT DIAGNOSES",21,"INJURIES, POISONINGS AND TOXIC EFFECTS OF DRUGS",3,Major,Moderate,Medical,Medicaid,,,,,N,284555.61,84220.54
Central NY,Onondaga,3301007,000635,University Hospital SUNY Health Science Center,70 or Older,130,F,Multi-racial,Not Span/Hispanic,8,Emergency,Inpatient Rehabilitation Facility,2020,INJ021,"EFFECT OF OTHER EXTERNAL CAUSES, INITIAL ENCOUNTER",MAM001,ARTERIAL OXYGEN SATURATION MONITORING,815,"OTHER INJURY, POISONING & TOXIC EFFECT DIAGNOSES",21,"INJURIES, POISONINGS AND TOXIC EFFECTS OF DRUGS",3,Major,Major,Medical,Medicare,Blue Cross/Blue Shield,,,,Y,80516.7,19503.59
Central NY,Onondaga,3301007,000635,University Hospital SUNY Health Science Center,0 to 17,139,F,Other Race,Not Span/Hispanic,1,Emergency,Home or Self Care,2020,INJ032,MALTREATMENT/ABUSE,,,815,"OTHER INJURY, POISONING & TOXIC EFFECT DIAGNOSES",21,"INJURIES, POISONINGS AND TOXIC EFFECTS OF DRUGS",2,Moderate,Minor,Medical,Medicaid,,,,,Y,13666.3,2961.82
Central NY,Onondaga,3301007,000635,University Hospital SUNY Health Science Center,70 or Older,131,M,White,Not Span/Hispanic,5,Emergency,Skilled Nursing Home,2020,INJ021,"EFFECT OF OTHER EXTERNAL CAUSES, INITIAL ENCOUNTER",SKB008,SKIN EXCISION AND DEBRIDEMENT,815,"OTHER INJURY, POISONING & TOXIC EFFECT DIAGNOSES",21,"INJURIES, POISONINGS AND TOXIC EFFECTS OF DRUGS",1,Minor,Minor,Medical,Medicare,Private Health Insurance,,,,N,34834.3,9350.12
Central NY,Onondaga,3301007,000635,University Hospital SUNY Health Science Center,0 to 17,136,M,White,Not Span/Hispanic,20,Emergency,Home or Self Care,2020,INJ032,MALTREATMENT/ABUSE,ADM017,ADMINISTRATION OF NUTRITIONAL AND ELECTROLYTIC SUBSTANCES,815,"OTHER INJURY, POISONING & TOXIC EFFECT DIAGNOSES",21,"INJURIES, POISONINGS AND TOXIC EFFECTS OF DRUGS",2,Moderate,Minor,Medical,Federal/State/Local/VA,Medicaid,,,,N,146214.9,39233.88
Central NY,Onondaga,3301007,000635,University Hospital SUNY Health Science Center,0 to 17,130,M,White,Not Span/Hispanic,1,Emergency,Home or Self Care,2020,INJ032,MALTREATMENT/ABUSE,,,815,"OTHER INJURY, POISONING & TOXIC EFFECT DIAGNOSES",21,"INJURIES, POISONINGS AND TOXIC EFFECTS OF DRUGS",2,Moderate,Moderate,Medical,Medicaid,,,,,Y,10725.1,2804.57
Central NY,Onondaga,3301007,000635,University Hospital SUNY Health Science Center,0 to 17,131,M,White,Not Span/Hispanic,1,Emergency,Home or Self Care,2020,INJ032,MALTREATMENT/ABUSE,,,815,"OTHER INJURY, POISONING & TOXIC EFFECT DIAGNOSES",21,"INJURIES, POISONINGS AND TOXIC EFFECTS OF DRUGS",2,Moderate,Moderate,Medical,Medicaid,,,,,Y,9361.8,2568.98
Central NY,Onondaga,3301007,000635,University Hospital SUNY Health Science Center,0 to 17,130,M,White,Not Span/Hispanic,1,Emergency,Home or Self Care,2020,INJ032,MALTREATMENT/ABUSE,,,815,"OTHER INJURY, POISONING & TOXIC EFFECT DIAGNOSES",21,"INJURIES, POISONINGS AND TOXIC EFFECTS OF DRUGS",1,Minor,Minor,Medical,Medicaid,,,,,Y,9308.8,2560.9
Central NY,Onondaga,3301007,000635,University Hospital SUNY Health Science Center,0 to 17,130,M,Multi-racial,Not Span/Hispanic,1,Emergency,Home or Self Care,2020,INJ032,MALTREATMENT/ABUSE,,,815,"OTHER INJURY, POISONING & TOXIC EFFECT DIAGNOSES",21,"INJURIES, POISONINGS AND TOXIC EFFECTS OF DRUGS",2,Moderate,Minor,Medical,Medicaid,,,,,Y,9442.8,2581.34
Central NY,Onondaga,3301007,000635,University Hospital SUNY Health Science Center,30 to 49,130,M,White,Not Span/Hispanic,5,Emergency,Home or Self Care,2020,INJ021,"EFFECT OF OTHER EXTERNAL CAUSES, INITIAL ENCOUNTER",,,815,"OTHER INJURY, POISONING & TOXIC EFFECT DIAGNOSES",21,"INJURIES, POISONINGS AND TOXIC EFFECTS OF DRUGS",2,Moderate,Moderate,Medical,Medicaid,,,,,Y,30628.3,8339.35
Central NY,Onondaga,3301007,000635,University Hospital SUNY Health Science Center,0 to 17,130,M,White,Not Span/Hispanic,1,Emergency,Home or Self Care,2020,PNL013,OTHER SPECIFIED AND UNSPECIFIED PERINATAL CONDITIONS,CNS002,LUMBAR PUNCTURE,815,"OTHER INJURY, POISONING & TOXIC EFFECT DIAGNOSES",21,"INJURIES, POISONINGS AND TOXIC EFFECTS OF DRUGS",1,Minor,Minor,Medical,Self-Pay,,,03400,,Y,13487,3840.57
Central NY,Onondaga,3301007,000635,University Hospital SUNY Health Science Center,0 to 17,131,M,White,Not Span/Hispanic,13,Emergency,Home w/ Home Health Services,2020,INJ032,MALTREATMENT/ABUSE,MAM011,ELECTROENCEPHALOGRAM (EEG),815,"OTHER INJURY, POISONING & TOXIC EFFECT DIAGNOSES",21,"INJURIES, POISONINGS AND TOXIC EFFECTS OF DRUGS",3,Major,Moderate,Medical,Medicaid,,,,,Y,140381.01,33625.87