Hospital Service Area,Hospital County,Operating Certificate Number,Permanent Facility Id,Facility Name,Age Group,Zip Code - 3 digits,Gender,Race,Ethnicity,Length of Stay,Type of Admission,Patient Disposition,Discharge Year,CCS Diagnosis Code,CCS Diagnosis Description,CCS Procedure Code,CCS Procedure Description,APR DRG Code,APR DRG Description,APR MDC Code,APR MDC Description,APR Severity of Illness Code,APR Severity of Illness Description,APR Risk of Mortality,APR Medical Surgical Description,Payment Typology 1,Payment Typology 2,Payment Typology 3,Birth Weight,Abortion Edit Indicator,Emergency Department Indicator,Total Charges,Total Costs
Long Island,Nassau,2908000,000511,NYU Langone Hospital-Long Island,0 to 17,110,M,White,Not Span/Hispanic,1,Emergency,Home or Self Care,2020,INJ032,MALTREATMENT/ABUSE,,,815,"OTHER INJURY, POISONING & TOXIC EFFECT DIAGNOSES",21,"INJURIES, POISONINGS AND TOXIC EFFECTS OF DRUGS",2,Moderate,Minor,Medical,Blue Cross/Blue Shield,,,,,Y,11410.2,3844.47
Long Island,Nassau,2908000,000511,NYU Langone Hospital-Long Island,70 or Older,115,M,Black/African American,Not Span/Hispanic,3,Emergency,Skilled Nursing Home,2020,INJ021,"EFFECT OF OTHER EXTERNAL CAUSES, INITIAL ENCOUNTER",,,815,"OTHER INJURY, POISONING & TOXIC EFFECT DIAGNOSES",21,"INJURIES, POISONINGS AND TOXIC EFFECTS OF DRUGS",2,Moderate,Major,Medical,Medicare,Blue Cross/Blue Shield,,,,Y,64854.28,14824.65
Long Island,Nassau,2908000,000511,NYU Langone Hospital-Long Island,0 to 17,110,F,White,Not Span/Hispanic,1,Emergency,Home or Self Care,2020,INJ032,MALTREATMENT/ABUSE,,,815,"OTHER INJURY, POISONING & TOXIC EFFECT DIAGNOSES",21,"INJURIES, POISONINGS AND TOXIC EFFECTS OF DRUGS",2,Moderate,Minor,Medical,Blue Cross/Blue Shield,,,,,Y,11410.2,3844.47
Long Island,Nassau,2908000,000511,NYU Langone Hospital-Long Island,0 to 17,110,M,Black/African American,Not Span/Hispanic,1,Emergency,Home or Self Care,2020,FAC003,"ENCOUNTER FOR OBSERVATION AND EXAMINATION FOR CONDITIONS RULED OUT (EXCLUDES INFECTIOUS DISEASE, NEOPLASM, MENTAL DISORDERS)",,,815,"OTHER INJURY, POISONING & TOXIC EFFECT DIAGNOSES",21,"INJURIES, POISONINGS AND TOXIC EFFECTS OF DRUGS",1,Minor,Minor,Medical,Miscellaneous/Other,Medicaid,,,,Y,12491.59,2967.19
Long Island,Nassau,2908000,000511,NYU Langone Hospital-Long Island,30 to 49,111,F,Other Race,Spanish/Hispanic,1,Elective,Home or Self Care,2020,FAC003,"ENCOUNTER FOR OBSERVATION AND EXAMINATION FOR CONDITIONS RULED OUT (EXCLUDES INFECTIOUS DISEASE, NEOPLASM, MENTAL DISORDERS)",PGN001,FETAL HEART RATE MONITORING,815,"OTHER INJURY, POISONING & TOXIC EFFECT DIAGNOSES",21,"INJURIES, POISONINGS AND TOXIC EFFECTS OF DRUGS",1,Minor,Minor,Medical,Private Health Insurance,,,,,N,27894.61,6456.08
Long Island,Nassau,2908000,000511,NYU Langone Hospital-Long Island,50 to 69,117,M,White,Not Span/Hispanic,1,Trauma,Home or Self Care,2020,INJ021,"EFFECT OF OTHER EXTERNAL CAUSES, INITIAL ENCOUNTER",,,815,"OTHER INJURY, POISONING & TOXIC EFFECT DIAGNOSES",21,"INJURIES, POISONINGS AND TOXIC EFFECTS OF DRUGS",1,Minor,Minor,Medical,Miscellaneous/Other,Blue Cross/Blue Shield,,,,Y,42316.23,9312.96
Long Island,Nassau,2908000,000511,NYU Langone Hospital-Long Island,30 to 49,117,M,White,Not Span/Hispanic,1,Trauma,Home or Self Care,2020,INJ021,"EFFECT OF OTHER EXTERNAL CAUSES, INITIAL ENCOUNTER",,,815,"OTHER INJURY, POISONING & TOXIC EFFECT DIAGNOSES",21,"INJURIES, POISONINGS AND TOXIC EFFECTS OF DRUGS",1,Minor,Minor,Medical,Miscellaneous/Other,,,,,Y,32605.01,7728.99
Long Island,Nassau,2908000,000511,NYU Langone Hospital-Long Island,0 to 17,115,F,Other Race,Spanish/Hispanic,6,Emergency,Home or Self Care,2020,INJ032,MALTREATMENT/ABUSE,,,815,"OTHER INJURY, POISONING & TOXIC EFFECT DIAGNOSES",21,"INJURIES, POISONINGS AND TOXIC EFFECTS OF DRUGS",1,Minor,Minor,Medical,Medicaid,,,,,Y,58512.72,17813.32
Long Island,Nassau,2908000,000511,NYU Langone Hospital-Long Island,0 to 17,115,M,Black/African American,Not Span/Hispanic,2,Emergency,Home or Self Care,2020,PNL013,OTHER SPECIFIED AND UNSPECIFIED PERINATAL CONDITIONS,CNS002,LUMBAR PUNCTURE,815,"OTHER INJURY, POISONING & TOXIC EFFECT DIAGNOSES",21,"INJURIES, POISONINGS AND TOXIC EFFECTS OF DRUGS",2,Moderate,Minor,Medical,Medicaid,,,02900,,Y,30284.92,7267.52
Long Island,Nassau,2908000,000511,NYU Langone Hospital-Long Island,18 to 29,115,F,White,Not Span/Hispanic,6,Emergency,Left Against Medical Advice,2020,INJ021,"EFFECT OF OTHER EXTERNAL CAUSES, INITIAL ENCOUNTER",MAM015,"MEASUREMENT AND MONITORING, NEC",815,"OTHER INJURY, POISONING & TOXIC EFFECT DIAGNOSES",21,"INJURIES, POISONINGS AND TOXIC EFFECTS OF DRUGS",3,Major,Moderate,Medical,Blue Cross/Blue Shield,,,,,Y,144532.61,35297.45
Long Island,Nassau,2908000,000511,NYU Langone Hospital-Long Island,30 to 49,115,F,Black/African American,Not Span/Hispanic,3,Emergency,Home or Self Care,2020,INJ032,MALTREATMENT/ABUSE,RES007,AIRWAY INTUBATION,815,"OTHER INJURY, POISONING & TOXIC EFFECT DIAGNOSES",21,"INJURIES, POISONINGS AND TOXIC EFFECTS OF DRUGS",4,Extreme,Extreme,Medical,Medicaid,,,,,Y,86441.75,23590.61
